5-alpha reductase deficiency
preferred label: Deficiencia de 5-alfa reductasa @es
alternative label: 5-ARD
comment: People with 5-alpha reductase deficiency, abbreviated as 5-ARD, have XY chromosomes, testes, and typical levels of testosterone, but their bodies do not have the enzyme responsible for converting testosterone to the more powerful androgen dihydrotestosterone (DHT). This affects how an individual's external sex characteristics develop, and people born with 5-ARD often have genital differences that are noticed at birth. In adolescence, people with 5-ARD typically develop some features associated with testosterone puberty, and they may experience genital growth at this point.
comment: Las personas con deficiencia de 5-alfa reductasa, abreviada como 5-ARD, tienen cromosomas XY, testículos y niveles típicos de testosterona, pero sus cuerpos no tienen la enzima responsable de convertir la testosterona en el andrógeno más potente dihidrotestosterona (DHT). Esto afecta el desarrollo de las características sexuales externas de la persona, y las personas que nacen con 5-ARD suelen presentar diferencias genitales que se notan al nacer. En la adolescencia, las personas con 5-ARD suelen desarrollar algunos rasgos asociados a la pubertad testosterona, y pueden experimentar crecimiento genital en dicho momento. @es
broader: Intersex variations
has top concept: Sex (Body)
replaces: 5AlphaReductaseDeficiency
issued: 2019-05-14
modified: 2025-02-23
type: Concept
in scheme: v3
change note: Version 4.1.0

Aboriginal Australian LGBTQ+ people
preferred label: Personas LGBTQ+ aborígenes australianas @es
alternative label: Aboriginal people (LGBTQ)
alternative label: Aboriginal Australian people (LGBTQ)
alternative label: LGBTQ+ Aboriginal Australian people
alternative label: LGBTQ+ Aboriginal Australians
alternative label: LGBTQ+ Aboriginal people
alternative label: LGBTQ+ Aboriginals
alternative label: Personas aborígenes australianas (LGBTQ) @es
alternative label: Personas aborígenes (LGBTQ) @es
alternative label: Aborígenes australianos LGBTQ+ @es
alternative label: Aborígenes LGBTQ+ @es
alternative label: Personas aborígenes australianas LGBTQ+ @es
comment: LGBTQ+ people who belong to one or more of the various Indigenous peoples of Australia; do not use to refer to the Indigenous people of the Torres Strait Islands, who are considered ethnically and culturally distinct. Only use to describe people who identify as Aboriginal Australian.
comment: Personas LGBTQ+ que pertenecen a uno o más de los diversos pueblos indígenas de Australia; no para referirse a los pueblos indígenas de las Islas del Estrecho de Torres, que se consideran étnica y culturalmente distintos. Utilícese únicamente para describir a las personas que se autoidentifiquen como aborígenes australianos. @es
broader: Indigenous LGBTQ+ people
narrower: Aboriginal Australian lesbians
narrower: Aboriginal Australian gay men
narrower: Aboriginal Australian bisexual people
narrower: Aboriginal Australian transgender people
narrower: Aboriginal Australian queer people
narrower: Aboriginal Australian intersex people
narrower: Aboriginal Australian asexual people
narrower: Aboriginal Australian non-binary people
related: Sistergirls
related: Indigiqueer people
related: Indigiqueer
has top concept: LGBTQ+ people
replaces: LGBTQAboriginalPeople
issued: 2019-05-14
modified: 2025-02-23
type: Concept
in scheme: v3
change note: Version 4.1.0

Acault
comment: A commonly mistranslated Burmese term for people assigned male at birth who exhibit feminine behaviors while serving as spiritual mediums; there is some question over the legitimacy of term.
comment: Un término birmano, comúnmente mal traducido, para personas asignadas al sexo masculino al nacer que exhiben comportamientos femeninos mientras sirven como médiums espirituales; existen dudas sobre la legitimidad del término. @es
broader: Non-Euro-American gender and sexual identities
has top concept: Gender
replaces: acault
issued: 2019-05-14
modified: 2025-02-23
type: Concept
in scheme: v3
change note: Version 4.1.0

Asexuality
preferred label: Asexualidad @es
alternative label: Ace
comment: A sexual orientation generally characterized by a lack of sexual attraction or desire.
comment: Orientación sexual caracterizada generalmente por la falta de atracción o deseo sexual. @es
broader: Sexual orientation
related: Aromantic people
related: Asexual people
related: LGBTQ+
related: LGBTQIA
related: Sexual abstinence
related: Virginity
related: Compulsory sexuality
related: Aromanticism
has top concept: Sexual orientation
replaces: asexuality
issued: 2019-05-14
modified: 2025-02-23
type: Concept
in scheme: v3
change note: Version 4.1.0

HIV/AIDS
preferred label: VIH/SIDA @es
alternative label: Acquired immune deficiency syndrome
alternative label: AIDS
alternative label: Acquired immunodeficiency syndrome
alternative label: HIV
alternative label: Human immunodeficiency virus
alternative label: SIDA @es
alternative label: Síndrome de inmunodeficiencia adquirida @es
alternative label: VIH @es
alternative label: Virus de inmunodeficiencia humana @es
comment: Abbreviation for human immunodeficiency virus (HIV) and acquired immunodeficiency syndrome (AIDS).
comment: Abreviación para el virus de inmunodeficiencia humana (VIH) y síndrome de inmunodeficiencia adquirida (SIDA). @es
broader: STDs
narrower: ARC (AIDS-Related Complex)
narrower: GRID (Gay-Related Immune Deficiency)
related: AIDS activists
related: AIDS awareness
related: AIDS information centers
related: AIDS education
related: AIDS memorial quilts
related: AIDS memorials
related: AIDS organizations
related: AIDS periodicals
related: AIDS phobia
related: Red ribbons (AIDS)
related: LGBTQ+ peer support
related: HIV tests
related: HIV-negative people
related: HIV-positive people
related: Seroconversion
related: Serostatus
related: HIV-undetectable people
related: Kaposi's sarcoma
related: Passive immune therapy
related: HAART (Highly Active Antiretroviral Therapy)
related: Bugchasing
related: PEP (HIV)
has top concept: STDs
replaces: HIVAIDS
issued: 2019-05-14
modified: 2025-03-20
type: Concept
in scheme: v3
change note: Version 4.1.0

LGBTQ+ activism
preferred label: Activismo LGBTQ+ @es
alternative label: Activism (LGBTQ)
alternative label: Activismo LGBTQ @es
alternative label: Activismo (LGBTQ) @es
comment: Direct action and organizing to achieve political or social change and acceptance for LGBTQ+ people.
comment: Acción directa y organización para lograr cambio político o social y la aceptación de las personas LGBTQ+. @es
narrower: Bisexual activism
narrower: Gay activism
narrower: Lesbian activism
narrower: LGBTQ+ direct action
narrower: Queer activism
narrower: Transgender activism
narrower: Intersex activism
narrower: Asexual activism
related: LGBTQ+ political activists
related: Allies
related: Gay shame
related: Leather and kink activism
related: Performative LGBTQ+ activism by police
related: Two-Spirit activism
related: LGBTQ+ solidarity
related: LGBTQ+ philanthropy
replaces: activismLGBTQ
issued: 2019-05-14
modified: 2026-02-23
type: Concept
in scheme: v3
change note: Version 4.1.0

LGBTQ+ political activists
preferred label: Activistas LGBTQ+ @es
alternative label: Political activists (LGBTQ)
alternative label: Activists (LGBTQ)
alternative label: LGBTQ+ activists
alternative label: Activistas (LGBTQ) @es
alternative label: Activistas políticos (LGBTQ) @es
comment: LGBTQ+ people working to bring about political or social change through public organizing.
comment: Personas LGBTQ+ que se organizan o hacen campaña por objetivos y cambios sociales, culturales, políticos o económicos. @es
broader: LGBTQ+ people
narrower: AIDS activists
narrower: Bisexual political activists
narrower: Gay political activists
narrower: Lesbian political activists
narrower: Queer political activists
narrower: Transgender political activists
narrower: Asexual political activists
narrower: Intersex political activists
related: LGBTQ+ activism
related: Zaps
related: Two-Spirit political activists
has top concept: LGBTQ+ people
replaces: activistsLGBTQ
issued: 2019-05-14
modified: 2026-02-23
type: Concept
in scheme: v3
change note: Version 4.1.0

LGBTQ+ actors
preferred label: Actores LGBTQ+ @es
alternative label: Actors (LGBTQ)
alternative label: Actresses (LGBTQ)
alternative label: LGBTQ actors
alternative label: Actores LGBTQ @es
alternative label: Actores (LGBTQ) @es
comment: LGBTQ+ people who act in stage plays, movies, television shows, broadcasts, or other productions.
comment: Personas LGBTQ+ que actúan en obras de teatro, películas, programas de televisión, transmisiones u otras producciones. @es
broader: LGBTQ+ people
narrower: LGBTQ+ porn stars
related: LGBTQ+ arts
related: Actorfic
has top concept: LGBTQ+ people
replaces: LGBTQActors
issued: 2019-05-14
modified: 2025-02-23
type: Concept
in scheme: v3
change note: Version 4.1.0

Adoptive parenthood
preferred label: Maternidad adoptiva / Paternidad adoptiva @es
alternative label: Maternidad adoptiva @es
alternative label: Paternidad adoptiva @es
comment: The experience of being an adoptive parent to a child or children. An adoptive parent is the person or persons who become permanent parents through adoption with all the responsibilities therein.
comment: La experiencia de ser madre adoptiva o padre adoptivo de un(a) niño(a) o niños(as). Es la persona o las personas que se convierten en madres o padres permanentes mediante la adopción con todas las responsabilidades que ello implica. @es
broader: LGBTQ+ parenthood
related: Social parenthood
related: LGBTQ+ adoption
has top concept: LGBTQ+ parenthood
replaces: adoptiveParenthood
issued: 2019-05-14
modified: 2025-02-23
type: Concept
in scheme: v3
change note: Version 4.1.0

Adoptive parents
preferred label: Madres y padres adoptivos @es
alternative label: Padres adoptivos @es
alternative label: Madres adoptivas @es
comment: People who have adopted children, either legally or through a social/cultural practice.
comment: Personas que han adoptado niños, ya sea legalmente o a través de una practica sociocultural. @es
broader: Parents
related: Birth parents
related: Social parenthood
related: LGBTQ+ adoption
related: LGBTQ+ adoptive parents
has top concept: Family members
replaces: adoptiveParents
issued: 2019-05-14
modified: 2025-02-23
type: Concept
in scheme: v3
change note: Version 4.1.0

Sex industry
preferred label: Industria sexual @es
alternative label: Adult entertainment industry
alternative label: Commercial sex
alternative label: Sex trade
alternative label: Industria del entretenimiento adulto @es
comment: Businesses that either directly or indirectly provide sexual services, sex-related products, and/or erotic entertainment.
comment: Empresas que directa o indirectamente ofrecen servicios sexuales, productos relacionados con el sexo y/o entretenimiento erótico. @es
narrower: Sex shops
narrower: Sex cinemas
narrower: Gay saunas
narrower: Peep shows
narrower: Porn industry
narrower: Sex clubs
narrower: Sex tourism
narrower: Sex work
narrower: Erotic massage businesses
narrower: Red light districts
narrower: Pornography
replaces: sexIndustry
issued: 2019-05-14
modified: 2025-02-23
type: Concept
in scheme: v3
change note: Version 4.1.0

Sex shops
preferred label: Tiendas sexuales @es
alternative label: Adult entertainment stores
alternative label: Adult shops
alternative label: Adult stores
alternative label: Erotic shops
alternative label: Erotic stores
alternative label: Porn stores
alternative label: Porn shops
alternative label: Sex stores
alternative label: Adult entertainment shops
alternative label: Tiendas de entretenimiento adulto @es
comment: Retailers that sell products related to sex and sexual entertainment, including sex toys, lingerie, pornography, and other related products.
broader: Sex industry
related: Sex accessories
has top concept: Sex industry
replaces: sexShops
issued: 2019-05-14
modified: 2025-02-23
type: Concept
in scheme: v3
change note: Version 4.1.0

LGBTQ+ porn films
preferred label: Películas porno LGBTQ+ @es
alternative label: Adult films (LGBTQ)
alternative label: Porn videos (LGBTQ)
alternative label: X-rated films (LGBTQ)
alternative label: Porn films (LGBTQ)
alternative label: Películas pornográficas LGBTQ+ @es
comment: Erotic or sexually explicit films featuring LGBTQ+ people.
comment: Películas eróticas o sexualmente explícitas protagonizadas por personas LGBTQ+. @es
broader: LGBTQ+ erotic art
broader: LGBTQ+ pornography
narrower: Bisexual porn films
narrower: Gay porn films
narrower: Lesbian porn films
narrower: Queer porn films
narrower: Transgender porn films
narrower: Demisexual porn films
narrower: Non-binary porn films
related: Sex cinemas
related: LGBTQ+ films
related: Porn industry
related: LGBTQ+ erotic films
related: Two-Spirit porn films
related: Māhū porn films
related: LGBTQ+ porn stars
has top concept: Subcultures
replaces: pornFilmsLGBTQ
issued: 2019-05-14
modified: 2025-02-23
type: Concept
in scheme: v3
change note: Version 4.1.0

Sex cinemas
preferred label: Cines de sexo @es
alternative label: Adult movie theatres
alternative label: Adult cinemas
alternative label: Adult movie theaters
alternative label: Erotic cinemas
alternative label: Erotic theaters
alternative label: Erotic theatres
alternative label: Sex theaters
alternative label: Sex theatres
alternative label: Cines de películas para adultos @es
alternative label: Cines porno @es
comment: Movie theatres that primarily show pornographic films. Patrons engaging in nudity and public masturbation or sex may be explicitly permitted by the theatre or merely tolerated.
comment: Cines que proyectan principalmente películas pornográficas. El teatro puede permitir explícitamente o simplemente tolerar que los espectadores se desnuden o se masturben o practiquen sexo en público. @es
broader: Sex industry
related: LGBTQ+ porn films
has top concept: Sex industry
replaces: sexCinemas
issued: 2019-05-14
modified: 2025-02-23
type: Concept
in scheme: v3
change note: Version 4.1.0

African American LGBTQ+ people
preferred label: Personas LGBTQ+ afroamericanas @es
alternative label: African Americans (LGBTQ)
alternative label: LGBTQ+ African American people
alternative label: LGBTQ+ African Americans
alternative label: Afroamericanos (LGBTQ) @es
alternative label: Afroamericanas (LGBTQ) @es
alternative label: Personas afroamericanas LGBTQ+ @es
alternative label: Afroamericanos LGBTQ+ @es
alternative label: Afroamericanas LGBTQ+ @es
comment: African American people who are also LGBTQ+; do not use for people of color broadly; follow the individual's preference for African American or Black whenever possible.
comment: Personas LGBTQ+ de ascendencia africana nacidas en los Estados Unidos o personas LGBTQ+ nacidas en países africanos que viven o tienen una conexión fuerte con los Estados Unidos. Utilícese para personas que se autoidentifiquen como afroamericanas. @es
broader: Black LGBTQ+ people
narrower: African American bisexual people
narrower: Down-low
narrower: African American gay men
narrower: African American lesbians
narrower: African American queer people
narrower: African American transgender people
narrower: African American asexual people
narrower: African American intersex people
narrower: African American non-binary people
related: Banjees
related: Same-gender-loving
has top concept: LGBTQ+ people
replaces: africanAmericansLGBTQ
issued: 2019-05-14
modified: 2025-04-24
type: Concept
in scheme: v3
change note: Version 4.1.0

Afro-Canadian LGBTQ+ people
preferred label: Personas LGBTQ+ afrocanadienses @es
alternative label: Afro-Canadian people (LGBTQ)
alternative label: Afro-Canadians (LGBTQ)
alternative label: LGBTQ+ Afro-Canadian people
alternative label: LGBTQ+ Afro-Canadians
alternative label: Afrocanadienses LGBTQ+ @es
alternative label: Personas afrocanadienses LGBTQ+ @es
alternative label: Afrocanadienses (LGBTQ) @es
comment: LGBTQ+ people of African descent born in Canada or LGBTQ+ people born in African countries who live in or have a strong connection to Canada; use for individuals who self-identity as Afro-Canadian.
comment: Personas LGBTQ+ de ascendencia africana nacidas en Canadá o personas LGBTQ+ nacidas en países africanos que viven o tienen una conexión fuerte con Canadá. Utilícese para personas que se identifiquen como afrocanadienses. @es
broader: Black LGBTQ+ people
narrower: Afro-Canadian bisexual people
narrower: Afro-Canadian gay men
narrower: Afro-Canadian lesbians
narrower: Afro-Canadian queer people
narrower: Afro-Canadian transgender people
narrower: Afro-Canadian asexual people
narrower: Afro-Canadian intersex people
has top concept: LGBTQ+ people
replaces: afroCanadiansLGBTQ
issued: 2019-05-14
modified: 2025-04-24
type: Concept
in scheme: v3
change note: Version 4.1.0

Afro-Caribbean LGBTQ+ people
preferred label: Personas LGBTQ+ afrocaribeñas @es
alternative label: Afro-Caribbean people (LGBTQ)
alternative label: Afro-Caribbeans (LGBTQ)
alternative label: LGBTQ+ Afro-Caribbean people
alternative label: LGBTQ+ Afro-Caribbeans
alternative label: Afrocaribeños LGBTQ+ @es
alternative label: Personas afrocaribeñas LGBTQ+ @es
alternative label: Afrocaribeños (LGBTQ) @es
alternative label: Afrocaribeñas LGBTQ+ @es
alternative label: Afrocaribeñas (LGBTQ)|| @es
comment: LGBTQ+ people of African descent born in the Caribbean or LGBTQ+ people born in African countries who live in or have a strong connection to the Caribbean. Only use for individuals who self-identify as Afro-Caribbean.
comment: Personas LGBTQ+ afrodescendientes nacidas en el Caribe o personas LGBTQ+ nacidas en países africanos que viven o tienen una conexión fuerte con el Caribe. Utilícese únicamente para personas que se identifiquen como afrocaribeñas. @es
broader: Black LGBTQ+ people
narrower: Afro-Caribbean bisexual people
narrower: Afro-Caribbean gay men
narrower: Afro-Caribbean lesbians
narrower: Afro-Caribbean queer people
narrower: Afro-Caribbean transgender people
narrower: Afro-Caribbean asexual people
narrower: Afro-Caribbean intersex people
has top concept: LGBTQ+ people
replaces: afroCaribbeansLGBTQ
issued: 2019-05-14
modified: 2025-02-23
type: Concept
in scheme: v3
change note: Version 4.1.0

Afro-European LGBTQ+ people
preferred label: Personas LGBTQ+ afroeuropeas @es
alternative label: Afro-European people (LGBTQ)
alternative label: Afro-Europeans (LGBTQ)
alternative label: LGBTQ+ Afro-European people
alternative label: LGBTQ+ Afro-Europeans
alternative label: Afroeuropeos LGBTQ+ @es
alternative label: Personas afroeuropeas LGBTQ+ @es
alternative label: Afroeuropeos (LGBTQ) @es
alternative label: Afroeuropeas LGBTQ+ @es
alternative label: Afroeuropeas (LGBTQ)|| @es
comment: LGBTQ+ people of African descent born in European countries or LGBTQ+ people born in African countries who live in or have a strong connection to Europe. Only use for individuals who self-identify as Afro-European.
comment: Personas LGBTQ+ de ascendencia africana nacidas en países europeos o personas LGBTQ+ nacidas en países africanos que viven en Europa o tienen una fuerte conexión con Europa. Utilícese únicamente para personas que se identifiquen como afroeuropeas. @es
broader: Black LGBTQ+ people
narrower: Afro-European bisexual people
narrower: Afro-European gay men
narrower: Afro-European lesbians
narrower: Afro-European queer people
narrower: Afro-European transgender people
narrower: Afro-European asexual people
narrower: Afro-European intersex people
has top concept: LGBTQ+ people
replaces: afroEuropeansLGBTQ
issued: 2019-05-14
modified: 2025-02-23
type: Concept
in scheme: v3
change note: Version 4.1.0

Afro-Latin American LGBTQ+ people
preferred label: Personas LGBTQ+ afrolatinoamericanas @es
alternative label: Afro-Latin American people (LGBTQ)
alternative label: Afro-Latin Americans (LGBTQ)
alternative label: LGBTQ+ Afro-Latin American people
alternative label: LGBTQ+ Afro-Latin Americans
alternative label: Afrolatinoamericanos LGBTQ+ @es
alternative label: Personas afrolatinoamericanas LGBTQ+ @es
alternative label: Afrolatinoamericanos (LGBTQ) @es
alternative label: Afrolatinoamericanas LGBTQ+ @es
alternative label: Afrolatinoamericanas (LGBTQ)|| @es
comment: LGBTQ+ people of African descent born in Latin American countries or LGBTQ+ people born in African countries who live in or have a strong connection to Latin America. Only use for individuals who self-identify as Afro-Latin American.
comment: Personas LGBTQ+ afrodescendientes nacidas en países latinoamericanos o personas LGBTQ+ nacidas en países africanos que viven o tienen una conexión fuerte con América Latina. Utilícese únicamente para personas que se identifiquen como afrolatinoamericanas. @es
broader: Black LGBTQ+ people
broader: Latino/a/x LGBTQ+ people
narrower: Afro-Latin American bisexual people
narrower: Afro-Latin American gay men
narrower: Afro-Latin American lesbians
narrower: Afro-Latin American queer people
narrower: Afro-Latin American transgender people
narrower: Afro-Latin American asexual people
narrower: Afro-Latin American intersex people
has top concept: LGBTQ+ people
replaces: afroLatinAmericansLGBTQ
issued: 2019-05-14
modified: 2025-02-23
type: Concept
in scheme: v3
change note: Version 4.1.0

Age of consent
preferred label: Edad de consentimiento @es
comment: The age at which a person is considered legally competent to consent to sexual acts. The age of consent varies depending on the country, state, or culture.
comment: La edad en la que una persona es considerada legalmente competente para consentir a actos sexuales. La edad de consentimiento varía según el país, el estado o la cultura. @es
broader: Consent
related: Intergenerational relationships
related: Sexual offenses laws
related: Underage (Content warning)
has top concept: Consent
replaces: ageOfConsent
issued: 2019-05-14
modified: 2025-02-23
type: Concept
in scheme: v3
change note: Version 4.1.0

Agender people
preferred label: Personas agénero @es
comment: People who identify as not having a gender, or being genderless.
comment: Personas que se autoidentifican como sin género. @es
broader: Transgender people
broader: Gender minorities
related: Gender identity
related: Non-binary people
related: Agender identity
has top concept: LGBTQ+ people
replaces: agenderPeople
issued: 2019-05-14
modified: 2025-02-23
type: Concept
in scheme: v3
change note: Version 4.1.0

Age play
preferred label: Juego de edades @es
alternative label: ABDL
alternative label: Ageplay
alternative label: Infantilism
alternative label: Juegos con la edad @es
comment: The act of roleplaying as people of different ages, usually as children, for fun or erotic enjoyment.
comment: Una forma de juego de roles, típicamente sexual, que se da entre personas adultas que consienten en el que uno o más participantes representan una edad diferente a su edad biológica. @es
broader: Roleplay
related: BDSM
related: Power exchange
related: Diapers (Erotic)
has top concept: Sex (Act)
replaces: ageplay
issued: 2019-05-14
modified: 2025-02-23
type: Concept
in scheme: v3
change note: Version 4.1.0

Agî
alternative label: Agi @hil
comment: Filipino word that translates to both hermaphrodite and a gay slur.
comment: Palabra filipina que se traduce tanto como hermafrodita o como insulto contra los hombres gay. @es
broader: Non-Euro-American gender and sexual identities
broader: Slurs
related: Bakla
has top concept: Gender
replaces: agi
issued: 2019-05-14
modified: 2025-02-23
type: Concept
in scheme: v3
change note: Version 4.1.0

AIDS activists
preferred label: Activistas contra el SIDA @es
alternative label: Activistas del SIDA @es
comment: People who campaign for social and political change for people affected by HIV/AIDS.
comment: Personas que hacen campaña por el cambio social y político para las personas afectadas por el VIH/SIDA. @es
broader: LGBTQ+ political activists
related: HIV/AIDS
related: AIDS organizations
related: LGBTQ+ movement
has top concept: LGBTQ+ people
replaces: AIDSActivists
issued: 2019-05-14
modified: 2025-02-23
type: Concept
in scheme: v3
change note: Version 4.1.0

AIDS awareness
preferred label: Conciencia sobre el SIDA @es
comment: Activism and other efforts to bring attention to the AIDS epidemic.
comment: Activismo y otros esfuerzos para generar atención sobre la epidemia del SIDA. @es
related: HIV/AIDS
related: Red ribbons (AIDS)
replaces: AIDSAwareness
issued: 2019-05-14
modified: 2025-02-23
type: Concept
in scheme: v3
change note: Version 4.1.0

AIDS information centers
preferred label: Centros de información sobre el SIDA @es
preferred label: AIDS information centres
comment: Institutions dedicated to education, prevention, and treatment of HIV/AIDS; AIDS information centers often provide services like HIV counseling and testing services.
comment: Instituciones dedicadas a la educación, la prevención y el tratamiento del VIH/SIDA; los centros de información sobre el SIDA suelen ofrecer servicios como asesoramiento y pruebas de VIH. @es
broader: LGBTQ+ information centers
related: HIV/AIDS
has top concept: LGBTQ+ centers
replaces: AIDSInformationCentres
issued: 2019-05-14
modified: 2025-02-23
type: Concept
in scheme: v3
change note: Version 4.1.0

AIDS education
preferred label: Educación sobre el SIDA @es
comment: Instruction about HIV/AIDS, including topics like the history of the AIDS epidemic, contraction, prevention, and treatment.
comment: Instrucción sobre el VIH/SIDA, incluyendo temas como la historia de la epidemia del SIDA, cómo se contrae, su prevención y tratamiento. @es
broader: Information provision
related: HIV/AIDS
related: Safer sex
related: Sex education
related: Sexual health
has top concept: Information provision
replaces: AIDSEducation
issued: 2019-05-14
modified: 2025-02-23
type: Concept
in scheme: v3
change note: Version 4.1.0

AIDS memorial quilts
preferred label: Colchas conmemorativas del SIDA @es
comment: Quilts created to celebrate the lives of people who have died of AIDS-related causes, bring awareness to the AIDS epidemic, and provide support and healing for those affected. The term is often used to refer to the NAMES Project AIDS Memorial Quilt started by Cleve Jones in 1985.
comment: Colchas creadas para celebrar las vidas de las personas que han muerto por causas relacionadas con el SIDA, generar conciencia sobre la epidemia del SIDA y brindar apoyo y sanación a las personas afectadas. El término se utiliza a menudo para referirse a la colcha conmemorativa del SIDA del proyecto NAMES iniciada por Cleve Jones en 1985. @es
broader: AIDS memorials
related: HIV/AIDS
related: LGBTQ+ memorials
has top concept: Medical care
replaces: AIDSMemorialQuilts
issued: 2019-05-14
modified: 2025-02-23
type: Concept
in scheme: v3
change note: Version 4.1.0

AIDS memorials
preferred label: Conmemoraciones del SIDA @es
comment: Projects and events celebrating the lives of people who have died of AIDS-related causes.
comment: Proyectos y eventos que celebran las vidas de personas que han muerto por causas relacionadas al SIDA. @es
broader: Medical care
narrower: AIDS memorial quilts
related: HIV/AIDS
related: LGBTQ+ memorials
has top concept: Medical care
replaces: AIDSMemorials
issued: 2019-05-14
modified: 2025-02-23
type: Concept
in scheme: v3
change note: Version 4.1.0

AIDS organizations
preferred label: Organizaciones contra SIDA @es
preferred label: AIDS organisations
comment: Community-based groups or institutions that provide support and advocacy for people affected by HIV/AIDS.
comment: Grupos o instituciones comunitarias que brindan apoyo y defensa a las personas afectadas por el VIH/SIDA. @es
related: HIV/AIDS
related: AIDS activists
related: AIDS periodicals
related: Health care for LGBTQ+ people
related: LGBTQ+ clubs and organizations
replaces: AIDSOrganisations
issued: 2019-05-14
modified: 2025-02-23
type: Concept
in scheme: v3
change note: Version 4.1.0

AIDS periodicals
preferred label: Revistas sobre SIDA @es
alternative label: Publicaciones periódicas contra el SIDA @es
alternative label: Publicaciones periódicas sobre el SIDA || @es
comment: Print or digital publications published periodically and created by or for people with AIDS.
comment: Publicaciones impresas o digitales publicadas periódicamente y creadas por o para personas con SIDA. @es
broader: LGBTQ+ periodicals
related: HIV/AIDS
related: AIDS organizations
related: LGBTQ+ press
has top concept: LGBTQ+ periodicals
replaces: AIDSPeriodicals
issued: 2019-05-14
modified: 2025-02-23
type: Concept
in scheme: v3
change note: Version 4.1.0

AIDS phobia
preferred label: Serofobia @es
alternative label: AIDSphobia
alternative label: Fear of AIDS
alternative label: Fobia al SIDA @es
alternative label: AIDSfobia @es
alternative label: Miedo al SIDA @es
alternative label: Sidafobia @es
alternative label: Sidofobia @es
comment: Antagonism or disgust directed toward individuals with HIV/AIDS or behaviors perceived as putting oneself at risk for contracting HIV/AIDS. AIDS phobia may include isolation, stereotypes, verbal harassment, and physical violence.
comment: Antagonismo o disgusto dirigido hacia personas con VIH/SIDA o hacia comportamientos percibidos como riesgosos en relación a la contracción de VIH/SIDA. La fobia al SIDA puede incluir el aislamiento, los estereotipos, el acoso verbal y la violencia física. @es
related: HIV/AIDS
related: LGBTQ+ phobia
replaces: AIDSPhobia
issued: 2019-05-14
modified: 2025-02-23
type: Concept
in scheme: v3
change note: Version 4.1.0

ARC (AIDS-Related Complex)
preferred label: CRA (Complejo relacionado al SIDA) @es
alternative label: AIDS Related Complex
alternative label: ARC
alternative label: CRA @es
comment: Abbreviation for AIDS-related complex, a term used early in the AIDS epidemic to describe people with symptomatic HIV infections who have not been formally diagnosed with AIDS. Since 2000, clinical use of the term has been largely discontinued.
comment: Abreviatura del complejo relacionado al SIDA, término utilizado a principios de la epidemia del SIDA para describir a personas con infecciones sintomáticas de VIH que no fueron diagnosticadas formalmente con SIDA. Desde 2000, en gran medida, el uso clínico del término fue abandonado. @es
broader: HIV/AIDS
related: Kaposi's sarcoma
has top concept: STDs
replaces: ARC
issued: 2019-05-14
modified: 2025-02-23
type: Concept
in scheme: v3
change note: Version 4.1.0

Red ribbons (AIDS)
preferred label: Cintas rojas (SIDA) @es
alternative label: AIDS ribbons
alternative label: Red ribbons
alternative label: Lazos rojos @es
alternative label: Lazos rojos (SIDA) @es
alternative label: Cintas por el SIDA @es
comment: Red ribbon that acts as an international symbol for HIV and AIDS awareness; first adopted in the early 1990s for the Red Ribbon Project.
comment: Cinta roja que actúa como símbolo internacional para la concientización sobre el VIH y el SIDA; adoptado por primera vez a principios de la década de 1990 para el Proyecto Cinta Roja. @es
broader: LGBTQ+ symbols
related: HIV/AIDS
related: AIDS awareness
has top concept: LGBTQ+ symbols
replaces: redRibbons
issued: 2019-05-14
modified: 2025-02-23
type: Concept
in scheme: v3
change note: Version 4.1.0

Akava'ine
comment: A Cook Islands Māori word referring to transgender people of Māori descent from the Cook Islands.
comment: Una palabra maorí de las Islas Cook que se refiere a las personas transgénero de ascendencia maorí de las Islas Cook. @es
broader: Non-Euro-American gender and sexual identities
broader: MVPFAFF+
has top concept: Gender
replaces: akavaine
issued: 2019-05-14
modified: 2025-02-23
type: Concept
in scheme: v3
change note: Version 4.1.0

Sadomasochism
preferred label: Sadomasoquismo @es
alternative label: Algolagnia
alternative label: S&M
alternative label: SM
alternative label: Sexual Torture
alternative label: Tortura sexual @es
comment: Eroticization of pain and intense sensation.
comment: Erotización del dolor y la sensación intensa. @es
broader: BDSM
broader: Sexual preference
narrower: Masochism
narrower: Sadism
narrower: Genital torture
narrower: Breast torture
narrower: Nipple torture
related: Sexual identity
related: LGBTQ+ submissives
related: Leather and kink activism
related: Kinky people
related: Tickling
related: Anti-sadomasochism
has top concept: Eroticism
replaces: SM
issued: 2019-05-14
modified: 2025-02-23
type: Concept
in scheme: v3
change note: Version 4.1.0

Ali
comment: Tamil slur for effeminate gay man; directly translates to hermaphrodite.
comment: Insulto tamil para un hombre gay afeminado; se traduce como hermafrodita. @es
broader: Non-Euro-American gender and sexual identities
broader: Slurs
has top concept: Gender
replaces: ali
issued: 2019-05-14
modified: 2025-02-23
type: Concept
in scheme: v3
change note: Version 4.1.0

Allies
preferred label: Aliados @es
comment: Individuals of a privileged social identity who support, stand in solidarity with, and work to advance the interests of marginalized groups they do not belong to.
comment: Personas de una identidad social privilegiada que apoyan, se solidarizan con y trabajan para promover los intereses de grupos marginados a los que no pertenecen. @es
broader: Heterosexuals
related: LGBTQ+ activism
related: Gay-straight alliances
related: LGBTQ+ friendliness
related: LGBTQ+ solidarity
related: LGBTQ+ safe spaces
has top concept: Heterosexuals
replaces: allies
issued: 2019-05-14
modified: 2025-02-23
type: Concept
in scheme: v3
change note: Version 4.1.0

Alyha
comment: In Native American Mohave tribes, people assigned male at birth who exhibit feminine traits and could become socially female, often serving as healers.
comment: En las tribus nativas americanas mohave, las personas asignadas al sexo masculino al nacer que exhiben rasgos femeninos y pueden convertirse socialmente en mujeres, a menudo sirviendo como curanderos. @es
broader: Non-Euro-American gender and sexual identities
related: Hwame
related: Two-Spirit people
has top concept: Gender
replaces: alyha
issued: 2019-05-14
modified: 2025-02-23
type: Concept
in scheme: v3
change note: Version 4.1.0

Amazons
preferred label: Amazonas @es
comment: Nation of all-female warriors in Greek mythology and Classical antiquity; from the Early Modern period, their name has become a term for woman warriors in general as well as a cultural symbol invoked in lesbian communities.
comment: Nación de guerreras exclusivamente mujeres en la mitología griega y la antigüedad clásica. Desde el período moderno temprano, su nombre se ha convertido en un término para las mujeres guerreras en general, así como en un símbolo cultural invocado en las comunidades lesbianas. @es
broader: Females
related: Lesbians
has top concept: Gender
replaces: amazons
issued: 2019-05-14
modified: 2025-02-23
type: Concept
in scheme: v3
change note: Version 4.1.0

Anal beads
preferred label: Perlas anales @es
alternative label: Cuentas anales @es
alternative label: Bolas anales @es
comment: A sex toy used in anal play that consists of multiple attached spheres (or balls) that are continuously inserted through the anus into the rectum and then removed with varying speeds.
comment: Un juguete sexual utilizado para el juego anal, que consta de múltiples esferas (o bolas) adheridas que se insertan continuamente a través del ano hasta el recto y luego son removidas a diferentes velocidades. @es
broader: Sex accessories
related: Anal play
has top concept: Sex accessories
replaces: analBeads
issued: 2019-05-14
modified: 2025-02-23
type: Concept
in scheme: v3
change note: Version 4.1.0

Anal fisting
preferred label: Fisting anal @es
comment: Sexual practice of inserting a fist into an anus.
comment: Práctica sexual de introducir un puño en el ano. @es
broader: Anal sex
broader: Fisting
related: Rimming
related: Anal play
related: Vaginal fisting
has top concept: Sex (Act)
replaces: analFisting
issued: 2019-05-14
modified: 2025-02-23
type: Concept
in scheme: v3
change note: Version 4.1.0

Anal sex
preferred label: Sexo anal @es
comment: Sexual activity involving penetration of the anus.
comment: Actividad sexual que implica la penetración del ano. @es
broader: Anal play
broader: Sex (Act)
broader: Sexual practices
narrower: Anal fisting
narrower: Ass fucking
related: Rimming
related: Butt plugs
related: Douching
has top concept: Sex (Act)
replaces: analSex
issued: 2019-05-14
modified: 2025-02-23
type: Concept
in scheme: v3
change note: Version 4.1.0

Androgen insensitivity syndrome
preferred label: Síndrome de insensibilidad a los andrógenos @es
alternative label: AIS
alternative label: Goldberg-Maxwell syndrome
alternative label: Male androgen insensitivity syndrome
alternative label: SIA @es
alternative label: Síndrome Goldberg-Maxwell @es
alternative label: Síndrome de insensibilidad a los andrógenos masculinos @es
comment: People born with AIS have XY chromosomes and testes, and their bodies have varying levels of insensitivity to androgens (including testosterone). This means that their cells do not respond typically to the testosterone that they produce. Like other variations in sex characteristics, AIS is a spectrum, with the subcategories of complete (CAIS), partial (PAIS), and mild androgen insensitivity (MAIS). The term "male androgen insensitivity syndrome" should not be used to describe this variation because many people with AIS are women.
comment: Las personas que nacen con AIS (por sus siglas en inglés) [or use the Spanish acronym, SIA. This applies to its usage throughout the definition.] tienen cromosomas XY y testículos, y sus cuerpos tienen distintos niveles de insensibilidad a los andrógenos (incluida la testosterona). Esto significa que sus células no responden de forma regular a la testosterona que producen. Al igual que otras variaciones en las características sexuales, la AIS es un espectro, con las subcategorías de insensibilidad completa (CAIS), parcial (PAIS) y leve a los andrógenos (MAIS). El término "síndrome de insensibilidad masculina a los andrógenos" no debe utilizarse para describir esta variación ya que muchas personas con AIS son mujeres. @es
broader: Intersex variations
narrower: Partial androgen insensitivity syndrome
narrower: Complete gonadal dysgenesis
narrower: Mild androgen insensitivity syndrome
has top concept: Sex (Body)
replaces: androgenInsensitivitySyndrome
issued: 2019-05-14
modified: 2025-02-23
type: Concept
in scheme: v3
change note: Version 4.1.0

Androgynous people
preferred label: Personas andróginas @es
comment: People who have a non-binary gender that includes masculine and feminine traits.
comment: Personas que tienen un género no binario que incluye rasgos masculinos y femeninos. @es
broader: Transgender people
broader: Gender minorities
related: Androgyny
related: Non-binary people
has top concept: LGBTQ+ people
replaces: androgynousPeople
issued: 2019-05-14
modified: 2025-02-23
type: Concept
in scheme: v3
change note: Version 4.1.0

Androgynos
comment: Israeli term used in Rabbinical literature to describe both an intersex mythological creature and refer to a legal condition.
comment: Término griego utilizado en la literatura rabínica para describir tanto una criatura mitológica intersexual como para referirse a una condición legal. @es
broader: Non-Euro-American gender and sexual identities
related: Intersex people
has top concept: Gender
replaces: androgynos
issued: 2019-05-14
modified: 2025-02-23
type: Concept
in scheme: v3
change note: Version 4.1.0

Androgyny
preferred label: Androginia @es
comment: The combination of masculine and feminine characteristics.
comment: La combinación de características masculinas y femeninas. @es
broader: Gender expression
related: Androgynous people
related: Femininities
related: Gender bending
related: Gender roles
related: Masculinities
related: Gender creative
has top concept: Gender
replaces: androgyny
issued: 2019-05-14
modified: 2025-02-23
type: Concept
in scheme: v3
change note: Version 4.1.0

LGBTQ+ Anglicans
preferred label: Anglicanos LGBTQ+ @es
alternative label: Anglicans (LGBTQ)
alternative label: LGBTQ Church of England
alternative label: LGBTQ Episcopalians
alternative label: LGBTQ Anglicans
comment: LGBTQ+ people who are Anglican.
comment: Personas LGBTQ+ que son anglicanas. @es
broader: LGBTQ+ Protestants
has top concept: LGBTQ+ African religions
replaces: LGBTQAnglicans
issued: 2019-05-14
modified: 2025-02-23
type: Concept
in scheme: v3
change note: Version 4.1.0

Rimming
preferred label: Beso negro @es
alternative label: Analingus
alternative label: Anilingus @es
comment: Sexual stimulation of the anus by the tongue or mouth.
comment: Acto sexual que implica el uso de la boca y la lengua para estimular el ano y el recto. @es
broader: Anal play
broader: Licking
broader: Sex (Act)
broader: Sexual practices
related: Anal fisting
related: Anal sex
related: Oral sex
has top concept: Sex (Act)
replaces: rimming
issued: 2019-05-14
modified: 2025-02-23
type: Concept
in scheme: v3
change note: Version 4.1.0

Anonymous sex
preferred label: Sexo anónimo @es
comment: Sexual encounters between two or more people who do not know one another, typically with no expectation of future communication or interaction.
comment: Encuentros sexuales entre dos o más personas que no se conocen, generalmente sin expectativas de comunicación o interacción futura. @es
broader: Sexual practices
related: Casual sex
related: Cottaging (Gay culture)
related: Cruising (LGBTQ+ culture)
related: Sex locations
related: Sexual relationships
related: Sexuality
related: Tearoom sex
has top concept: Sexual practices
replaces: anonymousSex
issued: 2019-05-14
modified: 2025-02-23
type: Concept
in scheme: v3
change note: Version 4.1.0

Anti-bisexual discrimination
preferred label: Discriminación anti-bisexual @es
comment: The unjust or prejudicial treatment of bisexual people due to their sexual identity; may include the denial of legal rights, employment, and housing.
comment: El trato injusto o perjudicial hacia personas bisexuales por su identidad sexual; puede incluir la negación de derechos legales, empleo y vivienda. @es
broader: LGBTQ+ discrimination
related: Biphobia
has top concept: LGBTQ+ discrimination
replaces: antiBisexualDiscrimination
issued: 2019-05-14
modified: 2025-02-23
type: Concept
in scheme: v3
change note: Version 4.1.0

Anti-bisexual violence
preferred label: Violencia anti-bisexual @es
comment: Behavior involving physical force intended to harm or kill bisexual people on the basis of their identity.
comment: Comportamiento que involucra fuerza física destinada a hacer daño o a matar a personas bisexuales por su identidad. @es
broader: Anti-LGBTQ+ violence
related: Hate crimes
related: Biphobia
has top concept: Anti-LGBTQ+ violence
replaces: antiBisexualViolence
issued: 2019-05-14
modified: 2025-02-23
type: Concept
in scheme: v3
change note: Version 4.1.0

Anti-discrimination law
preferred label: Leyes anti-discriminación @es
comment: Legislation designed to prevent employment, housing, education, and other forms of discrimination against protected groups of people.
comment: Legislación diseñada para prevenir la discriminación de empleo, vivienda, educación y otras formas de discriminación contra grupos protegidos de personas. @es
broader: Law
related: LGBTQ+ discrimination
related: Public facilities
has top concept: Law
replaces: anti-discriminationLaw
issued: 2019-05-14
modified: 2025-02-23
type: Concept
in scheme: v3
change note: Version 4.1.0

Anti-feminism
preferred label: Anti-feminismo @es
comment: Opposition to some or all forms of feminism.
comment: Oposición a algunas o todas las formas del feminismo. @es
related: Feminism
related: Social privilege
replaces: anti-feminism
issued: 2019-05-14
modified: 2025-02-23
type: Concept
in scheme: v3
change note: Version 4.1.0

Anti-gay discrimination
preferred label: Discriminación anti-gay @es
comment: The unjust or prejudicial treatment of gay men due to their sexual identity; may include the denial of legal rights, employment, and housing.
comment: El trato injusto o perjudicial hacia hombres gay por su identidad sexual; puede incluir la negación de derechos legales, empleo y vivienda. @es
broader: LGBTQ+ discrimination
related: Homophobia
has top concept: LGBTQ+ discrimination
replaces: antiGayDiscrimination
issued: 2019-05-14
modified: 2025-02-23
type: Concept
in scheme: v3
change note: Version 4.1.0

Anti-gay violence
preferred label: Violencia anti-gay @es
alternative label: Gay bashing
comment: Behavior involving physical force intended to harm or kill gay men on the basis of their identity.
comment: Comportamiento que involucra fuerza física destinada a hacer daño o a matar a hombres gay en base a su identidad. @es
broader: Anti-LGBTQ+ violence
narrower: Forced castration
related: Hate crimes
related: Homophobia
has top concept: Anti-LGBTQ+ violence
replaces: anti-gayViolence
issued: 2019-05-14
modified: 2025-02-23
type: Concept
in scheme: v3
change note: Version 4.1.0

Anti-lesbian discrimination
preferred label: Discriminación anti-lesbiana @es
comment: The unjust or prejudicial treatment of lesbians due to their sexual identity; may include the denial of legal rights, employment, and housing.
comment: El trato injusto o perjudicial hacia las lesbianas por su identidad sexual; puede incluir la negación de derechos legales, empleo y vivienda. @es
broader: LGBTQ+ discrimination
related: Lesbophobia
has top concept: LGBTQ+ discrimination
replaces: antiLesbianDiscrimination
issued: 2019-05-14
modified: 2025-02-23
type: Concept
in scheme: v3
change note: Version 4.1.0

Anti-lesbian violence
preferred label: Violencia anti-lesbiana @es
alternative label: Lesbian bashing
comment: Behavior involving physical force intended to harm or kill lesbians on the basis of their identity.
comment: Comportamiento que involucra fuerza física destinada a hacer daño o a matar a lesbianas por su identidad. @es
broader: Anti-LGBTQ+ violence
related: Hate crimes
related: Lesbians
related: Lesbophobia
has top concept: Anti-LGBTQ+ violence
replaces: anti-lesbianViolence
issued: 2019-05-14
modified: 2025-02-23
type: Concept
in scheme: v3
change note: Version 4.1.0

Anti-LGBTQ+ violence
preferred label: Violencia anti-LGBTQ+ @es
alternative label: Anti-LGBTQ violence
alternative label: Violencia anti-LGBTQ @es
comment: Behavior involving physical force intended to harm or kill LGBTQ+ people on the basis of their identity.
comment: Comportamiento que involucra fuerza física destinada a hacer daño o a matar a personas LGBTQ+ en base a su identidad. @es
narrower: Anti-bisexual violence
narrower: Anti-gay violence
narrower: Anti-lesbian violence
narrower: Anti-queer violence
narrower: Anti-transgender violence
narrower: Murders of LGBTQ+ people
narrower: LGBTQ+ domestic violence
narrower: Anti-Two-Spirit violence
narrower: Anti-intersex violence
narrower: Police violence toward LGBTQ+ people
narrower: Anti-asexual violence
related: LGBTQ+ victims of hate crimes
related: LGBTQ+ victims of rape
related: LGBTQ+ victims of sexual abuse
related: LGBTQ+ persecutions
related: Sexual harassment
related: Sexual violence
related: Survivors of anti-LGBTQ+ violence
replaces: antiLGBTQViolence
issued: 2019-05-14
modified: 2025-02-23
type: Concept
in scheme: v3
change note: Version 4.1.0

Anti-queer discrimination
preferred label: Discriminación anti-queer @es
comment: The unjust or prejudicial treatment of queer people due to their identity; may include the denial of legal rights, employment, and housing.
comment: El trato injusto o perjudicial hacia las personas queer por su identidad; puede incluir la negación de derechos legales, empleo y vivienda. @es
broader: LGBTQ+ discrimination
related: Queerphobia
has top concept: LGBTQ+ discrimination
replaces: antiQueerDiscrimination
issued: 2019-05-14
modified: 2025-02-23
type: Concept
in scheme: v3
change note: Version 4.1.0

Anti-queer violence
preferred label: Violencia anti-queer @es
comment: Behavior involving physical force intended to harm or kill queer people on the basis of their identity.
comment: Comportamiento que involucra fuerza física con el fin de dañar o matar a personas queer por su identidad. @es
broader: Anti-LGBTQ+ violence
related: Hate crimes
related: Queerphobia
has top concept: Anti-LGBTQ+ violence
replaces: antiQueerViolence
issued: 2019-05-14
modified: 2025-02-23
type: Concept
in scheme: v3
change note: Version 4.1.0

Anti-transgender discrimination
preferred label: Discriminación anti-transgénero @es
comment: The unjust or prejudicial treatment of transgender people (or others perceived to be transgressing gender norms) due to their gender identity and/or expression; may include the denial of legal rights, employment, and housing.
comment: El trato injusto o perjudicial hacia las personas transgénero (u otras personas percibidas como transgresoras de las normas de género) por su identidad y/o expresión de género; puede incluir la negación de derechos legales, empleo y vivienda. @es
broader: LGBTQ+ discrimination
narrower: Deadnaming
narrower: Trans exclusivity
related: Medicalization
related: Bathroom bans
related: Public bathrooms
related: Public facilities
related: Transphobia
related: Womyn
related: Transmisogyny
related: Transmisogynoir
related: Trans-exclusionary radical feminism
related: Anti-transgender legislation
related: Anti-gender movement
has top concept: LGBTQ+ discrimination
replaces: antiTransgenderDiscrimination
issued: 2019-05-14
modified: 2026-02-23
type: Concept
in scheme: v3
change note: Version 4.1.0

Anti-transgender violence
preferred label: Violencia anti-transgénero @es
comment: Behavior involving physical force intended to harm or kill transgender people on the basis of their identity.
comment: Comportamiento que involucra fuerza física destinada a hacer daño o a matar a personas transgénero por su identidad. @es
broader: Anti-LGBTQ+ violence
related: Hate crimes
related: Transphobia
has top concept: Anti-LGBTQ+ violence
replaces: anti-transgenderViolence
issued: 2019-05-14
modified: 2025-02-23
type: Concept
in scheme: v3
change note: Version 4.1.0

Aphallia
preferred label: Afalia @es
alternative label: Penile agenesis
comment: People with aphallia have XY chromosomes, testes, and are born without a penis. They produce typical levels of testosterone, and they develop secondary sex characteristics associated with a typical testosterone puberty during adolescence.
comment: Las personas con afalia tienen cromosomas XY, testículos y nacen sin pene. Producen niveles típicos de testosterona y desarrollan características sexuales secundarias asociadas a una pubertad típica con testosterona durante la adolescencia. @es
broader: Intersex variations
has top concept: Sex (Body)
replaces: aphallia
issued: 2019-05-14
modified: 2025-02-23
type: Concept
in scheme: v3
change note: Version 4.1.0

Aravani
alternative label: Aruvani @ta
comment: Indian term for people who identify as women trapped in male bodies; many prefer other terms, such as hijra or thirunangai.
comment: Término indio para personas que seautoidentificancomo mujeres atrapadas en cuerpos masculinos; muches prefieren otros términos, como hijra o thirunangai. @es
broader: Non-Euro-American gender and sexual identities
related: Hijras
related: Thirunangai
has top concept: Gender
replaces: aravani
issued: 2019-05-14
modified: 2025-02-23
type: Concept
in scheme: v3
change note: Version 4.1.0

LGBTQ+ archives
preferred label: Archivos LGBTQ+ @es
alternative label: LGBTQ archives
alternative label: Archives (LGBTQ)
alternative label: Archivos LGBTQ @es
alternative label: Archivos (LGBTQ) @es
comment: Collections of records and materials relating to LGBTQ+ people or LGBTQ+ communities; can include a variety of organizations and institutions from community to government archives.
comment: Colecciones de registros y materiales relacionados con personas LGBTQ+ o comunidades LGBTQ+; puede incluir una variedad de organizaciones e instituciones, desde archivos comunitarios hasta gubernamentales. @es
broader: LGBTQ+ cultural heritage institutions
narrower: Bisexual archives
narrower: Gay archives
narrower: Lesbian archives
narrower: Queer archives
narrower: Transgender archives
narrower: Asexual archives
narrower: Intersex archives
narrower: Black queer archives
related: LGBTQ+ libraries
related: Two-Spirit archives
has top concept: LGBTQ+ cultural heritage institutions
replaces: archivesLGBTQ
issued: 2019-05-14
modified: 2026-02-23
type: Concept
in scheme: v3
change note: Version 4.1.0

Aromantic people
preferred label: Personas arrománticas @es
comment: Individuals who do not generally experience romantic attraction or desire.
comment: Personas que generalmente no experimentan atracción o deseo romántico. @es
broader: Romantic minorities
related: Asexuality
related: Relationship satisfaction
related: Amatonormativity
related: Aromanticism
related: Aromantic families
related: Aromantic parents
related: Children of aromantic people
related: Alloromantic people
related: Biromantic people
related: Homoromantic people
related: Heteroromantic people
related: Panromantic people
related: Aromantic people in fandom
has top concept: Romantic minorities
replaces: aromanticPeople
issued: 2019-05-14
modified: 2025-02-23
type: Concept
in scheme: v3
change note: Version 4.1.0

Arrests of LGBTQ+ people
preferred label: Detenciones de personas LGBTQ+ @es
alternative label: Arrests of LGBTQ people
alternative label: Detenciones de personas LGBTQ @es
alternative label: Arrestos de personas LGBTQ+ @es
alternative label: Arrestos de personas LGBTQ @es
comment: Apprehension and detention of LGBTQ+ people by an institution or authority in order to deprive them of their freedom of movement.
comment: Aprehensión y detención de personas LGBTQ+ por parte de una institución o autoridad con el fin de privarlas de su libertad de movimiento. @es
broader: Detention of LGBTQ+ people
broader: Police interactions with LGBTQ+ people
related: LGBTQ+ civil disobedience
related: LGBTQ+ persecutions
related: Police entrapment
has top concept: Detention of LGBTQ+ people
replaces: arrestsOfLGBTQPeople
issued: 2019-05-14
modified: 2025-02-23
type: Concept
in scheme: v3
change note: Version 4.1.0

Insemination
preferred label: Inseminación @es
alternative label: Fertilisation
alternative label: Fertilization
alternative label: Fertilización @es
comment: The act of using sperm to induce pregnancy by natural or artificial means, especially in the context of LGBTQ+ family planning with sperm donors.
comment: El acto de utilizar esperma para inducir el embarazo por medios naturales o artificiales, especialmente en el contexto de la planificación familiar LGBTQ+ con donantes de esperma. @es
broader: Conception by LGBTQ+ people
narrower: Self-insemination
narrower: Artificial insemination
narrower: Donor insemination
related: Sperm donors
related: Assisted reproduction
has top concept: LGBTQ+ family planning
replaces: insemination
issued: 2019-05-14
modified: 2025-02-23
type: Concept
in scheme: v3
change note: Version 4.1.0

LGBTQ+ artists
preferred label: Artistas LGBTQ+ @es
alternative label: Artists (LGBTQ)
alternative label: Artistas (LGBTQ) @es
comment: LGBTQ+ people who practice any of various creative arts.
comment: Artistas que se conocen por ser LGBTQ+. @es
broader: LGBTQ+ people
narrower: Bisexual artists
narrower: Gay artists
narrower: Lesbian artists
narrower: Queer artists
narrower: Transgender artists
narrower: Asexual artists
narrower: Intersex artists
narrower: LGBTQ+ photographers
narrower: LGBTQ+ painters
narrower: Greyromantic artists
narrower: Demisexual artists
narrower: Megasexual artists
narrower: Aromantic artists
narrower: LGBTQ+ cartoonists
narrower: LGBTQ+ makeup artists
related: LGBTQ+ arts
related: LGBTQ+ cultural heritage institutions
related: Two-Spirit artists
has top concept: LGBTQ+ people
replaces: artistsLGBTQ
issued: 2019-05-14
modified: 2025-04-23
type: Concept
in scheme: v3
change note: Version 4.1.0

Asexual people
preferred label: Personas asexuales @es
alternative label: Aces
comment: Individuals who generally do not experience sexual attraction or desire; do not use to describe individuals practicing celibacy or abstinence for religious or cultural reasons.
comment: Personas que generalmente no experimentan atracción o deseo sexual; no debe utilizarse para describir a personas que practican el celibato o la abstinencia por razones religiosas o culturales. @es
broader: Sexual minorities
narrower: Asexual youth
narrower: Asexual athletes
narrower: Closeted asexual people
narrower: Asexual college students
related: Asexuality
related: Celibacy
related: Compulsory sexuality
related: Megasexual people
related: Asexual families
related: Asexual parents
related: Children of asexual people
related: Asexual people in fandom
related: Persecution of asexual people
has top concept: Sexual minorities
replaces: asexualPeople
issued: 2019-05-14
modified: 2025-02-23
type: Concept
in scheme: v3
change note: Version 4.1.0

Ashtime
comment: Term used by the Maale people in Ethiopia for people assigned male at birth who exhibit feminine characteristics; there is some question over the legitimacy of term.
comment: Término utilizado por el pueblo Maale de Etiopía para las personas asignadas al sexo masculino al nacer que presentan características femeninas; hay cuestionamientos sobre la legitimidad del término. @es
broader: Non-Euro-American gender and sexual identities
has top concept: Gender
replaces: ashtime
issued: 2019-05-14
modified: 2025-02-23
type: Concept
in scheme: v3
change note: Version 4.1.0

Asian American LGBTQ+ people
preferred label: Personas LGBTQ+ asiático-americanas @es
alternative label: Asian American people (LGBTQ)
alternative label: Asian Americans (LGBTQ)
alternative label: LGBTQ+ Asian American people
alternative label: LGBTQ+ Asian Americans
alternative label: Personas asiático-americanas (LGBTQ) @es
alternative label: Asiático-americanos LGBTQ @es
alternative label: Asiático-americanos LGBTQ+ @es
alternative label: Asiático-americanos (LGBTQ) @es
alternative label: Asiático-americanas LGBTQ @es
alternative label: Asiático-americanas LGBTQ+ @es
alternative label: Asiático-americanas (LGBTQ) @es
comment: LGBTQ+ people of Asian heritage or descent born in the United States or born in Asian countries who live in or have a strong connection to the United States. Only use for individuals who self-identify as Asian American.
comment: Personas LGBTQ+ de ascendencia asiática nacidas en Estados Unidos o personas LGBTQ+ nacidas en países asiáticos que viven en o tienen una conexión fuerte con los Estados Unidos. Utilícese para personas que se autoidentifiquen como asiático-americanas. @es
broader: Asian LGBTQ+ people
narrower: Asian American bisexual people
narrower: Asian American gay men
narrower: Asian American lesbians
narrower: Asian American queer people
narrower: Asian American transgender people
narrower: Asian American intersex people
narrower: Asian American asexual people
has top concept: LGBTQ+ people
replaces: asianAmericansLGBTQ
issued: 2019-05-14
modified: 2025-02-23
type: Concept
in scheme: v3
change note: Version 4.1.0

Asian LGBTQ+ people
preferred label: Personas LGBTQ+ asiáticas @es
alternative label: Asian people (LGBTQ)
alternative label: Asians (LGBTQ)
alternative label: LGBTQ+ Asian people
alternative label: LGBTQ+ Asians
alternative label: Personas asiáticas (LGBTQ) @es
alternative label: Asiáticos (LGBTQ) @es
alternative label: Personas asiáticas LGBTQ+ @es
alternative label: Asiáticos LGBTQ+ Asiáticas (LGBTQ) @es
alternative label: Asiáticas LGBTQ+ @es
comment: LGBTQ+ people of Asian heritage or descent, living in Asia or part of the Asian diaspora. Only use for people who self-identify as Asian.
comment: Personas LGBTQ+ nacidas o descendientes de países asiáticos. Utilícese únicamente para personas que se autoidentifican como asiáticas. @es
broader: LGBTQ+ people of color
narrower: Asian American LGBTQ+ people
narrower: Asian bisexual people
narrower: Asian gay men
narrower: Asian lesbians
narrower: Asian queer people
narrower: Asian transgender people
narrower: Asian intersex people
narrower: Asian asexual people
narrower: Asian non-binary people
narrower: Ryukyuan LGBTQ+ people
has top concept: LGBTQ+ people
replaces: asiansLGBTQ
issued: 2019-05-14
modified: 2025-04-24
type: Concept
in scheme: v3
change note: Version 4.1.0

Autoerotic asphyxiation
preferred label: Asfixia autoerótica @es
alternative label: Asphyxiophilia
alternative label: Autoerotic asphyxia
alternative label: Hypoxyphilia
alternative label: Strangulation sex
alternative label: Asfixiofilia @es
alternative label: Hipoxifilia @es
alternative label: Sexo por estrangulación @es
comment: Intentional restriction of one's own oxygen for the purposes of sexual arousal.
comment: Restricción intencionada del oxígeno propio con fines de excitación sexual. @es
broader: Sex (Act)
broader: Sexual practices
broader: Breath control
related: BDSM
has top concept: Sex (Act)
replaces: autoeroticAsphyxiation
issued: 2019-05-14
modified: 2025-02-23
type: Concept
in scheme: v3
change note: Version 4.1.0

Ass fucking
preferred label: Dar por culo @es
alternative label: Butt fucking
alternative label: Coger por el culo @es
alternative label: Coger por culo @es
alternative label: Tomar por culo @es
alternative label: Culear @es
comment: The sexual act of penetrating an individual's anus with a penis or dildo.
comment: Acto sexual que consiste en penetrar el ano de una persona con un pene o un consolador. @es
broader: Anal sex
broader: Fucking
narrower: Barebacking
related: Enemas
related: Sex swings
related: Douching
has top concept: Sex (Act)
replaces: assFucking
issued: 2019-05-14
modified: 2025-02-23
type: Concept
in scheme: v3
change note: Version 4.1.0

Assigned female at birth
preferred label: Asignada sexo femenino al nacer @es
alternative label: AFAB
alternative label: Assigned F at birth
alternative label: Designated female at birth
alternative label: DFAB
alternative label: Female assigned at birth
alternative label: FAAB
alternative label: Asignadx mujer al nacer @es
alternative label: AMAN @es
comment: The assignment of a female gender marker or a female sex designation shortly after birth.
comment: Asignación de un marcador de sexo femenino o una designación de sexo femenino poco después del nacimiento. @es
broader: Assigned gender
broader: Sex assigned at birth
related: Cisgender women
related: Trans men
has top concept: Gender
replaces: assignedFemaleAtBirth
issued: 2019-05-14
modified: 2025-02-23
type: Concept
in scheme: v3
change note: Version 4.1.0

Assigned gender
preferred label: Género asignado @es
comment: The gender, typically "girl" or "boy," ascribed to a child at birth or adolescence based on the child's perceived sex.
comment: El género, típicamente "niña" o "niño", asignado a un infante al nacer o a un adolescente basado en su género percibido. @es
broader: Gender
broader: Gender identity
narrower: Assigned female at birth
narrower: Assigned male at birth
narrower: Gender assigned at birth
related: Birth certificate amendments
related: Chromosomes
related: Stealth (Transgender)
related: Transitioning (Gender)
related: Assigned sex
has top concept: Gender
replaces: assignedGender
issued: 2019-05-14
modified: 2025-02-23
type: Concept
in scheme: v3
change note: Version 4.1.0

Assigned male at birth
preferred label: Asignado sexo masculino al nacer @es
alternative label: AMAB
alternative label: Assigned M at birth
alternative label: Designated male at birth
alternative label: DMAB
alternative label: Male assigned at birth
alternative label: MAAB
alternative label: Asignadx hombre al nacer @es
alternative label: AHAN @es
comment: The assignment of a male gender marker or a male sex designation shortly after birth.
comment: Asignación de un marcador de género masculino o una designación de sexo masculino poco después del nacimiento. @es
broader: Assigned gender
broader: Sex assigned at birth
related: Cisgender men
related: Trans women
has top concept: Gender
replaces: assignedMaleAtBirth
issued: 2019-05-14
modified: 2025-02-23
type: Concept
in scheme: v3
change note: Version 4.1.0

Normalization
preferred label: Normalización @es
preferred label: Normalisation
alternative label: Assimilation
alternative label: Asimilación @es
comment: Social processes through which ideas, characteristics, and behaviors come to be seen as "normal" or "natural" and accepted as such.
comment: Procesos sociales a través de los cuales ideas, características y conductas llegan a ser vistas como "normales" o "naturales" y aceptadas como tales. @es
related: Heteronormativity
related: Homonormativity
related: LGBTQ+ social processes
related: Social norms
replaces: normalisation
issued: 2019-05-14
modified: 2025-02-23
type: Concept
in scheme: v3
change note: Version 4.1.0

Anal play
preferred label: Juegos anales @es
alternative label: Assplay
comment: Any kind of sexual play that involves anal stimulation.
comment: Término general para los actos sexuales que implican las nalgas y el ano. @es
broader: Sex (Act)
broader: Sexual practices
narrower: Anal sex
narrower: Rimming
related: Anal beads
related: Anal fisting
related: Butt
related: Butt plugs
related: Enemas
related: Scat play
related: Spanking
related: Paddling
related: Douching
has top concept: Sex (Act)
replaces: assplay
issued: 2019-05-14
modified: 2025-02-23
type: Concept
in scheme: v3
change note: Version 4.1.0

LGBTQ+ atheists
preferred label: Ateos LGBTQ+ @es
alternative label: Atheists (LGBTQ)
alternative label: Ateos (LGBTQ) @es
comment: LGBTQ+ people who do not believe in the existence of God or gods.
comment: Personas LGBTQ+ que son ateas. @es
broader: LGBTQ+ people
narrower: Bisexual atheists
narrower: Gay atheists
narrower: Lesbian atheists
narrower: Queer atheists
narrower: Transgender atheists
narrower: Intersex atheists
narrower: Asexual atheists
related: LGBTQ+ African religions
has top concept: LGBTQ+ people
replaces: atheistsLGBTQ
issued: 2019-05-14
modified: 2025-02-23
type: Concept
in scheme: v3
change note: Version 4.1.0

Autoeroticism
preferred label: Autoerotismo @es
comment: Practice of sexually stimulating oneself.
comment: Práctica de estimularse sexualmente. @es
related: Masturbation
replaces: autoeroticism
issued: 2019-05-14
modified: 2025-02-23
type: Concept
in scheme: v3
change note: Version 4.1.0

Aversion therapy
preferred label: Terapia de aversión @es
comment: Behavior modification therapy intended to displace pleasant associations evoked by homosexuality with unpleasant ones (in the form of electric shocks or nausea-inducing drugs) in order to shift the subject's homosexual orientation to a heterosexual one.
comment: Terapia de modificación de comportamiento que busca sustituir asociaciones placenteras evocadas por la homosexualidad con otras desagradables (utilizando descargas eléctricas o fármacos que provocan náuseas) con el fin de cambiar la orientación homosexual del sujeto por una heterosexual. @es
broader: Behavioral therapy
related: Conversion therapy
has top concept: Medical care
replaces: aversionTherapy
issued: 2019-05-14
modified: 2025-02-23
type: Concept
in scheme: v3
change note: Version 4.1.0

Aylonit
preferred label: Ay'lonit @he
comment: A romanized version of the Hebrew term traditionally used in Judaism to describe people assigned female at birth who develop secondary-sex characteristics perceived as "male" as well as fertility issues.
comment: Término hebreo que se refiere a una mujer con desarrollo masculino que suele ser infértil. @es
broader: Non-Euro-American gender and sexual identities
has top concept: Gender
replaces: aylonit
issued: 2019-05-14
modified: 2025-04-23
type: Concept
in scheme: v3
change note: Version 4.1.0

Bondage
alternative label: Erotic bondage
alternative label: Sexual bondage
alternative label: B&D @es
alternative label: Bondage y disciplina @es
comment: The act of tying up or restraining the body, usually with rope, cuffs, tape, or other adhesive, for the purposes of erotic enjoyment or aesthetic appreciation.
comment: Actos sexuales que implican la restricción física de una pareja. @es
broader: BDSM
narrower: Mummification (Erotic)
narrower: Rope bondage
narrower: Hogtie
related: Restraints
related: Kink accessories
related: Gags
related: Cuffs
related: Body bags (Erotic)
related: Hoods (Erotic)
has top concept: Eroticism
replaces: bondage
issued: 2019-05-14
modified: 2025-02-23
type: Concept
in scheme: v3
change note: Version 4.1.0

Dark rooms
preferred label: Cuartos oscuros @es
alternative label: Backrooms
comment: Rooms in nightclubs, sex clubs, or bathhouses where patrons can discretely engage in sexual activity. Dark rooms were common features in gay bars and clubs in the 1960-80s and remain common among swingers today.
comment: Habitaciones en clubes nocturnos, clubes sexuales o baños públicos donde los clientes pueden participar discretamente en actividades sexuales. Los cuartos oscuros figuraban con frecuencia en los bares y clubes gay entre las décadas de 1960 y 1980, y siguen siendo comunes entre los swingers en la actualidad. @es
broader: Sex locations
related: Gay bars
related: Sex clubs
related: Sex parties
related: Leather bars
related: Play spaces
has top concept: Sex locations
replaces: darkRooms
issued: 2019-05-14
modified: 2025-02-23
type: Concept
in scheme: v3
change note: Version 4.1.0

Baby dykes
comment: Newly out lesbians; only use for lesbians who self-identify as dykes.
comment: Lesbianas recién salidas del armario; utilícese únicamente para lesbianas que se autoidentifican como dykes. @es
broader: Lesbians
related: Baby gays
related: Coming out
related: Outing (LGBTQ+ culture)
has top concept: LGBTQ+ people
replaces: babyDyke
issued: 2019-05-14
modified: 2025-02-23
type: Concept
in scheme: v3
change note: Version 4.1.0

Baby gays
preferred label: Baby gay @es
comment: Newly out people, particularly newly out gay men.
comment: Una persona recién salida del armario, particularmente un hombre gay recién salido del armario. @es
broader: Gay men
related: Baby dykes
related: Coming out
related: Outing (LGBTQ+ culture)
has top concept: LGBTQ+ people
replaces: babyGay
issued: 2019-05-14
modified: 2025-02-23
type: Concept
in scheme: v3
change note: Version 4.1.0

Bading
comment: Derogatory Filipino term referring to gay men who crossdress.
comment: Término filipino despectivo que se refiere a los hombres gay que se transforman. @es
broader: Non-Euro-American gender and sexual identities
broader: Slurs
has top concept: Gender
replaces: bading
issued: 2019-05-14
modified: 2025-02-23
type: Concept
in scheme: v3
change note: Version 4.1.0

Bakla
comment: Filipino word for people who are assigned male at birth who adopt feminine mannerisms; often considered a third gender.
comment: Palabra filipina para personas asignadas al sexo masculino al nacer que adoptan gestos femeninos; a menudo consideradas un tercer género. @es
broader: Non-Euro-American gender and sexual identities
broader: Slurs
related: Agî
related: Bayot
has top concept: Gender
replaces: bakla
issued: 2019-05-14
modified: 2025-02-23
type: Concept
in scheme: v3
change note: Version 4.1.0

Ball culture
preferred label: Cultura del ball @es
alternative label: Ballroom community
alternative label: Ballroom culture
alternative label: Ballroom scene
alternative label: Drag ball culture
alternative label: House-ballroom culture
alternative label: Comunidad ballroom @es
alternative label: Cultura ball @es
alternative label: Cultura ballroom @es
alternative label: Escena ballroom @es
alternative label: Cultura drag ball @es
alternative label: Cultura de casas ballroom @es
comment: A subculture that emerged in early 20th century New York City in which primarily African-American and Latin American LGBTQ+ people perform and compete for various prizes.
comment: Subcultura surgida en la ciudad de Nueva York a principios del siglo XX en la que personas LGBTQ+ principalmente afroamericanas y latinoamericanas actúan y compiten por diversos premios. @es
broader: Subcultures
narrower: Ballroom families
related: Banjees
related: Drag balls
related: Drag community
related: Sexual identity
related: Voguing
related: Reading (LGBTQ+ culture)
related: Kiki (Social Gathering)
has top concept: Subcultures
replaces: ballCulture
issued: 2019-05-14
modified: 2025-02-23
type: Concept
in scheme: v3
change note: Version 4.1.0

Ballgags
preferred label: Mordazas @es
alternative label: Mordazas de boca @es
comment: Silicone, rubber, or other types of balls that are strapped in a person’s mouth to prevent them from speaking, typically during sex.
comment: Pelotas de silicona, goma u otros materiales atadas a la boca de una persona para impedirle hablar, usualmente durante el sexo. @es
broader: Sex accessories
has top concept: Sex accessories
replaces: ballgags
issued: 2019-05-14
modified: 2025-02-23
type: Concept
in scheme: v3
change note: Version 4.1.0

Ballroom families
preferred label: Familias de ballroom @es
alternative label: Ballroom houses
alternative label: Casas de ballroom @es
comment: In ball culture, ballroom families (or houses) are chosen families headed by and named after established community members (e.g., the House of Xtravaganza); heads of ballroom families are typically called "mothers" or "fathers," while members are termed "children" and "siblings."
comment: En la cultura del baile, las familias (o casas) de ballroom son familias elegidas encabezadas por miembros establecidos de la comunidad y que reciben su nombre de ellos (por ejemplo, la Casa de Xtravaganza); a los cabezas de familia de baile se les suele llamar "madres" o "padres", mientras que a los miembros se les denomina "hijos" y "hermanos". @es
broader: Ball culture
broader: LGBTQ+ chosen families
related: Drag families
has top concept: Subcultures
replaces: ballroomFamilies
issued: 2019-05-14
modified: 2025-02-23
type: Concept
in scheme: v3
change note: Version 4.1.0

Banjees
comment: Term from the 1980s (or earlier) that describes a certain type of young Latin American or African American man who has sex with men and who dresses in stereotypical masculine urban fashion.
comment: Término de la década de 1980 (o anterior) que describe a un determinado tipo de joven latino o afroamericano que mantiene relaciones sexuales con hombres y que viste de forma estereotipada masculina y urbana. @es
broader: LGBTQ+ historical terms
broader: Sexual identity
related: African American LGBTQ+ people
related: Ball culture
related: Latino/a/x LGBTQ+ people
related: Macho men
related: Men who have sex with men
related: Chicano/a/x gay men
has top concept: LGBTQ+ historical terms
replaces: banjees
issued: 2019-05-14
modified: 2025-02-23
type: Concept
in scheme: v3
change note: Version 4.1.0

Bantut
comment: Filipino term for gay men who assume the clothes and/or mannerisms of women.
comment: Término filipino para referirse a un hombre gay que adopta la vestimenta y/o los gestos de una mujer. @es
broader: Non-Euro-American gender and sexual identities
broader: Slurs
has top concept: Gender
replaces: bantut
issued: 2019-05-14
modified: 2025-02-23
type: Concept
in scheme: v3
change note: Version 4.1.0

LGBTQ+ Baptists
preferred label: Bautistas LGBTQ+ @es
alternative label: Baptists (LGBTQ)
alternative label: LGBTQ Baptists
comment: LGBTQ+ people who are Baptist.
comment: Personas LGBTQ+ que son bautistas. @es
broader: LGBTQ+ Protestants
has top concept: LGBTQ+ African religions
replaces: LGBTQBaptists
issued: 2019-05-14
modified: 2025-02-23
type: Concept
in scheme: v3
change note: Version 4.1.0

Berdache
alternative label: Bardache
comment: An offensive term developed by settler anthropologists to broadly describe Indigenous people expressing mixed gender roles; only use in historical contexts.
comment: Término ofensivo desarrollado por antropólogos colonizadores para describir ampliamente a los indígenas que expresan roles mixtos de género; utilícese únicamente en contextos históricos. @es
broader: LGBTQ+ historical terms
broader: Slurs
related: Native American LGBTQ+ people
related: Two-Spirit people
related: Two-Spirit identity
has top concept: LGBTQ+ historical terms
replaces: berdache
issued: 2019-05-14
modified: 2025-02-23
type: Concept
in scheme: v3
change note: Version 4.1.0

Barebacking
preferred label: Sexo a pelo @es
comment: The practice of engaging in anal sex without using a condom.
comment: La práctica de tener sexo anal sin preservativo. @es
broader: Ass fucking
broader: Risk behaviors
related: Bugchasing
has top concept: Sex (Act)
replaces: barebacking
issued: 2019-05-14
modified: 2025-02-23
type: Concept
in scheme: v3
change note: Version 4.1.0

LGBTQ+ bars
preferred label: Bares LGBTQ+ @es
alternative label: Bars (LGBTQ)
alternative label: Bares (LGBTQ) @es
comment: Establishments that serve alcohol and are patronized primarily by LGBTQ+ people.
comment: Establecimientos que sirven alcohol y son frecuentados principalmente por personas LGBTQ+. @es
broader: LGBTQ+ meeting places
narrower: Bisexual bars
narrower: Drag bars
narrower: Gay bars
narrower: Lesbian bars
narrower: Queer bars
narrower: Transgender bars
narrower: Leather bars
related: Gay discos
related: LGBTQ+ night life
related: LGBTQ+ pubs
related: Police raids on LGBTQ+ bars
has top concept: LGBTQ+ meeting places
replaces: barsLGBTQ
issued: 2019-05-14
modified: 2026-02-27
type: Concept
in scheme: v3
change note: Version 4.1.0

Bayot
comment: Derogatory Cebuano term used in the Philippines to describe effeminate gay men or masculine women.
comment: Término despectivo cebuano utilizado en Filipinas para referirse a los hombres gay afeminados o a las mujeres masculinas. @es
broader: Non-Euro-American gender and sexual identities
broader: Slurs
related: Bakla
has top concept: Gender
replaces: bayot
issued: 2019-05-14
modified: 2025-02-23
type: Concept
in scheme: v3
change note: Version 4.1.0

BDSM
preferred label: Ephebophilia
preferred label: Kinks and fetishes
preferred label: Kinks y fetiches @es
preferred label: Gerontophilia
preferred label: Hebephilia
comment: Erotic preference and form of personal relationship involving the consensual use of restraint, intense sensory stimulation, and fantasy power roleplay.
comment: Preferencia erótica y forma de relación personal que implica el uso consentido de la restricción, la estimulación sensorial intensa y el juego de roles de poder fantasioso. @es
comment: Sexual preference for young adults between the ages of 16 and 20
comment: Sexual or erotic acts, objects, and situations that are considered to be unusual within a given society.
comment: Actos, objetos y situaciones eróticas o sexuales que se consideran inusuales en determinadas sociedades. @es
comment: Refers to a primary or exclusive sexual interest in individuals in the early years of puberty (generally ages 11-14, though onset of puberty may vary)
broader: Sex (Act)
broader: Sexual practices
broader: Sexual preference
broader: Eroticism
narrower: Sadomasochism
narrower: Bondage
narrower: Enemas
narrower: Scat play
narrower: Exhibitionism
narrower: Urine play
narrower: Rubber and latex fetish
narrower: Voyeurism
narrower: Body part fetishes
narrower: Chasers
narrower: Wrestling
narrower: Muscle worship
narrower: Impact play
narrower: Temperature play
narrower: Electrical play
narrower: Kink accessories
narrower: Leather fetish
narrower: Medical play
narrower: Mind play
narrower: Orgasm control
narrower: Chastity play
narrower: Piercing play
narrower: Blood play
narrower: Knife play
narrower: Balloon kink
narrower: Inflation (Erotic)
narrower: Shoe fetish
narrower: Tickling
narrower: Foot fetish
narrower: Douching
narrower: Edge play
narrower: Abduction play
narrower: Consent play
narrower: Sensation play
narrower: PVC (Erotic)
narrower: Sensory deprivation (Erotic)
narrower: Dehumanization (Erotic)
related: Age play
related: Ballgags
related: Kink community
related: Chest harnesses
related: Consent
related: Handkerchief codes
related: LGBTQ+ dominants
related: LGBTQ+ mistresses (BDSM culture)
related: Social privilege
related: Sexual identity
related: LGBTQ+ submissives
related: Switches (Sex)
related: Tops (Sex)
related: Whips
related: Breast torture
related: Nipple torture
related: Intergenerational relationships
related: Youth
related: LGBTQ+ youth
related: Autoerotic asphyxiation
related: Bootblacking
related: Leather community
related: Sex (Act)
related: Sexual minorities
related: Sexual practices
related: Power exchange
related: Animal roleplay

Kink community
preferred label: Comunidad kink @es
alternative label: Comunidad de kink @es
comment: A broad term including all communities of people interested in kinks and fetishes, including or overlapping with certain subcultures such as the leather community and rubber and latex communities.
comment: Un término general que incluye a todas las comunidades de personas interesadas en kinks y fetiches, incluyendo o coincidiendo con ciertas subculturas tales como la comunidad de cuero y las comunidades de goma y latex. @es
broader: LGBTQ+ communities
related: LGBTQ+ dominatrices
related: BDSM
related: Leather community
related: Switches (Sex)
related: Tops (Sex)
related: Kinky people
has top concept: LGBTQ+ communities
replaces: BDSMCommunity
issued: 2019-05-14
modified: 2025-02-23
type: Concept
in scheme: v3
change note: Version 4.1.0

LGBTQ+ beaches
preferred label: Playas LGBTQ+ @es
alternative label: Beaches (LGBTQ)
alternative label: Playas (LGBTQ) @es
comment: Beaches set aside for use by LGBTQ+ people or beaches known to be frequented by LGBTQ+ people.
comment: Playas reservadas para el uso de personas LGBTQ+ o playas conocidas por ser frecuentadas por personas LGBTQ+. @es
broader: LGBTQ+ meeting places
narrower: Bisexual beaches
narrower: Gay beaches
narrower: Lesbian beaches
narrower: Nude beaches
narrower: Queer beaches
narrower: Transgender beaches
has top concept: LGBTQ+ meeting places
replaces: beachesLGBTQ
issued: 2019-05-14
modified: 2025-02-23
type: Concept
in scheme: v3
change note: Version 4.1.0

Bears (Gay culture)
preferred label: Osos (Cultura gay) @es
alternative label: Bear men
alternative label: Bears
alternative label: Hombres osos @es
alternative label: Osos @es
comment: Slang used in the U.S. and other English speaking countries to describe hairy and large or muscular gay men.
comment: Jerga utilizada en EE.UU. y otros países angloparlantes para describir a hombres gay peludos y grandes o musculosos. @es
broader: Gay culture
broader: Gay men
broader: Gender roles
broader: Sexual identity
narrower: Cubs (Gay culture)
related: Chubs (Gay culture)
related: Gender expression
related: Goldilocks (Gay culture)
related: Otters (Gay culture)
related: Pups (Roleplay)
related: Wolves (Gay culture)
related: Bara
related: Bara fandom
related: Bear bars
has top concept: Subcultures
replaces: bears
issued: 2019-05-14
modified: 2025-02-23
type: Concept
in scheme: v3
change note: Version 4.1.0

Behavioral therapy
preferred label: Terapia conductual @es
preferred label: Behavioural therapy
alternative label: Terapia de comportamiento @es
alternative label: Terapia de conducta @es
comment: Therapeutic techniques and treatments derived from cognitive psychology that are designed to identify and potentially change behaviors perceived as self-destructive or unhealthy. Includes behavioral therapy intended to alter an individual's sexual or gender identity or expression.
comment: Técnicas y tratamientos terapéuticos derivados de la psicología cognitiva diseñados para identificar y potencialmente cambiar conductas percibidas como autodestructivas o poco saludables. Incluye la terapia conductual destinada a modificar la identidad o expresión sexual o de género de una persona. @es
broader: Therapies
narrower: Aversion therapy
narrower: Conversion therapy
has top concept: Medical care
replaces: behaviouralTherapy
issued: 2019-05-14
modified: 2025-02-23
type: Concept
in scheme: v3
change note: Version 4.1.0

Being in love
preferred label: LGBTQ+ love
preferred label: Amor LGBTQ+ @es
related: Relationship satisfaction
related: Love triangles
related: Queer desire
is replaced by: homoit0000894
replaces: beingInLove
replaces: LGBTQLove
issued: 2019-05-14
modified: 2022-10-13
modified: 2026-02-27
type: Concept
in scheme: v3
change note: Version 4.1.0
alternative label: LGBTQ love
alternative label: Love (LGBTQ)
alternative label: Amor LGBTQ @es
alternative label: Amor (LGBTQ) @es
comment: Strong feelings of affection arising out of kinship, personal ties, or intimate relationships between two or more LGBTQ+ people. Can be used to describe the particularities of love as experienced by LGBTQ+ people in a given culture, as well as the ways love is discussed and expressed within LGBTQ+ communities.
comment: Fuertes sentimientos de afecto que surgen del parentesco, los vínculos personales o las relaciones íntimas entre dos o más personas LGBTQ+. Puede utilizarse para describir las particularidades del amor experimentado por las personas LGBTQ+ en una cultura determinada, así como las formas en que se discute y expresa el amor dentro de las comunidades LGBTQ+. @es
narrower: LGBTQ+ platonic love
narrower: LGBTQ+ unrequited love

Bi+ people
preferred label: Personas bi+ @es
comment: Individuals who are not exclusively sexually and/or romantically attracted to individuals of a single biological sex (includes bisexual, queer, pansexual, and fluid identities).
comment: Personas que no sienten una atracción sexual y/o romántica exclusiva por personas de un único sexo biológico (incluye las identidades bisexuales, queer, pansexuales y fluidas). @es
broader: LGBTQ+ people
narrower: Bisexual people
narrower: Pansexual people
narrower: Queer people
narrower: Polysexual people
related: Sexual minorities
has top concept: LGBTQ+ people
replaces: bi+People
issued: 2019-05-14
modified: 2025-02-23
type: Concept
in scheme: v3
change note: Version 4.1.0

Hate crimes
preferred label: Crímenes de odio @es
alternative label: Bias-related crimes
comment: Criminal acts motivated by the victim’s actual or perceived race, nationality, religion, sexual identity, gender identity, or ability status.
comment: Actos delictivos motivados por la raza, nacionalidad, religión, identidad sexual, identidad de género o estado de capacidad real o percibido de la víctima. @es
related: Anti-bisexual violence
related: Anti-gay violence
related: Anti-lesbian violence
related: Anti-queer violence
related: Anti-transgender violence
related: Intolerance towards LGBTQ+ people
related: Hate speech
related: LGBTQ+ victims of hate crimes
related: Murders of LGBTQ+ people
related: Anti-Two-Spirit violence
related: Anti-intersex violence
related: Anti-asexual violence
related: Anti-sex worker violence
related: Murder of sex workers
replaces: hateCrimes
issued: 2019-05-14
modified: 2025-02-23
type: Concept
in scheme: v3
change note: Version 4.1.0

Bigender identity
preferred label: Identidad bigénero @es
comment: Term used to describe the identities of people who have two genders.
comment: Término utilizado para describir la identidad de personas que tienen dos géneros. @es
broader: Gender identity
related: Bigender people
related: Genderfluid identity
has top concept: Gender
replaces: bigenderIdentity
issued: 2019-05-14
modified: 2025-02-23
type: Concept
in scheme: v3
change note: Version 4.1.0

Bigender people
preferred label: Personas bigénero @es
comment: People who identify as any two genders, either simultaneously or more fluidly.
comment: Personas que seautoidentificancon dos géneros, ya sea simultáneamente o de forma más fluida. @es
broader: Transgender people
related: Bigender identity
related: Genderfluid people
has top concept: LGBTQ+ people
replaces: bigenderPeople
issued: 2019-05-14
modified: 2025-02-23
type: Concept
in scheme: v3
change note: Version 4.1.0

Intolerance towards LGBTQ+ people
preferred label: Intolerancia hacia personas LGBTQ+ @es
alternative label: Bigotry towards LGBTQ people
alternative label: Prejudice towards LGBTQ people
alternative label: Intolerance towards LGBTQ people
comment: Unwillingness to accept or affirm LGBTQ+ people or their identities in attitude or practice.
comment: Renuencia a aceptar o afirmar a las personas LGBTQ+ o sus identidades en actitud o en práctica. @es
related: Hate crimes
related: Hate speech
related: LGBTQ+ discrimination
related: Homonationalism
related: Misandry
related: Misogyny
related: Stigma
related: Anti-Two-Spirit discrimination
related: Transmisogyny
related: Anti-intersex discrimination
related: Transmisogynoir
related: Anti-asexual discrimination
replaces: intoleranceTowardsLGBTQPeople
issued: 2019-05-14
modified: 2025-02-23
type: Concept
in scheme: v3
change note: Version 4.1.0

Binabae
comment: Tagalog term for individuals who possess both male and female traits.
comment: Término tagalog para designar a una persona con rasgos tanto masculinos como femeninos. @es
broader: Non-Euro-American gender and sexual identities
has top concept: Gender
replaces: binabae
issued: 2019-05-14
modified: 2025-02-23
type: Concept
in scheme: v3
change note: Version 4.1.0

Binding (Chest)
preferred label: Fajarse el pecho @es
alternative label: Binding @es
alternative label: Faja @es
alternative label: Práctica de fajado de pecho @es
alternative label: Vendarse el pecho @es
comment: The act of flattening or concealing the chest area with a tight fitting shirt, strap, or similar material; often practiced by transgender men and transmasculine people.
comment: El acto de aplanar u ocultar la zona del pecho con una camisa ajustada, una correa o un material similar; suele practicarse por hombres transgénero o personas transmasculinas. @es
broader: Gender expression
related: Breast
related: FtMs
related: Trans men
related: Top surgery
related: Stand-to-Pee devices
related: Chest
related: Binders (Chest)
has top concept: Gender
replaces: bindingChest
issued: 2019-05-14
modified: 2025-02-23
type: Concept
in scheme: v3
change note: Version 4.1.0

Essentialism
preferred label: Esencialismo @es
alternative label: Biological essentialism
alternative label: Esencialismo biológico @es
comment: The practice of defining certain categories through a set of supposed universal or fixed characteristics or traits (e.g., defining women in terms of "female" genitalia).
comment: La práctica de definir ciertas categorías a través de un conjunto de características o rasgos supuestamente universales o fijos (por ejemplo, definir a las mujeres en términos de genitales "femeninos"). @es
broader: Theories
narrower: Trans-exclusionary radical feminism
related: Queer theory
related: Sexual identity
related: Social constructionism
related: Patriarchy
has top concept: Theories
replaces: essentialism
issued: 2019-05-14
modified: 2025-02-23
type: Concept
in scheme: v3
change note: Version 4.1.0

Biological parenthood
preferred label: Maternidad y paternidad biológica @es
alternative label: Maternidad biológica @es
alternative label: Paternidad biológica @es
comment: The experience of being a biological parent to a child. This relationship can be genetic, gestational, or both.
comment: Persona que tiene una relación biológica con un hijo o hijos. Esta relación puede ser genética, gestacional o ambas. @es
broader: LGBTQ+ biological parents
broader: LGBTQ+ parenthood
narrower: Genetic parenthood
narrower: Gestational parenthood
related: Birth parents
related: Donors
related: Social parenthood
related: Motherhood
related: Fatherhood
related: Donor siblings
related: Half-siblings
has top concept: LGBTQ+ families
replaces: biologicalParenthood
issued: 2019-05-14
modified: 2025-02-23
type: Concept
in scheme: v3
change note: Version 4.1.0

Biphobia
preferred label: Bifobia @es
comment: Antagonism or disgust directed toward bisexuality as an identity or bisexual people due to their sexuality. Biphobia can include denial of the existence of bisexuality, stereotypes, verbal harassment, and physical violence.
comment: Antagonismo o repugnancia dirigida hacia la bisexualidad como identidad o hacia las personas bisexuales por su sexualidad. La bifobia puede incluir la negación de la existencia de la bisexualidad, los estereotipos, el acoso verbal y la violencia física. @es
broader: LGBTQ+ phobia
narrower: Internalized biphobia
related: Anti-bisexual discrimination
related: Anti-bisexual violence
related: Bisexual people
related: Heterosexism
has top concept: LGBTQ+ phobia
replaces: biphobia
issued: 2019-05-14
modified: 2025-02-23
type: Concept
in scheme: v3
change note: Version 4.1.0

Birth certificate amendments
preferred label: Enmiendas al certificado de nacimiento @es
comment: Formal changes to an individual's birth certificate, typically to reflect a change to the individual's legal name or gender or sex marker.
comment: Cambios formales al certificado de nacimiento de una persona, normalmente para reflejar un cambio en su nombre legal, o de su marca de género o sexo. @es
broader: Birth certificates
related: Assigned gender
related: Gender assigned at birth
related: LGBTQ+ personal and family law
has top concept: Legal status
replaces: birthCertificateAmendments
issued: 2019-05-14
modified: 2025-02-23
type: Concept
in scheme: v3
change note: Version 4.1.0

Birth certificates
preferred label: Certificados de nacimiento @es
comment: Legal documents issued to record an individual’s birth, typically including identifying information such as the individual's name, assigned gender or sex, date and location of birth, and parentage.
comment: Documentos legales expedidos para registrar el nacimiento de una persona, que suelen incluir información identificativa como el nombre de la persona, el sexo o género asignado, la fecha y el lugar de nacimiento y el parentesco. @es
broader: Official documentation
narrower: Birth certificate amendments
narrower: Gender markers
related: Gender assigned at birth
related: Legal name change
related: Court orders
related: Medical practitioners' statements
related: Social security cards
related: Transitioning (Gender)
has top concept: Legal status
replaces: birthCertificates
issued: 2019-05-14
modified: 2025-03-20
type: Concept
in scheme: v3
change note: Version 4.1.0

Gender assigned at birth
preferred label: Género asignado al nacer @es
alternative label: Birth gender
alternative label: Natal gender
alternative label: GAAB
alternative label: Assigned gender at birth
alternative label: AGAB
alternative label: Designated gender at birth
alternative label: DGAB
alternative label: Gender at birth
comment: The legal gender marker recorded in birth-related certifications and registries. Often but not always used synonymously with “sex assigned at birth." Also used in reference to the gendered roles and expectations associated with said gender marker.
comment: El marcador legal de género registrado en las certificaciones y registros relacionados con el nacimiento. A menudo, pero no siempre, se utiliza como sinónimo de "sexo asignado al nacer". También se utiliza en referencia a los roles de género y las expectativas asociadas con dicho marcador de género. @es
broader: Assigned gender
related: Birth certificate amendments
related: Birth certificates
related: Cisgender people
related: Gender dysphoria
related: Gender markers
related: Sex assigned at birth
related: Transgender people
related: Gender euphoria
has top concept: Gender
replaces: genderAssignedAtBirth
issued: 2019-05-14
modified: 2025-02-23
type: Concept
in scheme: v3
change note: Version 4.1.0

Birth parents
preferred label: Madres y padres biológicos @es
alternative label: Madres biológicas @es
alternative label: Padres biológicos @es
comment: Biological or genetic parents of a child or children placed for adoption.
comment: Padres y/o madres biológicos o genéticos del niño o niños dados en adopción. @es
broader: Gestational parenthood
broader: Parents
narrower: LGBTQ+ birth parents
related: Adoptive parents
related: Biological parenthood
related: LGBTQ+ adoption
related: LGBTQ+ adoptive parents
related: LGBTQ+ biological parents
related: Conception by LGBTQ+ people
has top concept: LGBTQ+ families
replaces: birthParents
issued: 2019-05-14
modified: 2025-02-23
type: Concept
in scheme: v3
change note: Version 4.1.0

Bisexual activism
preferred label: Activismo bisexual @es
comment: Direct action and organizing to achieve political or social change and acceptance for bisexuality.
comment: Acción directa y organización para lograr el cambio político o social y la aceptación de la bisexualidad. @es
broader: LGBTQ+ activism
related: Bisexual information centers
related: Bisexual movement
related: Bisexual political activists
related: Bisexual rights
has top concept: LGBTQ+ activism
replaces: bisexualActivism
issued: 2019-05-14
modified: 2025-02-23
type: Concept
in scheme: v3
change note: Version 4.1.0

African American bisexual people
preferred label: Personas bisexuales afroamericanas @es
alternative label: Bisexual African American people
alternative label: Bisexual African Americans
alternative label: Afroamericanos bisexuales @es
alternative label: Bisexuales afroamericanos @es
alternative label: Afroamericanas bisexuales @es
alternative label: Bisexuales afroamericanas @es
comment: Bisexual people of African descent born in the United States or bisexual people born in African countries who live in or have a strong connection to the United States. Use for individuals who self-identity as African American. Follow the individual’s preference for African American or Black whenever possible.
comment: Personas bisexuales de ascendencia africana nacidas en los Estados Unidos o personas bisexuales nacidas en países africanos que viven o tienen una conexión fuerte con los Estados Unidos. Utilícese para personas que se autoidentifiquen como afroamericanas. @es
broader: African American LGBTQ+ people
broader: Black bisexual people
related: Down-low
has top concept: LGBTQ+ people
replaces: bisexualAfricanAmericans
issued: 2019-05-14
modified: 2025-02-23
type: Concept
in scheme: v3
change note: Version 4.1.0

Afro-Canadian bisexual people
preferred label: Personas bisexuales afrocanadienses @es
alternative label: Bisexual Afro-Canadian people
alternative label: Bisexual Afro-Canadians
alternative label: Afrocanadienses bisexuales @es
alternative label: Bisexuales afrocanadienses @es
comment: Bisexual people of African descent born in Canada or bisexual people born in African countries who live in or have a strong connection to Canada. Use for individuals who self-identify as Afro-Canadian.
comment: Personas bisexuales de ascendencia africana nacidas en Canadá o personas bisexuales nacidas en países africanos que viven o tienen una conexión fuerte con Canadá. Utilícese para personas que se autoidentifiquen como afrocanadienses. @es
broader: Afro-Canadian LGBTQ+ people
broader: Black bisexual people
has top concept: LGBTQ+ people
replaces: bisexualAfroCanadians
issued: 2019-05-14
modified: 2025-02-23
type: Concept
in scheme: v3
change note: Version 4.1.0

Afro-Caribbean bisexual people
preferred label: Personas bisexuales afrocaribeñas @es
alternative label: Bisexual Afro-Caribbean people
alternative label: Bisexual Afro-Caribbeans
alternative label: Personas afrocaribeñas bisexuales @es
alternative label: Afrocaribeños bisexuales @es
alternative label: Afrocaribeñas bisexuales @es
comment: Bisexual people of African descent born in the Caribbean or bisexual people born in African countries who live in or have a strong connection to the Caribbean. Only use for individuals who self-identify as Afro-Caribbean.
comment: Personas bisexuales de ascendencia africana nacidas en el Caribe o personas bisexuales nacidas en países africanos que viven o tienen una conexión fuerte con el Caribe. Utilícese únicamente para personas que se identifiquen como afrocaribeñas. @es
broader: Afro-Caribbean LGBTQ+ people
broader: Black bisexual people
has top concept: LGBTQ+ people
replaces: bisexualAfroCaribbeans
issued: 2019-05-14
modified: 2025-02-23
type: Concept
in scheme: v3
change note: Version 4.1.0

Afro-European bisexual people
preferred label: Personas bisexuales afroeuropeas @es
alternative label: Bisexual Afro-European people
alternative label: Bisexual Afro-Europeans
alternative label: Personas afroeuropeas bisexuales @es
alternative label: Afroeuropeos bisexuales @es
alternative label: Afroeuropeas bisexuales @es
comment: Bisexual people of African descent born in European countries or bisexual people born in African countries who live in or have a strong connection to Europe. Only use for individuals who self-identify as Afro-European.
comment: Personas bisexuales de ascendencia africana nacidas en países europeos o personas bisexuales nacidas en países africanos que viven o tienen una conexión fuerte con Europa. Utilícese únicamente para personas que se identifiquen como afroeuropeas. @es
broader: Afro-European LGBTQ+ people
broader: Black bisexual people
has top concept: LGBTQ+ people
replaces: bisexualAfroEuropeans
issued: 2019-05-14
modified: 2025-02-23
type: Concept
in scheme: v3
change note: Version 4.1.0

Afro-Latin American bisexual people
preferred label: Personas bisexuales afrolatinoamericanas @es
alternative label: Bisexual Afro-Latin Americans
alternative label: Personas afrolatinoamericanas bisexuales @es
alternative label: Afrolatinoamericanos bisexuales @es
alternative label: Afrolatinoamericanas bisexuales @es
comment: Bisexual people of African descent born in Latin American countries or bisexual people born in African countries who live in or have a strong connection to Latin America. Only use for individuals who self-identify as Afro-Latin American.
comment: Personas bisexuales afrodescendientes nacidas en países latinoamericanos o personas bisexuales nacidas en países africanos que viven o tienen una fuerte conexión con América Latina. Utilícese únicamente para personas que se identifiquen como afrolatinoamericanas. @es
broader: Afro-Latin American LGBTQ+ people
broader: Black bisexual people
has top concept: LGBTQ+ people
replaces: bisexualAfroLatinAmericans
issued: 2019-05-14
modified: 2025-02-23
type: Concept
in scheme: v3
change note: Version 4.1.0

Bisexual archives
preferred label: Archivos bisexuales @es
comment: Collections of records and materials relating to bisexual people or bisexual communities; can include a variety of organizations and institutions from community to government archives.
comment: Colecciones de registros y materiales relacionados con personas bisexuales o comunidades bisexuales; pueden incluir una variedad de organizaciones e instituciones, desde archivos comunitarios hasta gubernamentales. @es
broader: LGBTQ+ archives
has top concept: LGBTQ+ cultural heritage institutions
replaces: bisexualArchives
issued: 2019-05-14
modified: 2025-02-23
type: Concept
in scheme: v3
change note: Version 4.1.0

Bisexual artists
preferred label: Artistas bisexuales @es
comment: Bisexual people who practice any of various creative arts.
comment: Artistas conocidos por ser bisexuales. @es
broader: LGBTQ+ artists
has top concept: LGBTQ+ people
replaces: bisexualArtists
issued: 2019-05-14
modified: 2025-02-23
type: Concept
in scheme: v3
change note: Version 4.1.0

Asian American bisexual people
preferred label: Personas bisexuales asiático-americanas @es
alternative label: Bisexual Asian American people
alternative label: Bisexual Asian Americans
alternative label: Personas asiático-americanas bisexuales @es
alternative label: Asiático-americanos bisexuales @es
alternative label: Asiático-americanas bisexuales @es
comment: Bisexual people of Asian heritage or descent born in the United States or born in Asian countries who live in or have a strong connection to the United States. Only use for individuals who self-identify as Asian American.
comment: Personas bisexuales de herencia o ascendencia asiática nacidas en Estados Unidos o personas bisexuales nacidas en países asiáticos que viven en o tienen una conexión fuerte con los Estados Unidos. Utilícese para personas que se autoidentifiquen como asiático-americanas. @es
broader: Asian American LGBTQ+ people
broader: Asian bisexual people
has top concept: LGBTQ+ people
replaces: bisexualAsianAmericans
issued: 2019-05-14
modified: 2025-02-23
type: Concept
in scheme: v3
change note: Version 4.1.0

Asian bisexual people
preferred label: Personas bisexuales asiáticas @es
alternative label: Bisexual Asian people
alternative label: Bisexual Asians
alternative label: Personas asiáticas bisexuales @es
alternative label: Asiáticos bisexuales @es
alternative label: Asiáticas bisexuales @es
comment: Bisexual people of Asian heritage or descent, living in Asia or part of the Asian diaspora. Only use for people who self-identify as Asian.
comment: Personas bisexuales nacidas en países asiáticos o descendientes de ellos. Utilícese únicamente para personas que se autoidentifiquen como asiáticas. @es
broader: Asian LGBTQ+ people
narrower: Asian American bisexual people
has top concept: LGBTQ+ people
replaces: bisexualAsians
issued: 2019-05-14
modified: 2025-02-23
type: Concept
in scheme: v3
change note: Version 4.1.0

Bisexual atheists
preferred label: Ateos bisexuales @es
comment: Bisexual people who are atheists.
comment: Personas bisexuales que son ateas. @es
broader: LGBTQ+ atheists
has top concept: LGBTQ+ people
replaces: bisexualAtheists
issued: 2019-05-14
modified: 2025-02-23
type: Concept
in scheme: v3
change note: Version 4.1.0

Bisexual bars
preferred label: Bares bisexuales @es
alternative label: Barras bisexuales @es
comment: Drinking establishments that primary cater to bisexual people.
comment: Establecimientos para beber que atienden principalmente a personas bisexuales. @es
broader: LGBTQ+ bars
related: Bisexual people
has top concept: LGBTQ+ meeting places
replaces: bisexualBars
issued: 2019-05-14
modified: 2026-01-24
type: Concept
in scheme: v3
change note: Version 4.1.0

Bisexual beaches
preferred label: Playas bisexuales @es
comment: Beaches set aside for use by bisexual people or beaches known to be frequented by bisexual people.
comment: Playas reservadas para el uso de personas bisexuales o playas conocidas por ser frecuentadas por personas bisexuales. @es
broader: LGBTQ+ beaches
related: Bisexual people
has top concept: LGBTQ+ meeting places
replaces: bisexualBeaches
issued: 2019-05-14
modified: 2025-02-23
type: Concept
in scheme: v3
change note: Version 4.1.0

Black bisexual people
preferred label: Personas bisexuales negras @es
alternative label: Bisexual Black people
alternative label: Personas negras bisexuales @es
comment: Black people who are bisexual. Use only for individuals who self-identity as Black. Follow the individual’s preference for African American or Black whenever possible.
comment: Personas negras que son bisexuales. Utilícese únicamente para personas que se autoidentifiquen como negras. Siga la preferencia de la persona sobre el uso de "afroamericanos" o "negros" siempre que sea posible. @es
broader: Black LGBTQ+ people
narrower: African American bisexual people
narrower: Afro-Canadian bisexual people
narrower: Afro-Caribbean bisexual people
narrower: Afro-European bisexual people
narrower: Afro-Latin American bisexual people
has top concept: LGBTQ+ people
replaces: bisexualBlackPeople
issued: 2019-05-14
modified: 2025-02-23
type: Concept
in scheme: v3
change note: Version 4.1.0

Bisexual bookshops
preferred label: Librerías bisexuales @es
comment: Bookshops that sell materials intended for use by bisexual people or addressing topics related to bisexuality.
comment: Librerías que venden materiales destinados a personas bisexuales o que abordan temas relacionados con la bisexualidad. @es
broader: LGBTQ+ bookshops
related: Bisexual people
has top concept: LGBTQ+ bookshops
replaces: bisexualBookshops
issued: 2019-05-14
modified: 2025-02-23
type: Concept
in scheme: v3
change note: Version 4.1.0

Bisexual boys
preferred label: Niños bisexuales @es
comment: Boys (typically children younger than 18) who are bisexual.
comment: Niños (normalmente menores de 18 años) que son bisexuales. @es
broader: Bisexual children
broader: Bisexual youth
broader: Boys
has top concept: LGBTQ+ people
replaces: bisexualBoys
issued: 2019-05-14
modified: 2025-02-23
type: Concept
in scheme: v3
change note: Version 4.1.0

Bisexual Buddhists
preferred label: Budistas bisexuales @es
comment: Bisexual people who are Buddhist.
comment: Personas bisexuales que son budistas. @es
broader: LGBTQ+ Buddhists
has top concept: LGBTQ+ African religions
replaces: bisexualBuddhists
issued: 2019-05-14
modified: 2025-02-23
type: Concept
in scheme: v3
change note: Version 4.1.0

Bisexual characters
preferred label: Personajes bisexuales @es
comment: Characters in creative works who are bisexual.
comment: Personajes en obras creativas que son bisexuales. @es
broader: LGBTQ+ characters
related: Bisexual children
related: Bisexual drama
related: Bisexual fiction
related: Bisexual people
related: Bisexual television
related: Asexual fiction
related: Greyromantic fiction
has top concept: LGBTQ+ characters
replaces: bisexualCharacters
issued: 2019-05-14
modified: 2025-02-23
type: Concept
in scheme: v3
change note: Version 4.1.0

Bisexual children
preferred label: Niños bisexuales @es
alternative label: Niñas bisexuales @es
alternative label: Niñxs bisexuales @es
comment: Bisexual people who have not yet reached the age of adolescence.
comment: Niños menores de 18 años que se autoidentifican como bisexuales. @es
broader: Bisexual people
broader: LGBTQ+ children
narrower: Bisexual boys
narrower: Bisexual girls
related: Bisexual characters
related: Bisexual identity
has top concept: LGBTQ+ people
replaces: bisexualChildren
issued: 2019-05-14
modified: 2025-02-23
type: Concept
in scheme: v3
change note: Version 4.1.0

Bisexual Christians
preferred label: Cristianos bisexuales @es
alternative label: Cristianas bisexuales @es
alternative label: Cristianxs bisexuales @es
comment: Bisexual people who are Christian.
comment: Personas bisexuales que son cristianas. @es
broader: LGBTQ+ Christians
has top concept: LGBTQ+ African religions
replaces: bisexualChristians
issued: 2019-05-14
modified: 2025-02-23
type: Concept
in scheme: v3
change note: Version 4.1.0

Bisexual clergy
preferred label: Clero bisexual @es
comment: Bisexual people who are ordained for religious duties, particularly in the Christian Church.
comment: Personas bisexuales que son ordenadas para deberes religiosos, particularmente en la Iglesia cristiana. @es
broader: LGBTQ+ clergy
related: Celibacy
related: Gay clergy
related: Lesbian clergy
related: Queer clergy
related: Transgender clergy
has top concept: LGBTQ+ clergy
replaces: bisexualClergy
issued: 2019-05-14
modified: 2025-02-23
type: Concept
in scheme: v3
change note: Version 4.1.0

Bisexual community
preferred label: Comunidad bisexual @es
comment: Groups of people who share the experience of being bisexual.
comment: Grupos de personas que comparten la experiencia de ser bisexual. @es
broader: LGBTQ+ communities
related: Bisexual people
related: LGBT
related: LGB
related: LGBTI
related: LGBTQ
related: LGBTQ+
related: LGBTQIA
related: 2SLGBTQ+
has top concept: LGBTQ+ communities
replaces: bisexualCommunity
issued: 2019-05-14
modified: 2025-02-23
type: Concept
in scheme: v3
change note: Version 4.1.0

Bisexual community centers
preferred label: Centros comunitarios bisexuales @es
preferred label: Bisexual community centres
comment: Spaces in which people from bisexual communities meet for social, education, recreational, or organizing activities.
comment: Espacios en los que personas de comunidades bisexuales se reúnen para actividades sociales, educativas, recreativas u organizativas. @es
broader: LGBTQ+ community centers
related: Bisexual people
has top concept: LGBTQ+ centers
replaces: bisexualCommunityCentres
issued: 2019-05-14
modified: 2025-02-23
type: Concept
in scheme: v3
change note: Version 4.1.0

Bisexual couples
preferred label: Parejas bisexuales @es
comment: Partnerships in which both people are bisexual.
comment: Relaciones en las que ambas personas son bisexuales. @es
broader: LGBTQ+ couples
related: Bisexual relationships
has top concept: Relationship satisfaction
replaces: bisexualCouples
issued: 2019-05-14
modified: 2025-02-23
type: Concept
in scheme: v3
change note: Version 4.1.0

Bisexual daughters
preferred label: Hijas bisexuales @es
comment: Daughters who identify as bisexual.
comment: Hijas que se autoidentifican como bisexuales. @es
broader: LGBTQ+ daughters
has top concept: LGBTQ+ people
replaces: bisexualDaughters
issued: 2019-05-14
modified: 2025-02-23
type: Concept
in scheme: v3
change note: Version 4.1.0

Bisexual information centers
preferred label: Identidad bisexual @es
preferred label: Bisexual information centres
comment: Institutions providing education, support, and information about bisexuality and bisexual communities to bisexual people.
comment: Término utilizado para describir la identidad sexual de personas que se sienten atraídas romántica y/o sexualmente por personas de más de un género y que prefieren el término bisexual a alternativas como pansexual, polisexual, etc. @es
broader: LGBTQ+ information centers
related: Bisexual activism
related: Bisexual movement
has top concept: LGBTQ+ centers
replaces: bisexualInformationCentres
issued: 2019-05-14
modified: 2025-02-23
type: Concept
in scheme: v3
change note: Version 4.1.0

Bisexual dominatrices
preferred label: Dominantes bisexuales @es
alternative label: Amos bisexuales @es
comment: Women who take a dominant role in BDSM activities; use for dominatrices who identify as bisexual.
comment: Personas bisexuales que forman parte de la escena BDSM y asumen el rol dominante en las relaciones sexuales con una dinámica dominante/sumisa. @es
broader: LGBTQ+ dominatrices
related: Lesbian dominatrices
related: Queer dominatrices
related: Transgender dominatrices
has top concept: Relationship minorities
replaces: bisexualDominatrices
issued: 2019-05-14
modified: 2025-02-23
type: Concept
in scheme: v3
change note: Version 4.1.0

Bisexual drama
preferred label: Dominatrices bisexuales @es
comment: Works of fiction written to be performed; use in reference to dramatic works focusing on bisexual characters or themes.
comment: Mujeres que desempeñan un papel dominante en las actividades del BDSM; utilícese para dominatrices que se autoidentifiquen como bisexuales. @es
broader: LGBTQ+ drama
related: Bisexual characters
related: Bisexual literature
related: Bisexual theater
related: Bisexual authors
has top concept: Subcultures
replaces: bisexualDrama
issued: 2019-05-14
modified: 2025-02-23
type: Concept
in scheme: v3
change note: Version 4.1.0

Bisexual families
preferred label: Literatura erótica bisexual @es
comment: Families, whether biological, adoptive, or chosen, in which one or more individuals identify as bisexual.
comment: Obras literarias que tengan elementos eróticos o sexuales; utilícese en referencia a la literatura erótica que se centra en personajes o temas bisexuales. @es
broader: LGBTQ+ families
related: Bisexual parents
related: Bisexual people
related: Children of bisexual people
has top concept: LGBTQ+ families
replaces: bisexualFamilies
issued: 2019-05-14
modified: 2025-02-23
type: Concept
in scheme: v3
change note: Version 4.1.0

Bisexual fiction
preferred label: Padres bisexuales @es
alternative label: Papás bisexuales @es
comment: Written works describing imagined events or people; use in reference to fictional works focusing on bisexual characters or themes.
comment: Personas bisexuales que son padres. @es
broader: LGBTQ+ fiction
related: Bisexual characters
related: Bisexual literature
related: Bisexual authors
related: Intersex fiction
related: Aromantic fiction
related: Asexual fiction
related: Bisexual people in fandom
related: Greyromantic fiction
has top concept: Subcultures
replaces: bisexualFiction
issued: 2019-05-14
modified: 2026-02-23
type: Concept
in scheme: v3
change note: Version 4.1.0

Bisexual girls
preferred label: Películas bisexuales @es
comment: Girls (typically children younger than 18) who are bisexual.
comment: Películas creadas por directores bisexuales, que representan a personas bisexuales o a personas consideradas importantes dentro de la cultura bisexual. @es
broader: Bisexual children
broader: Bisexual youth
broader: Girls
has top concept: LGBTQ+ people
replaces: bisexualGirls
issued: 2019-05-14
modified: 2025-02-23
type: Concept
in scheme: v3
change note: Version 4.1.0

Bisexual identity
preferred label: Ficción de horror bisexual @es
comment: Term used to describe the sexual identity of individuals who are romantically and/or sexually attracted to people of more than one gender and who prefer the term bisexual over alternatives such as pansexual, polysexual, etc.
comment: Obras de ficción escritas con la intención de asustar, atemorizar o provocar disgusto; utilícese en referencia a la ficción de horror centrada en personajes o temas bisexuales. @es
broader: Sexual identity
related: Bisexual children
related: Bisexual people
has top concept: Sexual identity
replaces: bisexualIdentity
issued: 2019-05-14
modified: 2026-02-24
type: Concept
in scheme: v3
change note: Version 4.1.0

Jewish bisexual people
preferred label: Personas bisexuales judías @es
alternative label: Bisexual Jews
alternative label: Jewish bisexuals
alternative label: Judíos bisexuales @es
alternative label: Bisexuales judíos @es
comment: Bisexual people who are Jewish.
comment: Personas bisexuales que son judías. @es
broader: Jewish LGBTQ+ people
has top concept: LGBTQ+ people
replaces: bisexualJews
issued: 2019-05-14
modified: 2025-02-23
type: Concept
in scheme: v3
change note: Version 4.1.0

Latino/a/x bisexual people
preferred label: Personas bisexuales Latinx @es
alternative label: Bisexual Latinas
alternative label: Bisexual Latine people
alternative label: Bisexual Latinos
alternative label: Bisexual Latinx people
alternative label: Latina bisexual people
alternative label: Latine bisexual people
alternative label: Latino bisexual people
alternative label: Latinx bisexual people
comment: Latin American people who are bisexual; only use to describe individuals who self-identify as Latino, Latina, or Latinx. Do not conflate with Chicano/a/x or Hispanic.
comment: Personas latinoamericanas que son bisexuales; utilícese únicamente para describir a personas que se autoidentifican como latinos, latinas o latinxs. No debe confundirse con chicano/a/x o hispano/a/x. @es
broader: Latino/a/x LGBTQ+ people
has top concept: LGBTQ+ people
replaces: bisexualLatinx
issued: 2019-05-14
modified: 2025-02-23
type: Concept
in scheme: v3
change note: Version 4.1.0

Bisexual libraries
preferred label: Centros de información bisexual @es
comment: Libraries that hold materials primarily pertaining to bisexual people or intended for use by bisexual people.
comment: Instituciones que brindan educación, apoyo e información sobre la bisexualidad y comunidades bisexuales a personas bisexuales. @es
broader: LGBTQ+ libraries
has top concept: LGBTQ+ cultural heritage institutions
replaces: bisexualLibraries
issued: 2019-05-14
modified: 2025-02-23
type: Concept
in scheme: v3
change note: Version 4.1.0

Bisexual literature
preferred label: Crítica literaria bisexual @es
comment: Written literary works about bisexuality, bisexual characters, or bisexual themes.
comment: El estudio, la evaluación y la interpretación de obras literarias centradas en personajes o temas bisexuales; también puede incluir la interpretación de la literatura a través del lente y los marcos teóricos de la bisexualidad. @es
broader: LGBTQ+ literature
related: Bisexual drama
related: Bisexual fiction
related: Bisexual poetry
related: Bisexual authors
related: Asexual fiction
related: Megasexual fiction
related: Greyromantic fiction
related: Bisexual people in literature
has top concept: Subcultures
replaces: bisexualLiterature
issued: 2019-05-14
modified: 2025-04-23
type: Concept
in scheme: v3
change note: Version 4.1.0

Mixed-orientation marriage
preferred label: Matrimonio de orientación mixta @es
alternative label: Bisexual marriage
alternative label: Casamiento bisexual @es
alternative label: Casamiento de orientación mixta @es
comment: Marriages between individuals who do not share the same sexual orientation (e.g., bisexual-heterosexual marriage, allosexual-asexual marriage).
comment: Matrimonios entre personas que no comparten la misma orientación sexual (por ejemplo, matrimonio bisexual-heterosexual, matrimonio alosexual-asexual). @es
broader: Marriage
has top concept: Living arrangements
replaces: mixed-orientationMarriage
issued: 2019-05-14
modified: 2026-02-23
type: Concept
in scheme: v3
change note: Version 4.1.0

Bisexual dominants
preferred label: Literatura bisexual @es
alternative label: Bisexual masters
comment: Bisexual people who are part of the BDSM scene and assume the dominant role in sexual relationships with a dominant/submissive dynamic.
comment: Obras literarias escritas sobre la bisexualidad, personajes bisexuales o temas bisexuales. @es
broader: LGBTQ+ dominants
has top concept: Sexual identity
replaces: bisexualMasters
issued: 2019-05-14
modified: 2025-02-23
type: Concept
in scheme: v3
change note: Version 4.1.0

Bisexual men
preferred label: Amos bisexuales @es
alternative label: Male bisexuals
comment: Men who identify as bisexual.
comment: Personas bisexuales (típicamente hombres) que forman parte de la escena BDSM y asumen el rol de amo en las relaciones sexuales con una dinámica amo/esclavo. @es
broader: Bisexual people
broader: Males
related: Men who have sex with men
related: Queer men
has top concept: LGBTQ+ people
replaces: bisexualMen
issued: 2019-05-14
modified: 2025-02-23
type: Concept
in scheme: v3
change note: Version 4.1.0

Bisexual mistresses
preferred label: Hombres bisexuales @es
comment: Bisexual women who are part of the BDSM scene and assume the mistress role in sexual relationships with a mistress/submissive dynamic.
comment: Hombres que se autoidentifican como bisexuales. @es
broader: LGBTQ+ mistresses (BDSM culture)
related: Lesbian mistresses
related: Queer mistresses
related: Transgender mistresses
has top concept: Sexual identity
replaces: bisexualMistresses
issued: 2019-05-14
modified: 2026-02-24
type: Concept
in scheme: v3
change note: Version 4.1.0

Bisexual movement
preferred label: Madres bisexuales @es
alternative label: Mamás bisexuales @es
comment: Umbrella term for activism focused on the rights of bisexual people and issues faced by bisexual communities.
comment: Personas bisexuales que son madres. @es
broader: LGBTQ+ movement
related: Bisexual activism
related: Bisexual information centers
related: Bisexual press
related: Bisexual demonstrations
has top concept: Social movements
replaces: bisexualMovement
issued: 2019-05-14
modified: 2025-04-17
type: Concept
in scheme: v3
change note: Version 4.1.0

Bisexual museums
preferred label: Movimiento bisexual @es
comment: Institutions dedicated to the storage, exhibition, conservation, and preservation of materials relating to bisexuality, bisexual people, or bisexual history.
comment: Término general para el activismo centrado en los derechos de las personas bisexuales y los problemas que enfrentan las comunidades bisexuales. @es
broader: LGBTQ+ museums
has top concept: LGBTQ+ cultural heritage institutions
replaces: bisexualMuseums
issued: 2019-05-14
modified: 2025-02-23
type: Concept
in scheme: v3
change note: Version 4.1.0

Bisexual Muslims
preferred label: Museos bisexuales @es
comment: Bisexual people who are Muslim.
comment: Instituciones dedicadas al almacenamiento, la exposición, la conservación y la preservación de materiales relacionados con las personas bisexuales y la historia bisexual. @es
broader: LGBTQ+ Muslims
has top concept: LGBTQ+ African religions
replaces: bisexualMuslims
issued: 2019-05-14
modified: 2025-02-23
type: Concept
in scheme: v3
change note: Version 4.1.0

Native American bisexual people
preferred label: Personas bisexuales nativoamericanas @es
alternative label: American Indian bisexual people
alternative label: Bisexual American Indians
alternative label: Bisexual Native Americans
alternative label: Personas nativoamericanas bisexuales @es
comment: People who are part of the Native peoples of the continental United States and Canada (excluding Inuit people) and self-identity as bisexual. Use more specific terms when available.
comment: Personas bisexuales que son nativoamericanas o parte de los pueblos indígenas de Norteamérica; utilícese únicamente para personas que se autoidentifiquen como nativoamericanas y bisexuales. @es
broader: Native American LGBTQ+ people
has top concept: LGBTQ+ people
replaces: bisexualNativeAmericans
issued: 2019-05-14
modified: 2025-02-23
type: Concept
in scheme: v3
change note: Version 4.1.0

Bisexual newsletters
preferred label: Ficción bisexual de misterio y detectives @es
comment: Serialized print or digital periodicals created by or for bisexual people, often with the purpose of sharing news and information related to bisexual communities and bisexual issues.
comment: Obras literarias escritas sobre la investigación de crímenes o el trabajo de detectives; utilícese en referencia a la ficción de misterio y de detectives centrada en personajes y temas bisexuales. @es
broader: Bisexual press
broader: LGBTQ+ newsletters
related: Bisexual newspapers
has top concept: LGBTQ+ press
replaces: bisexualNewsletters
issued: 2019-05-14
modified: 2025-02-23
type: Concept
in scheme: v3
change note: Version 4.1.0

Bisexual newspapers
preferred label: Personas bisexuales neurodivergentes @es
comment: Serialized print or digital publications about bisexuality or bisexual issues (and typically produced by bisexual people or organizations) that contain news, articles, columns, correspondence, and advertisements.
comment: Personas bisexuales cuyos cerebros procesan, aprenden y/o se comportan de manera diferente a lo que la sociedad considera típico. Algunas de estas diferencias neurológicas pueden presentarse como problemas de aprendizaje, trastornos médicos y otras condiciones. @es
broader: Bisexual press
broader: LGBTQ+ newspapers
related: Bisexual newsletters
has top concept: LGBTQ+ press
replaces: bisexualNewspapers
issued: 2019-05-14
modified: 2025-02-23
type: Concept
in scheme: v3
change note: Version 4.1.0

Bisexual Pagans
preferred label: Periódicos bisexuales @es
alternative label: Diarios bisexuales @es
comment: Bisexual people who are members of polytheistic religions or other religions outside of the dominant culture that typically incorporate nature worship and/or the sacred feminine, such as Wicca, Druidry, Heathenry, etc. Use to describe bisexual people who self-identify as Pagan.
comment: Publicaciones impresas o digitales serializadas sobre la bisexualidad o temas bisexuales (y generalmente producidas por personas u organizaciones bisexuales) que contienen noticias, artículos, columnas, correspondencia y anuncios. @es
broader: LGBTQ+ Pagans
related: Bisexual witches
has top concept: LGBTQ+ African religions
replaces: bisexualPagans
issued: 2019-05-14
modified: 2025-02-23
type: Concept
in scheme: v3
change note: Version 4.1.0

Bisexual parents
preferred label: Óperas bisexuales @es
comment: Parents who are bisexual.
comment: Óperas creadas por directores bisexuales, que representan a personas bisexuales o a personas consideradas importantes dentro de la cultura bisexual. @es
broader: Bisexual people
broader: LGBTQ+ parents
related: Bisexual families
related: Children of bisexual people
has top concept: LGBTQ+ people
replaces: bisexualParents
issued: 2019-05-14
modified: 2025-02-23
type: Concept
in scheme: v3
change note: Version 4.1.0

Bisexual people
preferred label: Madres y padres bisexuales @es
alternative label: Bisexuals
alternative label: Madres bisexuales @es
alternative label: Padres bisexuales @es
comment: Individuals who are romantically and/or sexually attracted to more than one gender and who identify as bisexual; do not use to describe pansexual or polysexual people unless they also use the term bisexual.
comment: Padres y/o madres que son bisexuales. @es
broader: Bi+ people
broader: LGBTQ+ people
broader: Sexual minorities
narrower: Bisexual children
narrower: Bisexual men
narrower: Bisexual parents
narrower: Bisexual youth
narrower: Bisexual women
narrower: Closeted bisexual people
narrower: Older bisexual people
narrower: Bisexual college students
related: Biphobia
related: Bisexual bars
related: Bisexual beaches
related: Bisexual bookshops
related: Bisexual characters
related: Bisexual community
related: Bisexual community centers
related: Bisexual families
related: Bisexual identity
related: Parents of bisexual people
related: Bisexuality
related: Pansexual people
related: Persecution of bisexual people
related: Allosexuality
related: Bisexual people in fandom
has top concept: LGBTQ+ people
replaces: bisexualPeople
issued: 2019-05-14
modified: 2025-02-23
type: Concept
in scheme: v3
change note: Version 4.1.0

Bisexual people in the military
preferred label: Personas bisexuales @es
alternative label: Bisexuales @es
comment: Bisexual individuals serving in state and national armed forces.
comment: Personas que se sienten atraídas romántica y/o sexualmente por más de un género y que se autoidentifican como bisexuales; no se debe utilizar para describir a personas pansexuales o polisexuales a menos que también utilicen el término bisexual. @es
broader: LGBTQ+ people in the military
has top concept: Legal status
replaces: bisexualPeopleInTheMilitary
issued: 2019-05-14
modified: 2025-02-23
type: Concept
in scheme: v3
change note: Version 4.1.0

Bisexual people of color
preferred label: Personas bisexuales en el ejército @es
preferred label: Bisexual people of colour
alternative label: Personas bisexuales en las fuerzas armadas @es
comment: Primarily used in the United States, this term refers to bisexual people who are not white and who identify as people of color.
comment: Personas bisexuales que sirven en las fuerzas armadas estatales y nacionales. @es
broader: LGBTQ+ people of color
has top concept: LGBTQ+ people
replaces: bisexualPeopleOfColour
issued: 2019-05-14
modified: 2025-02-23
type: Concept
in scheme: v3
change note: Version 4.1.0

Parents of bisexual people
preferred label: Madres y padres de personas bisexuales @es
alternative label: Bisexual people’s parents
alternative label: Padres de personas bisexuales @es
alternative label: Madres de personas bisexuales @es
comment: People who act as parents to one or more bisexual person. For parents who are themselves bisexual, use the term "Bisexual parents."
comment: Personas que actúan como padres de una o más personas bisexuales. Para padres que son bisexuales, utilice el término "madres y padres bisexuales". @es
broader: Parents of LGBTQ+ people
related: Bisexual people
has top concept: Family members
replaces: parentsOfBisexualPeople
issued: 2019-05-14
modified: 2025-02-23
type: Concept
in scheme: v3
change note: Version 4.1.0

Bisexual poetry
preferred label: Personas bisexuales de color @es
comment: Literary work, typically written in verse, that focuses on bisexual characters, themes, or identity.
comment: Personas bisexuales que no son blancas y que se autoidentifican como personas de color. @es
broader: LGBTQ+ poetry
related: Bisexual literature
related: Bisexual authors
has top concept: Subcultures
replaces: bisexualPoetry
issued: 2019-05-14
modified: 2025-02-23
type: Concept
in scheme: v3
change note: Version 4.1.0

Bisexual political activists
preferred label: Personas bisexuales con enfermedades crónicas @es
alternative label: Personas con enfermedades crónicas bisexuales @es
alternative label: Enfermos crónicos bisexuales @es
alternative label: Enfermas crónicas bisexuales @es
comment: Bisexual individuals working to bring about political or social change through public organizing.
comment: Personas bisexuales que tienen condiciones de salud a largo plazo que requieren atención médica continua y/o que impactan o limitan significativamente la vida diaria; algunas, pero no todas, las personas con enfermedades crónicas se consideran discapacitadas. @es
broader: LGBTQ+ political activists
related: Bisexual activism
has top concept: LGBTQ+ people
replaces: bisexualPoliticalActivists
issued: 2019-05-14
modified: 2025-02-23
type: Concept
in scheme: v3
change note: Version 4.1.0

Bisexual porn films
preferred label: Activistas políticos bisexuales @es
comment: Erotic or sexually explicit films featuring bisexual people.
comment: Personas bisexuales que trabajan para lograr cambios políticos o sociales a través de la organización pública. @es
broader: LGBTQ+ porn films
broader: Bisexual erotic art
related: Bisexual erotic films
has top concept: Subcultures
replaces: bisexualPornFilms
issued: 2019-05-14
modified: 2025-02-23
type: Concept
in scheme: v3
change note: Version 4.1.0

Bisexual press
preferred label: Políticos bisexuales @es
alternative label: Oficiales públicos bisexuales @es
alternative label: Oficiales públicas bisexuales @es
alternative label: Políticas bisexuales @es
comment: Newspapers, magazines, or other publishing outlets aimed at bisexual audiences and/or operated by bisexual people.
comment: Personas bisexuales que son candidatas a cargos públicos, que ejercen cargos públicos o que han desempeñado cargos políticos. Los políticos pueden ser elegidos mediante elección pública o designados de otro modo. @es
broader: LGBTQ+ press
narrower: Bisexual newsletters
narrower: Bisexual newspapers
related: Bisexual movement
related: LGBTQ+ magazines
has top concept: LGBTQ+ press
replaces: bisexualPress
issued: 2019-05-14
modified: 2025-02-23
type: Concept
in scheme: v3
change note: Version 4.1.0

Bisexual sex workers
preferred label: Películas pornográficas bisexuales @es
alternative label: Bisexual prostitutes
alternative label: Bi sex workers
alternative label: Bi prostitutes
alternative label: Bisexual prostitution
alternative label: Bisexual sex work
comment: Bisexual people who receive money or goods in exchange for sexual services, performances, or companionship. Use to describe bisexual people working across the broad spectrum of sex work.
comment: Películas eróticas o sexualmente explícitas protagonizadas por personas bisexuales. @es
broader: LGBTQ+ sex workers
has top concept: Sex workers
replaces: bisexualProstitutes
issued: 2019-05-14
modified: 2025-02-23
type: Concept
in scheme: v3
change note: Version 4.1.0

Bisexual Protestants
preferred label: Prensa bisexual @es
alternative label: Diarios bisexuales @es
comment: Bisexual people who are members of the Protestant church.
comment: Periódicos, revistas u otros medios editoriales dirigidos a audiencias bisexuales y/o operados por personas bisexuales. @es
broader: LGBTQ+ Protestants
has top concept: LGBTQ+ African religions
replaces: bisexualProtestants
issued: 2019-05-14
modified: 2025-02-23
type: Concept
in scheme: v3
change note: Version 4.1.0

Bisexual publishers
preferred label: Trabajadores sexuales bisexuales @es
alternative label: Prostitutos bisexuales @es
alternative label: Trabajadores sexuales bi @es
alternative label: Prostitutos bi @es
alternative label: Prostitución bisexual @es
alternative label: Trabajo sexual bisexual @es
alternative label: Prostitutas bisexuales @es
alternative label: Trabajadoras sexuales bi @es
alternative label: Prostitutas bi @es
alternative label: Trabajadoras sexuales bisexuales @es
comment: Companies and organizations that publish materials for bisexual communities or addressing bisexual issues.
comment: Personas bisexuales que reciben dinero o bienes a cambio de servicios o actuaciones sexuales. Se utiliza para describir a las personas bisexuales que trabajan en el amplio espectro del trabajo sexual. @es
broader: LGBTQ+ publishers
has top concept: LGBTQ+ publishers
replaces: bisexualPublishers
issued: 2019-05-14
modified: 2025-02-23
type: Concept
in scheme: v3
change note: Version 4.1.0

Bisexual radio
preferred label: Protestantes bisexuales @es
comment: Auditory content broadcast on the radio (analog or digital) about bisexuality and bisexual issues.
comment: Personas bisexuales que son miembros de la Iglesia protestante. @es
broader: LGBTQ+ radio
has top concept: LGBTQ+ radio
replaces: bisexualRadio
issued: 2019-05-14
modified: 2026-02-23
type: Concept
in scheme: v3
change note: Version 4.1.0

Bisexual relationships
preferred label: Editoriales bisexuales @es
comment: Ongoing connections (romantic, sexual, or platonic) between two or more bisexual people.
comment: Empresas y organizaciones que publican materiales para comunidades bisexuales o que abordan asuntos bisexuales. @es
broader: Relationship satisfaction
related: Bisexual couples
related: Gay relationships
related: Lesbian relationships
related: Queer relationships
related: Transgender relationships
has top concept: Relationship satisfaction
replaces: bisexualRelationships
issued: 2019-05-14
modified: 2025-02-23
type: Concept
in scheme: v3
change note: Version 4.1.0

Bisexual rights
preferred label: Radio bisexual @es
comment: Legal, social, or ethical principles of freedom or entitlement held by bisexual people.
comment: Contenido auditivo emitido por radio (analógica o digital) sobre la bisexualidad y asuntos bisexuales. @es
broader: LGBTQ+ civil rights
related: Bisexual activism
has top concept: Human rights
replaces: bisexualRights
issued: 2019-05-14
modified: 2025-02-23
type: Concept
in scheme: v3
change note: Version 4.1.0

Bisexual Roman Catholics
preferred label: Relaciones bisexuales @es
comment: Bisexual people who are members of the Roman Catholic Church.
comment: Conexiones continuas (románticas, sexuales o platónicas) entre dos o más personas bisexuales. @es
broader: LGBTQ+ Roman Catholics
has top concept: LGBTQ+ African religions
replaces: bisexualRomanCatholics
issued: 2019-05-14
modified: 2025-02-23
type: Concept
in scheme: v3
change note: Version 4.1.0

Bisexual slang
preferred label: Ciencia ficción bisexual @es
comment: Colloquial or informal language related to bisexuality or used by bisexual people.
comment: Obras literarias escritas sobre conceptos imaginativos o futuristas que incorporen la ciencia, la tecnología, el espacio, los viajes en el tiempo y otros elementos especulativos; utilícese en referencia a la ciencia ficción centrada en personajes o temas bisexuales. @es
broader: LGBTQ+ slang
has top concept: LGBTQ+ slang
replaces: bisexualSlang
issued: 2019-05-14
modified: 2025-02-23
type: Concept
in scheme: v3
change note: Version 4.1.0

Bisexual sons
preferred label: Cuentos cortos bisexuales @es
alternative label: Relatos bisexuales @es
comment: Sons who identify as bisexual.
comment: Obras literarias escritas que son breves y detallan un incidente o concepto autónomo; utilícese en referencia a historias cortas que se centren en personajes o temas bisexuales. @es
broader: LGBTQ+ sons
has top concept: LGBTQ+ people
replaces: bisexualSons
issued: 2019-05-14
modified: 2025-02-23
type: Concept
in scheme: v3
change note: Version 4.1.0

Bisexual studies
preferred label: Jerga bisexual @es
alternative label: Argot bisexual @es
alternative label: Habla bisexual @es
alternative label: Modismos bisexuales @es
comment: Academic field of research and study about bisexuality, bisexual individuals, and bisexual communities.
comment: Lenguaje coloquial o informal relacionado con la bisexualidad o utilizado por personas bisexuales. @es
broader: Gender studies
related: Gay studies
related: Lesbian studies
related: Queer studies
related: Transgender studies
has top concept: Gender studies
replaces: bisexualStudies
issued: 2019-05-14
modified: 2026-02-24
type: Concept
in scheme: v3
change note: Version 4.1.0

Bisexual survivors of hate crimes
preferred label: Estudios bisexuales @es
comment: Bisexual people who have experienced and survived hate crimes; follow the individual's preference for "victims" or "survivors" whenever possible.
comment: Campo académico de investigación y estudio sobre la bisexualidad, personas bisexuales y comunidades bisexuales. @es
broader: Bisexual victims of hate crimes
broader: LGBTQ+ survivors of hate crimes
has top concept: LGBTQ+ people
replaces: bisexualSurvivorsOfHateCrimes
issued: 2019-05-14
modified: 2025-02-23
type: Concept
in scheme: v3
change note: Version 4.1.0

Bisexual survivors of rape
preferred label: Sobrevivientes bisexuales de acoso @es
comment: Bisexual people who have experienced and survived rape; follow the individual's preference for "victims" or "survivors" whenever possible.
comment: Personas bisexuales que han sufrido y sobrevivido al acoso por su identidad sexual; siga la preferencia del individuo sobre el uso de "víctimas" o "sobrevivientes" siempre que sea posible. @es
broader: Bisexual victims of rape
broader: LGBTQ+ survivors of rape
has top concept: LGBTQ+ people
replaces: bisexualSurvivorsOfRape
issued: 2019-05-14
modified: 2025-02-23
type: Concept
in scheme: v3
change note: Version 4.1.0

Bisexual survivors of sexual abuse
preferred label: Sobrevivientes bisexuales de crímenes de odio @es
comment: Bisexual people who have experienced and survived sexual abuse; follow the individual's preference for "victims" or "survivors" whenever possible.
comment: Personas bisexuales que han sufrido y sobrevivido crímenes de odio; siga la preferencia del individuo sobre el uso de "víctimas" o "sobrevivientes" siempre que sea posible. @es
broader: Bisexual victims of sexual abuse
broader: LGBTQ+ survivors of sexual abuse
has top concept: LGBTQ+ people
replaces: bisexualSurvivorsOfSexualAbuse
issued: 2019-05-14
modified: 2025-02-23
type: Concept
in scheme: v3
change note: Version 4.1.0

Bisexual survivors of war
preferred label: Sobrevivientes bisexuales de violación @es
comment: Bisexual people who have experienced and survived war; follow the individual's preference for "victims" or "survivors" whenever possible.
comment: Personas bisexuales que han sufrido y sobrevivido una violación; siga la preferencia del individuo sobre el uso de "víctimas" o "sobrevivientes" siempre que sea posible. @es
broader: Bisexual victims of war
broader: LGBTQ+ survivors of war
has top concept: LGBTQ+ people
replaces: bisexualSurvivorsOfWar
issued: 2019-05-14
modified: 2025-02-23
type: Concept
in scheme: v3
change note: Version 4.1.0

Bisexual youth
preferred label: Juventud bisexual @es
alternative label: Bisexual teenagers
alternative label: Bisexual adolescents
alternative label: Bisexual teens
alternative label: Adolescentes bisexuales @es
alternative label: Jóvenes bisexuales @es
comment: Bisexual people between the ages of childhood and adulthood.
comment: Personas bisexuales entre las edades de la infancia y la edad adulta. @es
broader: Bisexual people
broader: LGBTQ+ youth
narrower: Bisexual boys
narrower: Bisexual girls
related: Bisexual youth literature
has top concept: LGBTQ+ people
replaces: bisexualYouth
issued: 2019-05-14
modified: 2025-02-23
type: Concept
in scheme: v3
change note: Version 4.1.0

Bisexual television
preferred label: Televisión bisexual @es
comment: Television shows featuring bisexual characters or themes.
comment: Programas de televisión con personajes o temas bisexuales. @es
broader: LGBTQ+ television
related: Bisexual characters
has top concept: LGBTQ+ television
replaces: bisexualTelevision
issued: 2019-05-14
modified: 2025-02-23
type: Concept
in scheme: v3
change note: Version 4.1.0

Bisexual theater
preferred label: Teatro bisexual @es
preferred label: Bisexual theatre
comment: Works in the performance arts that focus on bisexual characters, communities, or issues.
comment: Trabajos en las artes escénicas que se centran en personajes, comunidades o problemas bisexuales. @es
broader: LGBTQ+ theater
related: Bisexual drama
has top concept: LGBTQ+ theater
replaces: bisexualTheatre
issued: 2019-05-14
modified: 2025-02-23
type: Concept
in scheme: v3
change note: Version 4.1.0

Bisexual theology
broader: LGBTQ+ theology
has top concept: LGBTQ+ theology
is replaced by: homoit0001218
replaces: bisexualTheology
issued: 2019-05-14
modified: 2022-08-22
type: Concept
in scheme: v3
change note: Version 4.1.0

Bisexual victims of hate crimes
preferred label: Víctimas bisexuales de crímenes de odio @es
comment: Bisexual people who have experienced hate crimes and may or may not have survived; follow the individual's preference for "victims" or "survivors" whenever possible.
comment: Personas bisexuales que han sufrido crímenes de odio y pueden haber sobrevivido o no; siga la preferencia de la persona sobre el uso de "víctimas" o "sobrevivientes" siempre que sea posible. @es
broader: LGBTQ+ victims of hate crimes
narrower: Bisexual survivors of hate crimes
has top concept: LGBTQ+ people
replaces: bisexualVictimsOfHateCrimes
issued: 2019-05-14
modified: 2025-02-23
type: Concept
in scheme: v3
change note: Version 4.1.0

Bisexual victims of rape
preferred label: Víctimas bisexuales de violación @es
comment: Bisexual people who have experienced rape and may or may not have survived; follow the individual's preference for "victims" or "survivors" whenever possible.
comment: Personas bisexuales que han sufrido una violación y pueden haber sobrevivido o no; siga la preferencia de la persona sobre el uso de "víctimas" o "sobrevivientes" siempre que sea posible. @es
broader: LGBTQ+ victims of rape
narrower: Bisexual survivors of rape
has top concept: LGBTQ+ people
replaces: bisexualVictimsOfRape
issued: 2019-05-14
modified: 2025-02-23
type: Concept
in scheme: v3
change note: Version 4.1.0

Bisexual victims of sexual abuse
preferred label: Víctimas bisexuales de abuso sexual @es
comment: Bisexual people who have experienced sexual abuse and may or may not have survived; follow the individual's preference for "victims" or "survivors" whenever possible.
comment: Personas bisexuales que han sufrido abuso sexual y pueden haber sobrevivido o no; siga la preferencia del individuo sobre el uso de "víctimas" o "sobrevivientes" siempre que sea posible. @es
broader: LGBTQ+ victims of sexual abuse
narrower: Bisexual survivors of sexual abuse
has top concept: LGBTQ+ people
replaces: bisexualVictimsOfSexualAbuse
issued: 2019-05-14
modified: 2025-02-23
type: Concept
in scheme: v3
change note: Version 4.1.0

Bisexual victims of war
preferred label: Víctimas bisexuales de guerra @es
comment: Bisexual people who have experienced war and may or may not have survived; follow the individual's preference for "victims" or "survivors" whenever possible.
comment: Personas bisexuales que han sufrido la guerra y que pueden haber sobrevivido o no; siga la preferencia del individuo sobre el uso de "víctimas" o "sobrevivientes" siempre que sea posible. @es
broader: LGBTQ+ victims of war
narrower: Bisexual survivors of war
has top concept: LGBTQ+ people
replaces: bisexualVictimsOfWar
issued: 2019-05-14
modified: 2025-02-23
type: Concept
in scheme: v3
change note: Version 4.1.0

Bisexual victims' rights
preferred label: Derechos de víctimas bisexuales @es
comment: Bisexual people's legal rights to be informed, present, and heard within the criminal justice system after having been harmed or injured as the result of of a crime, accident, or other event.
comment: Los derechos legales de las personas bisexuales a estar informadas, estar presentes y ser escuchadas dentro del sistema de justicia penal después de haber sido perjudicadas o lesionadas como resultado de un delito, una accidente u otro evento. @es
broader: LGBTQ+ victims' rights
has top concept: Law
replaces: bisexualVictimsRights
issued: 2019-05-14
modified: 2025-02-23
type: Concept
in scheme: v3
change note: Version 4.1.0

White bisexual people
preferred label: Personas bisexuales blancas @es
alternative label: Bisexual Caucasian people
alternative label: Bisexual white people
alternative label: Personas caucásicas bisexuales @es
alternative label: Personas blancas bisexuales @es
comment: Bisexual people who are white.
comment: Personas bisexuales que son blancas. @es
broader: White LGBTQ+ people
has top concept: White LGBTQ+ people
replaces: bisexualWhitePeople
issued: 2019-05-14
modified: 2025-02-23
type: Concept
in scheme: v3
change note: Version 4.1.0

Bisexual women
preferred label: Mujeres bisexuales @es
comment: Bisexual individuals who self-identity as women and understand their gender in terms of Western conceptions of womanness, femaleness, and/or femininity.
comment: Personas bisexuales que seautoidentificancomo mujeres y que entienden su género en términos de las concepciones occidentales del ser mujer, la feminidad, y/o la femineidad. @es
broader: Bisexual people
broader: Females
narrower: Mati
related: Women who have sex with women
has top concept: LGBTQ+ people
replaces: bisexualWomen
issued: 2019-05-14
modified: 2025-02-23
type: Concept
in scheme: v3
change note: Version 4.1.0

Bisexual youth literature
preferred label: Literatura juvenil bisexual @es
comment: Written literary works for an audience of readers from 12-18 years of age, also known as young adult literature or YA; use in reference to youth literature focusing on bisexual characters or themes.
comment: Obras literarias escritas para una audiencia de lectores de 12 a 18 años de edad, también conocida como literatura para adultos jóvenes o YA; utilícese en referencia a la literatura juvenil que se centra en personajes o temas bisexuales. @es
broader: LGBTQ+ youth literature
related: Bisexual youth
has top concept: Subcultures
replaces: bisexualYouthLiterature
issued: 2019-05-14
modified: 2025-02-23
type: Concept
in scheme: v3
change note: Version 4.1.0

Bisexuality
preferred label: Bisexualidad @es
comment: Sexual identity that is defined as attraction to more than one gender; follow the individual's preference for bisexuality, pansexuality, or polysexuality whenever possible.
comment: Identidad sexual que se define como atracción hacia más de un género; siga la preferencia de la persona sobre el uso de bisexualidad, pansexualidad o polisexualidad siempre que sea posible @es
broader: Sexual orientation
broader: Polysexuality
narrower: Bicuriosity
related: Bisexual people
related: Homosexuality
related: Lesbianism
related: Polysexual people
has top concept: Sexual orientation
replaces: bisexuality
issued: 2019-05-14
modified: 2025-02-23
type: Concept
in scheme: v3
change note: Version 4.1.0

Bissu
comment: Mentally and physically androgynous shamans in Bugis (Indonesia) culture.
comment: Chamanes mental y físicamente andróginos en la cultura bugis (Indonesia). @es
broader: Non-Euro-American gender and sexual identities
has top concept: Gender
replaces: bissu
issued: 2019-05-14
modified: 2025-02-23
type: Concept
in scheme: v3
change note: Version 4.1.0

Biting (Erotic)
preferred label: Morder @es
comment: Biting, or applying pressure with one's teeth, for the purposes of sexual arousal.
comment: Morder o aplicar presión con los dientes con el fin de provocar excitación sexual. @es
replaces: biting
issued: 2019-05-14
modified: 2025-03-20
type: Concept
in scheme: v3
change note: Version 4.1.0

Biza'ah
comment: Among the Zapotec in Teotitlán del Valle, Mexico, this term refers to people assigned male at birth who exhibit feminine characteristics.
comment: Entre los zapotecas de Teotitlán del Valle, México, este término se refiere a personas asignadas al sexo masculino al nacer y que exhiben características femeninas. @es
broader: Non-Euro-American gender and sexual identities
has top concept: Gender
replaces: bizaah
issued: 2019-05-14
modified: 2025-02-23
type: Concept
in scheme: v3
change note: Version 4.1.0

Black LGBTQ+ people
preferred label: Personas LGBTQ+ negras @es
alternative label: Black people (LGBTQ)
alternative label: LGBTQ+ Black people
alternative label: Personas negras LGBTQ+ @es
alternative label: Personas negras (LGBTQ) @es
comment: Black people who are also LGBTQ+; do not use for people of color broadly; follow the individual's preference for Black or African American whenever possible.
comment: Personas negras que son LGBTQ+. Utilícese únicamente para personas que seautoidentificancomo negras. Siga la preferencia del individuo para el uso de afroamericanos o negros siempre que sea posible. @es
broader: LGBTQ+ people of color
narrower: African American LGBTQ+ people
narrower: Afro-Canadian LGBTQ+ people
narrower: Afro-Caribbean LGBTQ+ people
narrower: Afro-European LGBTQ+ people
narrower: Afro-Latin American LGBTQ+ people
narrower: Black bisexual people
narrower: Black gay men
narrower: Black lesbians
narrower: Black queer people
narrower: Black transgender people
narrower: Blaqueer people
narrower: Black asexual people
narrower: Black intersex people
narrower: Black non-binary people
related: BIPOC
related: Police harassment of Black LGBTQ+ people
related: Black Lives Matter movement
related: Black Trans Lives Matter movement
has top concept: LGBTQ+ people
replaces: blackPeopleLGBTQ
issued: 2019-05-14
modified: 2025-02-23
type: Concept
in scheme: v3
change note: Version 4.1.0

Blindfolds
preferred label: Vendas @es
comment: An accessory used to cover the eyes, traditionally a piece of cloth tied around one’s head to eliminate or limit vision.
comment: Trozos de tela o material similar utilizados para cubrir los ojos de una persona y perjudicar su visión, a menudo para estimulación sexual. @es
broader: Sex accessories
broader: Kink accessories
related: Hoods (Erotic)
related: Sensory deprivation (Erotic)
has top concept: Sex accessories
replaces: blindfolds
issued: 2019-05-14
modified: 2025-02-23
type: Concept
in scheme: v3
change note: Version 4.1.0

Blogs
preferred label: LGBTQ+ blogs
preferred label: Blogs LGBTQ+ @es
comment: Websites or webpages, typically run by individuals or small groups, that are written in an informal or conversational style.
comment: Sitios web o páginas web, generalmente administradas por individuos o grupos pequeños, escritas en un estilo informal o conversacional. @es
comment: Websites featuring informal, often personal writing and reflections created by LGBTQ+ people or about LGBTQ+ communities and issues.
comment: Sitios web que presentan escritos y reflexiones informales, a menudo personales, creados por personas LGBTQ+ o sobre comunidades y cuestiones LGBTQ+. @es
broader: Social media
broader: LGBTQ+ social media
narrower: LGBTQ+ vlogs
has top concept: Social media
has top concept: LGBTQ+ social media
replaces: blogs
replaces: LGBTQBlogs
issued: 2019-05-14
modified: 2025-07-16
modified: 2025-03-20
type: Concept
in scheme: v3
change note: Version 4.1.0
alternative label: LGBTQ blogs
alternative label: Blogs LGBTQ @es

Vampirism (Erotic)
preferred label: Vampirismo (sexo) @es
alternative label: Blood sports
alternative label: Vampire sex
alternative label: Sexo vampiresco @es
comment: Sexual practices or fetishes centering around the "vampire lifestyle"; can be a subset of BDSM communities and include roleplay, the consumption of blood, etc.
comment: Prácticas sexuales o fetiches centrados en el "estilo de vida vampírico"; puede ser un subconjunto de comunidades BDSM e incluir juegos de roles, consumo de sangre, etc. @es
replaces: vampirism
issued: 2019-05-14
modified: 2025-03-20
type: Concept
in scheme: v3
change note: Version 4.1.0

Fellatio
preferred label: Felación @es
alternative label: Blow jobs
alternative label: Cocksucking
alternative label: Penilingus
alternative label: Mamar @es
alternative label: Coito per os @es
alternative label: Chupar @es
comment: A sexual act involving the use of the mouth and tongue to stimulate another person's external genitalia (typically the penis or clitoris).
comment: Un acto sexual que implica el uso de la boca y la lengua para estimular los genitales externos de otra persona (normalmente el pene o el clítoris). @es
broader: Oral sex
broader: Phallic sex
broader: Sex (Act)
broader: Sexual practices
related: Penis
related: 69ing
has top concept: Sex (Act)
replaces: fellatio
issued: 2019-05-14
modified: 2025-02-23
type: Concept
in scheme: v3
change note: Version 4.1.0

Sex dolls
preferred label: Muñecas sexuales @es
alternative label: Blow up dolls
alternative label: Inflatable dolls
alternative label: Muñecas inflables @es
comment: Sex toys designed to mimic parts of or the entirety of the body.
comment: Juguetes sexuales diseñados para imitar partes o la totalidad del cuerpo. @es
broader: Sex accessories
related: Inflation (Erotic)
has top concept: Sex accessories
replaces: sexDolls
issued: 2019-05-14
modified: 2025-02-23
type: Concept
in scheme: v3
change note: Version 4.1.0

Body adornment
preferred label: Adornamentos del cuerpo @es
alternative label: Body decoration
alternative label: Body alteration
alternative label: Body modification
alternative label: Alteraciones corporales @es
alternative label: Decoración corporal @es
alternative label: Modificaciones corporales @es
alternative label: Adornos corporales @es
alternative label: Ornamentación corporal @es
comment: Decoration or alteration of the human body for aesthetic or cultural purposes; includes body paint, tattooing, piercing, and scarification.
comment: Decoración o alteración del cuerpo humano con fines estéticos o culturales; incluye la pintura corporal, los tatuajes, las perforaciones y las escarificaciones. @es
narrower: Piercings
narrower: Tattoos
related: Collars
related: Body modification
replaces: bodyAdornments
issued: 2019-05-14
modified: 2025-02-23
type: Concept
in scheme: v3
change note: Version 4.1.0

Bois
comment: Slang for young masculine or transmasculine people. The term is commonly used in lesbian communities.
comment: Jerga para jóvenes masculinos o transmasculinos. El término se utiliza comúnmente en comunidades lesbianas. @es
related: Butches
related: Female masculinity
related: Lesbians
related: Lesbian slang
related: Transmasculine people
related: Masculine of center
replaces: bois
issued: 2019-05-14
modified: 2025-03-20
type: Concept
in scheme: v3
change note: Version 4.1.0

LGBTQ+ bookshops
preferred label: Librerías LGBTQ+ @es
alternative label: Bookstores (LGBTQ)
alternative label: Bookshops (LGBTQ)
alternative label: Liberías LGBTQ @es
alternative label: Tiendas de libros LGBTQ+ @es
alternative label: Tiendas de libros LGBTQ @es
comment: Bookshops that sell materials intended for use by LGBTQ+ people or addressing LGBTQ+ topics.
comment: Librerías que venden materiales destinados a personas LGBTQ+ o que abordan temas LGBTQ+. @es
narrower: Bisexual bookshops
narrower: Gay bookshops
narrower: Lesbian bookshops
narrower: Queer bookshops
narrower: Transgender bookshops
narrower: Women's bookshops
narrower: Asexual bookshops
narrower: Intersex bookshops
related: LGBTQ+ books
related: LGBTQ+ press
related: Two-Spirit bookshops
replaces: bookshopsLGBTQ
issued: 2019-05-14
modified: 2025-02-23
type: Concept
in scheme: v3
change note: Version 4.1.0

Bootblacking
comment: In the leather and kink communities, the act of cleaning and conditioning leather.
comment: En las comunidades del cuero y las kinky, el acto de limpiar y acondicionar las botas, zapatos o prendas de cuero de alguien. @es
broader: Leather community
related: BDSM
related: Roleplay
related: Uniform fetish
related: Boot fetish
related: Leather fetish
related: Shoe fetish
related: Bootblacks
related: Foot fetish
has top concept: LGBTQ+ communities
replaces: bootblacking
issued: 2019-05-14
modified: 2025-02-23
type: Concept
in scheme: v3
change note: Version 4.1.0

Boston marriages
preferred label: Matrimonios de Boston @es
alternative label: Matrimonios bostonianos @es
comment: The cohabitation of two women (often in a romantic relationship) without the financial support of a man. Originated in New England (USA) in the late 19th century.
comment: La convivencia de dos mujeres (a menudo en una relación romántica) sin el apoyo económico de un hombre. Se originó en Nueva Inglaterra (EE.UU.) a finales del siglo XIX. @es
broader: LGBTQ+ couples
broader: LGBTQ+ historical terms
related: Lesbian couples
has top concept: Relationship satisfaction
replaces: bostonMarriages
issued: 2019-05-14
modified: 2026-02-23
type: Concept
in scheme: v3
change note: Version 4.1.0

Bottoms (Sex)
preferred label: Bottoms (sexo) @es
alternative label: Bottoms
alternative label: Catchers (Sex)
alternative label: Catchers
alternative label: Pasivos @es
comment: The receptive partner during sex or kink activities.
comment: Término de la jerga para personas que se asumen como pareja receptora en encuentros sexuales. @es
broader: Sexual identity
broader: Sexual roles
related: LGBTQ+ submissives
related: Switches (Sex)
related: Tops (Sex)
related: Vers (Sex)
related: Power exchange
related: Kinky people
has top concept: Sexual identity
replaces: bottoms
issued: 2019-05-14
modified: 2025-02-23
type: Concept
in scheme: v3
change note: Version 4.1.0

Boys
preferred label: Niños @es
comment: Children or youth, typically younger than 18 years old, who identify as boys.
comment: Niñez o juventud, normalmente menores de 18 años, que se autoidentifican como niños. @es
broader: Children
narrower: Bisexual boys
narrower: Gay boys
narrower: Heterosexual boys
narrower: Sissies
narrower: Cisgender boys
related: Boys' friendships
related: Gender binaries
has top concept: Family members
replaces: boys
issued: 2019-05-14
modified: 2025-02-23
type: Concept
in scheme: v3
change note: Version 4.1.0

Boys' friendships
preferred label: Amistades entre niños @es
alternative label: Amistades de niños @es
comment: Connections based on affection and trust between two or more boys.
comment: Conexiones basadas en el afecto y la confianza entre dos o más niños. @es
broader: Friendships
broader: Homosociality
related: Boys
has top concept: Relationship satisfaction
replaces: boysFriendships
issued: 2019-05-14
modified: 2025-02-23
type: Concept
in scheme: v3
change note: Version 4.1.0

Breast
preferred label: Seno @es
alternative label: Boobs
alternative label: Bosoms
alternative label: Bosom
alternative label: Tits
alternative label: Titties
alternative label: Boob
alternative label: Breasts
alternative label: Tit
alternative label: Titty
alternative label: Mamas @es
alternative label: Teta @es
alternative label: Tetas @es
alternative label: Bubis @es
alternative label: Chichis @es
comment: One of the two soft, protruding organs on an individual's chest.
comment: Uno de los dos órganos blandos que sobresalen del pecho de una persona. @es
broader: Erogenous body parts
broader: Secondary sex characteristics
related: Binding (Chest)
related: Breast augmentation
related: Breast fetish
related: Breast reduction
related: Breast size
related: Large breasts
related: Mastectomy
related: Small breasts
related: Chest
related: Breast torture
related: Breast play
related: Chest play
has top concept: Erogenous body parts
replaces: breasts
issued: 2019-05-14
modified: 2025-02-23
type: Concept
in scheme: v3
change note: Version 4.1.0

Brothels
preferred label: Burdeles @es
alternative label: Bordellos
comment: Establishments where clients pay to engage in sexual activity with sex workers. Brothels may be illegal, decriminalized, or legal operations.
comment: Establecimientos en los que los clientes pagan para tener relaciones sexuales con trabajadoras sexuales. Los burdeles pueden ser operaciones ilegales, despenalizadas o legales. @es
replaces: brothels
issued: 2019-05-14
modified: 2025-02-23
type: Concept
in scheme: v3
change note: Version 4.1.0

Brotherboys
alternative label: Brothaboys
comment: Indigenous Australian term for people who transition from female to male.
comment: Término indígena australiano para personas que transicionan de mujer a hombre. @es
broader: Non-Euro-American gender and sexual identities
related: FtMs
related: Sistergirls
has top concept: Gender
replaces: brotherboys
issued: 2019-05-14
modified: 2025-02-23
type: Concept
in scheme: v3
change note: Version 4.1.0

LGBTQ+ Buddhists
preferred label: Budistas LGBTQ+ @es
alternative label: Buddhists (LGBTQ)
alternative label: Budistas (LGBTQ) @es
comment: LGBTQ+ people who are Buddhist.
comment: Personas LGBTQ+ que son budistas. @es
broader: LGBTQ+ African religions
narrower: Bisexual Buddhists
narrower: Gay Buddhists
narrower: Lesbian Buddhists
narrower: Queer Buddhists
narrower: Transgender Buddhists
narrower: Asexual Buddhists
narrower: Intersex Buddhists
has top concept: LGBTQ+ African religions
replaces: buddhistsLGBTQ
issued: 2019-05-14
modified: 2025-02-23
type: Concept
in scheme: v3
change note: Version 4.1.0

LGBTQ+ peer support
preferred label: Cuidado de pares LGBTQ+ @es
alternative label: Buddy care for LGBTQ+ people
alternative label: LGBTQ+ buddy care
alternative label: Peer support for LGBTQ+ people
alternative label: Pares @es
alternative label: Cuidado entre pares LGBTQ+ @es
comment: A peer-to-peer form of healthcare support for LGBTQ+ people in which volunteers (sometimes called buddies) attend clinical visits with patients to provide emotional and logistical support.
comment: Una forma de apoyo entre pares para cuidados de salud para personas LGBTQ+ en la que voluntarios (amigos) asisten a visitas clínicas con pacientes para brindarles apoyo emocional y logístico. @es
broader: Health care for LGBTQ+ people
related: HIV/AIDS
related: HIV-positive people
has top concept: Health care for LGBTQ+ people
replaces: buddyCareForLGBTQPeople
issued: 2019-05-14
modified: 2026-03-03
type: Concept
in scheme: v3
change note: Version 4.1.0

Sodomites
preferred label: Sodomitas @es
alternative label: Buggers
comment: Pejorative historical term for individuals who engage in sexual activities that are characterized as unnatural or immoral; commonly applied to gay men engaging in anal sex. Only use in historical contexts.
comment: Término histórico peyorativo para personas que participan en actividades sexuales que se caracterizan como antinaturales o inmorales; comúnmente se aplica a hombres gay que practican sexo anal. Utilícese únicamente en contextos históricos. @es
broader: LGBTQ+ historical terms
related: Sexual minorities
related: Sodomy
has top concept: LGBTQ+ historical terms
replaces: sodomites
issued: 2019-05-14
modified: 2025-02-23
type: Concept
in scheme: v3
change note: Version 4.1.0

Bullying
preferred label: Acoso @es
comment: A form of aggressive behavior that can include verbal harassment, physical assault, or coercion. Bullying is typically directed repeatedly towards particular victims, often on the grounds of race, gender, sexuality, or ability.
comment: Una forma de comportamiento agresivo que puede incluir el acoso verbal, la agresión física o la coerción. Por lo general, el acoso se dirige repetidamente hacia víctimas particulares, a menudo por motivos de raza, género, sexualidad o capacidad. @es
related: Harassment
related: LGBTQ+ phobia
related: LGBTQ+ victims of bullying
related: LGBTQ+ survivors of bullying
replaces: bullying
issued: 2019-05-14
modified: 2025-04-01
type: Concept
in scheme: v3
change note: Version 4.1.0

Burrnesha
comment: In the Balkans, people assigned female at birth who take a vow of chastity and live as men.
comment: En los Balcanes, personas asignadas al sexo femenino al nacer que asumen un voto de castidad y viven como hombres. @es
broader: Non-Euro-American gender and sexual identities
has top concept: Gender
replaces: burrnesha
issued: 2019-05-14
modified: 2025-02-23
type: Concept
in scheme: v3
change note: Version 4.1.0

Butch-femme relationships
preferred label: Relaciones marimacha-femme @es
alternative label: Relaciones bucha-femme @es
alternative label: Relaciones butch-femme @es
comment: Romantic, sexual, or play relationships between a masculine-identifying or -presenting person and a feminine-identifying or -presenting person. Though the terms "butch" and "femme" are most commonly used in lesbian communities, they are also used by other LGBTQ+ people. Only use to describe relationships between individuals who self-identify as butch and femme.
comment: Relaciones románticas, sexuales o de juego entre una persona que se autoidentifica o presenta como masculina y una persona que se autoidentifica o presenta como femenina. Aunque los términos "butch" y "femme" se utilizan con mayor frecuencia en las comunidades de lesbianas, también los utilizan otras personas LGBTQ+. Utilícese únicamente para describir relaciones entre personas que se autoidentifiquen como marimacho y mujer. @es
broader: Lesbian culture
broader: Relationship satisfaction
related: Butches
related: Femmes
related: Role behavior
related: Sexual identity
related: Stone butches
has top concept: Subcultures
replaces: butchFemmeRelationships
issued: 2019-05-14
modified: 2025-02-23
type: Concept
in scheme: v3
change note: Version 4.1.0

Butches
preferred label: Marimacha @es
alternative label: Machonas @es
alternative label: Camioneras @es
alternative label: Camionas @es
comment: A masculine person of any gender, though this term is most commonly used in lesbian communities.
comment: Una persona masculina de cualquier género, aunque este término se usa más comúnmente en comunidades de lesbianas. @es
broader: Gender roles
broader: Sexual identity
broader: Sexual roles
related: Bois
related: Butch-femme relationships
related: Dykes
related: Female masculinity
related: Femmes
related: Lesbians
related: Gender expression
related: Masculinities
related: Soft butches
related: Stone butches
related: Tomboys
related: Whakatane
related: Masculine of center
has top concept: Role behavior
replaces: butches
issued: 2019-05-14
modified: 2025-02-23
type: Concept
in scheme: v3
change note: Version 4.1.0

Butt
preferred label: Nalgas @es
alternative label: Arse
alternative label: Ass
alternative label: Bum
alternative label: Buttock
alternative label: Buttocks
alternative label: Culo @es
alternative label: Poto @es
alternative label: Pompis @es
alternative label: Trasero @es
comment: Colloquial term for the buttocks, or the fleshy protuberances at the back of the hips on which people sit.
comment: Término coloquial para las nalgas o las protuberancias carnosas en la parte trasera de las caderas sobre las que se sienta la gente. @es
broader: Erogenous body parts
related: Anal play
related: Spanking
has top concept: Erogenous body parts
replaces: buttocks
issued: 2019-05-14
modified: 2025-02-23
type: Concept
in scheme: v3
change note: Version 4.1.0

Butt plugs
preferred label: Plugs anales @es
alternative label: Anal dilators
alternative label: Anal inserts
alternative label: Anal plugs
alternative label: Buttplugs
alternative label: Dilatadores anales @es
alternative label: Enchufe anal @es
alternative label: Tapón anal @es
comment: A sex toy designed to be inserted into the anus for sexual stimulation or pleasure. Butt plugs tend to be shorter than dildos and have a flared base that prevents them from being lost in the rectum.
comment: Un juguete sexual diseñado para insertarse en el ano para estimulación o placer sexual. Los plugs anales tienden a ser más cortos que los consoladores y tienen una base acampanada que evita que se pierdan en el recto. @es
broader: Sex accessories
related: Anal sex
related: Anal play
has top concept: Sex accessories
replaces: buttplugs
issued: 2019-05-14
modified: 2025-02-23
type: Concept
in scheme: v3
change note: Version 4.1.0

Calabai
comment: In Bugis culture, this term refers to people assigned male at birth who assume female roles.
comment: En la cultura bugis, este término se refiere a personas asignadas al sexo masculino al nacer y que asumen roles femeninos. @es
broader: Non-Euro-American gender and sexual identities
has top concept: Gender
replaces: calabai
issued: 2019-05-14
modified: 2025-02-23
type: Concept
in scheme: v3
change note: Version 4.1.0

Calalai
comment: In Bugis culture, this term refers to people assigned female at birth who assume male roles.
comment: En la cultura bugis, este término se refiere a personas asignadas al sexo femenino al nacer y que asumen roles masculinos. @es
broader: Non-Euro-American gender and sexual identities
has top concept: Gender
replaces: calalai
issued: 2019-05-14
modified: 2025-02-23
type: Concept
in scheme: v3
change note: Version 4.1.0

Men sex workers
preferred label: Trabajadores sexuales hombres @es
alternative label: Call boys
alternative label: Gigolos
alternative label: Rent boys
alternative label: Taxi boys
alternative label: Male sex workers
alternative label: Male prostitutes
alternative label: Men prostitutes
alternative label: Male prostitution
alternative label: Men prostitution
alternative label: Male sex work
alternative label: Men sex work
alternative label: Prostitutos @es
alternative label: Trabajo sexual masculino @es
comment: Men who receive money or goods in exchange for sexual services, performances, or companionship. Use to describe men working across the broad spectrum of sex work.
comment: Hombres que reciben dinero o bienes a cambio de servicios o actuaciones sexuales. Se debe utilizar para describir a los hombres que trabajan en el amplio espectro del trabajo sexual. @es
broader: Sex workers
has top concept: Sex workers
replaces: maleProstitutes
issued: 2019-05-14
modified: 2025-02-23
type: Concept
in scheme: v3
change note: Version 4.1.0

LGBTQ+ Calvinists
preferred label: Calvinistas LGBTQ+ @es
alternative label: Calvinists (LGBTQ)
alternative label: LGBTQ Calvinists
alternative label: Calvinistas (LGBTQ) @es
alternative label: Calvinistas LGBTQ @es
comment: LGBTQ+ people who are Calvinists.
comment: Personas LGBTQ+ que son calvinistas. @es
broader: LGBTQ+ Protestants
has top concept: LGBTQ+ African religions
replaces: LGBTQCalvinists
issued: 2019-05-14
modified: 2025-02-23
type: Concept
in scheme: v3
change note: Version 4.1.0

Camp (Gay culture)
preferred label: Camp (cultura gay) @es
alternative label: Camp
comment: An aesthetic style and sensibility that values irony and bad taste.
comment: Un estilo y una sensibilidad estética que valora la ironía y el mal gusto. @es
related: Drag
related: Gay culture
replaces: camp
issued: 2019-05-14
modified: 2025-02-23
type: Concept
in scheme: v3
change note: Version 4.1.0

Cunnilingus
alternative label: Carpet munching
alternative label: Cunt licking
alternative label: Eating pussy
alternative label: Muff diving
alternative label: Comer crica @es
alternative label: Comer chocha @es
comment: A sexual act involving the use of the mouth and tongue to stimulate the clitoris, labia, and vagina.
comment: Un acto sexual que implica el uso de la boca y la lengua para estimular el clítoris, los labios y la vagina. @es
broader: Clitoral sex
broader: Oral sex
broader: Licking
broader: Sex (Act)
broader: Sexual practices
related: Vaginal sex
related: Vagina
related: 69ing
has top concept: Sex (Act)
replaces: cunnilingus
issued: 2019-05-14
modified: 2025-02-23
type: Concept
in scheme: v3
change note: Version 4.1.0

Eunuchs
preferred label: Eunucos @es
alternative label: Castrati
comment: Individuals assigned male at birth who have been castrated. Historically, eunuchs served in royal courts as slaves or servants; in some cases, individuals were castrated before puberty to retain childlike vocal qualities.
comment: Personas asignadas al sexo masculino al nacer que han sido castradas. Históricamente, los eunucos sirvieron en las cortes reales como esclavos o sirvientes; en algunos casos, las personas fueron castradas antes de la pubertad para conservar sus cualidades vocales infantiles. @es
broader: Non-Euro-American gender and sexual identities
related: Castration
related: Hijras
has top concept: Gender
replaces: eunuchs
issued: 2019-05-14
modified: 2025-02-23
type: Concept
in scheme: v3
change note: Version 4.1.0

Castration
preferred label: Castración @es
comment: Removal of the testes or use of the testes, typically through surgical or chemical means. Includes castration voluntarily undertaken as a gender-affirming surgical procedure or as part of a religious rite. For involuntary castration enacted by legal authorities or as a hate crime, use the term "Forced castration."
comment: Extirpación de los testículos o del uso de los testículos, generalmente mediante medios quirúrgicos o químicos. Incluye la castración realizada voluntariamente como procedimiento quirúrgico de afirmación de género o como parte de un rito religioso. Para la castración involuntaria promulgada por autoridades legales o como delito de odio, utilícese el término "castración forzada". @es
narrower: Forced castration
narrower: Orchiectomy
narrower: Penectomy
related: Eunuchs
related: Consent
replaces: castration
issued: 2019-05-14
modified: 2025-02-23
type: Concept
in scheme: v3
change note: Version 4.1.0

Casual sex
preferred label: Sexo casual @es
alternative label: Promiscuity
alternative label: Promiscuidad @es
comment: Intermittent or isolated sexual encounters between two or more people, typically occurring outside of romantic relationships or other forms of commitment, emotional attachment, or familiarity.
comment: Encuentros sexuales intermitentes o aislados entre dos o más personas, que generalmente ocurren fuera de relaciones románticas u otras formas de compromiso, apego emocional o familiaridad. @es
broader: Sexual practices
broader: Sexual relationships
related: Anonymous sex
related: Cruising (LGBTQ+ culture)
related: Group sex
related: Sex parties
related: Sexual preference
related: Sexuality
has top concept: Sexual practices
replaces: casualSex
issued: 2019-05-14
modified: 2025-02-23
type: Concept
in scheme: v3
change note: Version 4.1.0

White LGBTQ+ people
preferred label: Personas LGBTQ+ blancas @es
alternative label: Caucasians (LGBTQ)
alternative label: White people (LGBTQ)
alternative label: Caucasian LGBTQ+ people
alternative label: LGBTQ+ Caucasian people
alternative label: LGBTQ+ white people
alternative label: Personas caucásicas LGBTQ+ @es
alternative label: Caucásicos (LGBTQ+) @es
alternative label: Personas caucásicas (LGBTQ) @es
alternative label: Personas caucásicas blancas @es
alternative label: Personas blancas LGBTQ+ @es
alternative label: Personas blancas (LGBTQ) @es
comment: LGBTQ+ people who are white.
comment: Personas LGBTQ+ que son blancas. @es
narrower: White bisexual people
narrower: White gay men
narrower: White lesbians
narrower: White queer people
narrower: White transgender people
narrower: White intersex people
narrower: White asexual people
narrower: White non-binary people
related: Social privilege
replaces: whitePeopleLGBTQ
issued: 2019-05-14
modified: 2025-02-23
type: Concept
in scheme: v3
change note: Version 4.1.0

Celibacy
preferred label: Celibato @es
comment: Conscious abstinence from sexual activity, often associated with religious beliefs. Celibacy is distinct from asexuality; only use to describe asexual people if they are also choosing to practice conscious abstinence.
comment: Abstinencia consciente de la actividad sexual, a menudo asociada con creencias religiosas. El celibato es distinto de la asexualidad; utilícese únicamente para describir a personas asexuales si también eligen practicar la abstinencia consciente. @es
related: Asexual people
related: Bisexual clergy
related: Gay clergy
related: Lesbian clergy
related: Queer clergy
related: Sexual abstinence
related: Transgender clergy
replaces: celibacy
issued: 2019-05-14
modified: 2025-02-23
type: Concept
in scheme: v3
change note: Version 4.1.0

Censorship
preferred label: Censura @es
comment: Suppression of speech, public communication, images, ideas, or other information by institutions, authorities, or other controlling bodies, typically because the material has been deemed objectionable, harmful, or sensitive.
comment: Supresión de expresiones, comunicaciones públicas, imágenes, ideas u otra información por parte de instituciones, autoridades u otros organismos de control, generalmente porque el material se ha considerado objetable, dañino o sensible. @es
narrower: LGBTQ+ censorship
replaces: censorship
issued: 2019-05-14
modified: 2025-02-23
type: Concept
in scheme: v3
change note: Version 4.1.0

Chakka
comment: Derogatory term for a third gender person in Karnataka culture in India.
comment: Término despectivo para una persona de tercer género en la cultura de Karnataka en India. @es
broader: Non-Euro-American gender and sexual identities
broader: Slurs
related: Hijras
has top concept: Gender
replaces: chakka
issued: 2019-05-14
modified: 2025-02-23
type: Concept
in scheme: v3
change note: Version 4.1.0

Legal name change
preferred label: Cambio de nombre legal @es
alternative label: Change of name
alternative label: Cambio de nombre @es
comment: The process by which an individual adopts a new name on legal or government-issued documents.
comment: El proceso mediante el cual una persona adopta un nombre nuevo en documentos legales o emitidos por el gobierno. @es
broader: LGBTQ+ personal and family law
broader: Official documentation
related: Birth certificates
related: Driver's licenses
related: Marriage
related: Passports
related: Social security cards
related: Gender marker change bans
has top concept: Law
replaces: legalNameChange
issued: 2019-05-14
modified: 2025-03-20
type: Concept
in scheme: v3
change note: Version 4.1.0

Changing rooms
preferred label: Camerinos @es
alternative label: Camerines @es
alternative label: Vestuarios @es
alternative label: Camarines @es
comment: Rooms or areas in public or commercial spaces where people can change their clothes with varying degrees of privacy.
comment: Cuartos o áreas en espacios públicos o comerciales donde las personas pueden cambiarse de ropa con distintos grados de privacidad. @es
broader: Public facilities
related: Bathroom bans
has top concept: Public facilities
replaces: changingRooms
issued: 2019-05-14
modified: 2025-02-23
type: Concept
in scheme: v3
change note: Version 4.1.0

LGBTQ+ characters
preferred label: Personajes LGBTQ+ @es
alternative label: Characters (LGBTQ)
alternative label: Personajes (LGBTQ) @es
comment: Characters in creative works who are LGBTQ+.
comment: Personajes de obras creativas que son LGBTQ+. @es
narrower: Bisexual characters
narrower: Gay characters
narrower: Lesbian characters
narrower: Queer characters
narrower: Transgender characters
narrower: Asexual characters
narrower: Intersex characters
narrower: LGBTQ+ superheroes
narrower: LGBTQ+ supervillains
related: LGBTQ+ fiction
related: LGBTQ+ films
related: LGBTQ+ television
related: Two-Spirit characters
related: Drag in film
replaces: charactersLGBTQ
issued: 2019-05-14
modified: 2025-02-23
type: Concept
in scheme: v3
change note: Version 4.1.0

Chatrooms
preferred label: Salas de chat @es
preferred label: LGBTQ+ chatrooms
preferred label: Salas de chat LGBTQ+ @es
comment: Dedicated websites or online applications used to exchange messages and images with other people, typically in real time.
comment: Sitios web o aplicaciones en línea orientadas a que se utilicen para intercambiar mensajes e imágenes con otras personas, normalmente en tiempo real. @es
comment: Online websites or applications for virtual, instant communication; use in reference to chatrooms focusing on LGBTQ+ communities or issues, as well as chatrooms with primarily LGBTQ+ members.
comment: Sitios web o aplicaciones en línea para comunicación virtual e instantánea; utilícese en referencia a salas de chat que se centran en comunidades o cuestiones LGBTQ+, así como salas de chat con miembros principalmente LGBTQ+. @es
broader: Social media
broader: LGBTQ+ social media
has top concept: Social media
has top concept: LGBTQ+ social media
replaces: chatrooms
replaces: LGBTQChatrooms
issued: 2019-05-14
modified: 2025-07-16
modified: 2025-03-20
type: Concept
in scheme: v3
change note: Version 4.1.0
alternative label: LGBTQ chatrooms
alternative label: Salas de chat LGBTQ @es

Substance abuse
preferred label: Drug abuse
preferred label: Cocaine addiction
preferred label: Crystal meth addiction
preferred label: LGBTQ+ people with substance use disorders
preferred label: Personas LGBTQ+ con trastornos por uso de sustancias @es
alternative label: Chemical dependency
alternative label: Drug addiction
alternative label: Drug dependence
alternative label: Cocaine abuse
alternative label: Cocaine misuse
alternative label: Cocaine use disorder
alternative label: Crack abuse
alternative label: Crack addiction
alternative label: Crystal meth misuse
alternative label: Crystal meth abuse
alternative label: Methamphetamine misuse
alternative label: Methamphetamine abuse
alternative label: Drug addicts (LGBTQ)
alternative label: LGBTQ+ drug addicts
alternative label: LGBTQ+ people with drug addictions
alternative label: People with substance abuse disorders (LGBTQ)
comment: Abuse of or dependence on addictive substances such as drugs or alcohol.
comment: Dependence upon cocaine or crack; characterized by the experience of withdrawal symptoms upon cessation.
comment: LGBTQ+ people who have been diagnosed with or regard themselves as having a substance use disorder, a medical condition that involves a pattern of substance use that is difficult to control, negatively impacts the individual's life, and results in withdrawal symptoms upon cessation. Only use to refer to individuals who describe themselves as having a substance use disorder. Follow the individual's preference for "use disorder" or "addiction" whenever possible.
comment: Personas LGBTQ+ que han sido diagnosticadas o que ellas mismas consideran que padecen de un trastorno por uso de sustancias, una condición médica que implica un patrón de uso de sustancias que es difícil de controlar, afecta negativamente la vida de la persona y provoca síntomas de abstinencia al dejar de usarlas. Utilícese únicamente para referirse a personas que se describen a sí mismas como padeciendo de un trastorno por uso de sustancias. Siga la preferencia de la persona sobre el uso de "trastorno por consumo" o "adicción" siempre que sea posible. @es
has top concept: LGBTQ+ people
is replaced by: homoit0002226
replaces: substanceAbuse
replaces: drugAbuse
replaces: cocaineAddiction
replaces: crystalMethAddiction
issued: 2019-05-14
issued: 2020-06-02
issued: 2022-07-19
modified: 2022-12-16
modified: 2025-04-24
type: Concept
in scheme: v3
change note: Version 4.1.0
broader: LGBTQ+ people
broader: LGBTQ+ people with addictions
related: LGBTQ+ people who use substances
related: Cocaine
related: Party drugs
related: LGBTQ+ people in Adult Children of Alcoholics
related: Recovery groups
related: Two-Spirit people with substance use disorders

Chest harnesses
preferred label: Arneses de pecho @es
alternative label: Arneses pectorales @es
comment: Wearable accessories, typically consisting of leather straps and metal rings or points of attachment, that fit around the chest and shoulders like a vest. May be worn as a fashion statement, to signal one's belonging to the leather or BDSM communities, or to restrict the wearer's movement during sex.
broader: Harnesses
has top concept: Sex accessories
replaces: chestHarnesses
issued: 2019-05-14
modified: 2025-02-23
type: Concept
in scheme: v3
change note: Version 4.1.0

Latino/a/x LGBTQ+ people
preferred label: Personas LGBTQ+ Latinx @es
alternative label: Latinas (LGBTQ)
alternative label: Latinos (LGBTQ)
alternative label: Latine people (LGBTQ)
alternative label: Latinx people (LGBTQ)
alternative label: LGBTQ+ Latinas
alternative label: LGBTQ+ Latine people
alternative label: LGBTQ+ Latinos
alternative label: LGBTQ+ Latinx people
comment: Latin American people who are LGBTQ+; only use to describe individuals who self-identify as Latino, Latina, or Latinx. Do not conflate with Chicano/a/x or Hispanic.
comment: Personas latinoamericanas que son LGBTQ+; utilícese únicamente para describir a personas que se autoidentifican como latinos, latinas o latinxs. No debe confundirse con chicano/a/x o hispano/a/x. @es
broader: LGBTQ+ people of shared ethnic or national identities
narrower: Afro-Latin American LGBTQ+ people
narrower: Latino/a/x bisexual people
narrower: Latino/a/x gay men
narrower: Latino/a/x lesbians
narrower: Latino/a/x queer people
narrower: Latino/a/x transgender people
narrower: Latino/a/x intersex people
narrower: Latino/a/x asexual people
narrower: Latino/a/x non-binary people
related: Banjees
has top concept: LGBTQ+ people
replaces: latinxLGBTQ
issued: 2019-05-14
modified: 2025-02-23
type: Concept
in scheme: v3
change note: Version 4.1.0

Child custody
preferred label: Custodia de niños @es
alternative label: Guardianship
alternative label: Parental custody
alternative label: Tutelage
alternative label: Tutela @es
alternative label: Custodia parental @es
comment: Legal term for the guardianship of a child, or the legal and practical relationship between a parent and a child in their care. Typically used to describe legal custody, which is the right to make decisions about the child, as well as physical custody, which is the right and duty to house, provide, and care for the child.
comment: Término legal para la tutela de un niño, o la relación legal y práctica entre un padre y un niño bajo su cuidado. Normalmente se utiliza para describir la custodia legal, que es el derecho a tomar decisiones sobre el niño, así como la custodia física, que es el derecho y el deber de albergar, proveer y cuidar del niño. @es
related: Children
related: LGBTQ+ adoption
related: LGBTQ+ divorce
related: LGBTQ+ foster families
related: LGBTQ+ personal and family law
related: LGBTQ+ separation
replaces: childCustody
issued: 2019-05-14
modified: 2025-02-23
type: Concept
in scheme: v3
change note: Version 4.1.0

Children
preferred label: Niños @es
alternative label: Kids
comment: People who have not yet reached the age of adolescence.
comment: Personas entre las edades del nacimiento y la pubertad. @es
broader: Family members
narrower: Boys
narrower: LGBTQ+ children
narrower: Children of LGBTQ+ people
narrower: Girls
narrower: Children of Two-Spirit people
narrower: Cisgender children
narrower: Heterosexual children
narrower: Surro babies
narrower: Test tube babies
narrower: Asexual children
narrower: Turkey baster babies
related: Child custody
related: Children's sexuality
related: Desire to have children
related: Youth
has top concept: Family members
replaces: children
issued: 2019-05-14
modified: 2025-02-23
type: Concept
in scheme: v3
change note: Version 4.1.0

LGBTQ+ children
preferred label: Niños LGBTQ+ @es
preferred label: LGBTQ+ children of alcoholics
alternative label: Children (LGBTQ)
alternative label: Niños (LGBTQ) @es
alternative label: LGBTQ children of alcoholics
comment: LGBTQ+ people who have not yet reached the age of adolescence.
comment: Personas menores de 18 años que se autoidentifican como LGBTQ+. @es
broader: Children
narrower: Bisexual children
narrower: Intersex children
narrower: Queer children
narrower: Sexually abused LGBTQ+ children
narrower: Transgender children
narrower: Non-binary children
narrower: Lesbian children
narrower: Gay children
narrower: Asexual children
related: Gender creative
related: Gender dysphoria in children
related: LGBTQ+ people in Adult Children of Alcoholics
has top concept: Family members
replaces: childrenLGBTQ
replaces: LGBTQChildrenOfAlcoholics
issued: 2019-05-14
issued: 2020-06-03
modified: 2025-02-23
modified: 2022-08-15
type: Concept
in scheme: v3
change note: Version 4.1.0
is replaced by: homoit0000256

Children of bisexual people
preferred label: Hijos de personas bisexuales @es
alternative label: Hijas de personas bisexuales @es
comment: Children who have one or more bisexual parent.
comment: Hijos o hijas que tienen uno o más madres o padres bisexuales. @es
broader: Children of LGBTQ+ people
narrower: Sons of bisexual people
related: Bisexual families
related: Bisexual parents
has top concept: Family members
replaces: childrenOfBisexualPeople
issued: 2019-05-14
modified: 2025-02-23
type: Concept
in scheme: v3
change note: Version 4.1.0

Children of gay men
preferred label: Hijos de hombres gay @es
alternative label: Hijas de hombres gay @es
comment: Children who have one or more gay father.
comment: Hijos o hijas que tienen uno o más padres gay. @es
broader: Children of LGBTQ+ people
narrower: Sons of gay men
related: Gay families
related: Gay parents
has top concept: Family members
replaces: childrenOfGayMen
issued: 2019-05-14
modified: 2025-02-23
type: Concept
in scheme: v3
change note: Version 4.1.0

Children of lesbians
preferred label: Hijos de lesbianas @es
alternative label: Hijas de lesbianas @es
comment: Children who have one or more lesbian parent.
comment: Hijos o hijas que tienen una o más madres lesbianas. @es
broader: Children of LGBTQ+ people
narrower: Sons of lesbians
related: Lesbian families
related: Lesbian parents
has top concept: Family members
replaces: childrenOfLesbians
issued: 2019-05-14
modified: 2025-02-23
type: Concept
in scheme: v3
change note: Version 4.1.0

Children of LGBTQ+ people
preferred label: Hijos de personas LGBTQ+ @es
alternative label: Children of LGBTQ people
alternative label: Hijas de personas LGBTQ+ @es
comment: Children who have one or more LGBTQ+ parent.
comment: Hijos o hijas que tienen uno o más madres o padres LGBTQ+. @es
broader: Children
narrower: Children of bisexual people
narrower: Children of gay men
narrower: Children of lesbians
narrower: Children of transgender people
narrower: Children of queer people
narrower: Children of aromantic people
narrower: Children of asexual people
narrower: Children of intersex people
narrower: Queerspawn
narrower: Bothies
narrower: LGBTQ+ children of LGBTQ+ parents
related: LGBTQ+ adoption
related: LGBTQ+ family generations
has top concept: Family members
replaces: childrenOfLGBTQPeople
issued: 2019-05-14
modified: 2025-02-23
type: Concept
in scheme: v3
change note: Version 4.1.0

Children of transgender people
preferred label: Hijos de personas transgénero @es
alternative label: Hijas de personas transgénero @es
comment: Children who have one or more transgender parent.
comment: Hijos o hijas que tienen uno o más madres o padres transgénero. @es
broader: Children of LGBTQ+ people
narrower: Sons of transgender people
narrower: People with transgender parents
related: Transgender families
related: Transgender parents
has top concept: Family members
replaces: childrenOfTransgenderPeople
issued: 2019-05-14
modified: 2025-02-23
type: Concept
in scheme: v3
change note: Version 4.1.0

Children of queer people
preferred label: Hijos de personas queer @es
alternative label: Hijas de personas queer @es
comment: Children who have one or more queer parent.
comment: Hijos o hijas que tienen uno o más madres o padres queer. @es
broader: Children of LGBTQ+ people
narrower: Sons of queer people
related: Queer families
related: Queer parents
related: Queerspawn
related: Culturally queer
has top concept: Family members
replaces: childrenOfQueerPeople
issued: 2019-05-14
modified: 2025-02-23
type: Concept
in scheme: v3
change note: Version 4.1.0

Children's sexuality
preferred label: Sexualidad infantil @es
alternative label: Sexualidad juvenil @es
comment: The sexual behavior of children, include children's sense of their sexual orientation.
comment: El comportamiento sexual de los niños, incluyendo el sentido de los niños sobre su orientación sexual. @es
broader: Sexuality
related: Children
has top concept: Sexuality
replaces: childrensSexuality
issued: 2019-05-14
modified: 2025-02-23
type: Concept
in scheme: v3
change note: Version 4.1.0

Chosen names
preferred label: Nombre elegido @es
alternative label: Preferred names
comment: Names chosen by individuals that differ from their birth or legal names; often used to describe names chosen by LGBTQ+ people to better match their identities.
comment: Un nombre elegido por una persona que difiere de su nombre de nacimiento o legal; a menudo utilizado para describir nombres elegidos por personas LGBTQ+ para que coincidan mejor con sus identidades. @es
replaces: chosenName
issued: 2019-05-14
modified: 2025-03-20
type: Concept
in scheme: v3
change note: Version 4.1.0

LGBTQ+ Christians
preferred label: Cristianos LGBTQ+ @es
alternative label: Christians (LGBTQ)
alternative label: Cristanos (LGBTQ) @es
comment: LGBTQ+ people who are Christian. Use a more specific term if possible.
comment: Personas LGBTQ+ que son cristianas. Utilice un término más específico de ser posible. @es
broader: LGBTQ+ African religions
narrower: Bisexual Christians
narrower: LGBTQ+ Eastern Orthodox Christians
narrower: Gay Christians
narrower: LGBTQ+ Jehovah's Witnesses
narrower: Lesbian Christians
narrower: LGBTQ+ Mormons
narrower: LGBTQ+ Old Catholics
narrower: LGBTQ+ Protestants
narrower: Queer Christians
narrower: LGBTQ+ Roman Catholics
narrower: Transgender Christians
narrower: Intersex Christians
narrower: Asexual Christians
has top concept: LGBTQ+ African religions
replaces: christiansLGBTQ
issued: 2019-05-14
modified: 2025-02-23
type: Concept
in scheme: v3
change note: Version 4.1.0

Chromosomes
preferred label: Cromosomas @es
comment: Structures found in the nucleus of most living cells that carry genetic information in the form of genes. Often used in reference to sex chromosomes, a type of chromosome involved in sex determination.
comment: Estructuras que se encuentran en el núcleo de la mayoría de las células vivas y que transportan información genética en forma de genes. A menudo, se utiliza en referencia a los cromosomas sexuales, un tipo de cromosoma involucrado en la determinación del sexo. @es
broader: Sex (Body)
related: Assigned gender
related: Assigned sex
has top concept: Sex (Body)
replaces: chromosomes
issued: 2019-05-14
modified: 2025-02-23
type: Concept
in scheme: v3
change note: Version 4.1.0

Chubs (Gay culture)
preferred label: Chubs (cultura gay) @es
alternative label: Chubs (Gay men)
alternative label: Chubs
alternative label: Chubs (hombres gay) @es
comment: Slang term used in gay communities (primarily in the United States) to describe larger or heavy-set gay men.
comment: Término de la jerga utilizado en las comunidades gay (principalmente en los Estados Unidos) para describir a hombres gay más grandes o corpulentos. @es
broader: Gay culture
broader: Sexual identity
related: Bears (Gay culture)
has top concept: Subcultures
replaces: chubsGayMen
issued: 2019-05-14
modified: 2025-02-23
type: Concept
in scheme: v3
change note: Version 4.1.0

Cut men
preferred label: Hombres circuncidados @es
alternative label: Circumcised men
comment: Men whose penises are circumcised (i.e., the foreskin of the penis has been surgically removed).
comment: Hombres cuyos penes están circuncidados (es decir, el prepucio del pene ha sido extirpado quirúrgicamente). @es
related: Circumcision
replaces: cutMen
issued: 2019-05-14
modified: 2025-02-23
type: Concept
in scheme: v3
change note: Version 4.1.0

Circumcision
preferred label: Circuncisión @es
comment: Surgical removal of the foreskin of the penis.
comment: Extirpación quirúrgica del prepucio del pene. @es
related: Cut men
related: Clitoridectomy
related: Foreskin restoration
related: Uncut men
replaces: circumcision
issued: 2019-05-14
modified: 2025-02-23
type: Concept
in scheme: v3
change note: Version 4.1.0

Cisgender men
preferred label: Hombres cisgénero @es
alternative label: Hombre cis @es
comment: Men whose gender identity matches the sex or gender they were assigned at birth.
comment: Hombres cuya identidad de género coincide con el sexo o género que les fue asignado al nacer. @es
broader: Cisgender people
broader: Males
related: Assigned male at birth
related: Cisgender identity
has top concept: Cisgender people
replaces: cisgenderMen
issued: 2019-05-14
modified: 2025-02-23
type: Concept
in scheme: v3
change note: Version 4.1.0

Cisgender people
preferred label: Personas cisgénero @es
alternative label: Cis people
alternative label: Personas cis @es
comment: Individuals whose gender identity matches the gender or sex they were assigned at birth.
comment: Personas cuya identidad de género coincide con el género o sexo que les fue asignado al nacer. @es
narrower: Cisgender men
narrower: Cisgender women
narrower: Cisgender youth
narrower: Cisgender children
related: Gender assigned at birth
related: Cissexual people
related: Non-Euro-American gender and sexual identities
related: Gender identity
related: Males
related: Transgender people
related: Females
related: Demigirls
related: Demiboys
related: Cisgender identity
replaces: cisgenderPeople
issued: 2019-05-14
modified: 2025-02-23
type: Concept
in scheme: v3
change note: Version 4.1.0

Cisgender women
preferred label: Mujeres cisgénero @es
alternative label: Mujeres cis @es
comment: Women whose gender identity matches the sex or gender they were assigned at birth.
comment: Mujeres cuya identidad de género coincide con el género o sexo que les fue asignado al nacer. @es
broader: Cisgender people
broader: Females
related: Assigned female at birth
related: Cisgender identity
has top concept: Cisgender people
replaces: cisgenderWomen
issued: 2019-05-14
modified: 2025-02-23
type: Concept
in scheme: v3
change note: Version 4.1.0

Cissexual people
preferred label: Personas cisexuales @es
comment: Individuals whose sex matches the sex or gender they were assigned at birth. Whereas cisgender refers to people who are not transgender, cissexual refers to people who are not transsexual.
comment: Personas cuyo sexo coincide con el sexo o género que se les asignó al nacer. Mientras que "cisgénero" se refiere a personas que no son transgénero, "cisexual" se refiere a personas que no son transexuales. @es
related: Cisgender people
related: Transsexual people
related: Cissexuality
replaces: cissexualPeople
issued: 2019-05-14
modified: 2025-02-23
type: Concept
in scheme: v3
change note: Version 4.1.0

Civil unions
preferred label: Uniones civiles @es
alternative label: Civil partnership
alternative label: Registered partnership
alternative label: Unión civil @es
alternative label: Unión registrada @es
comment: Legally recognized unions with rights similar (but often not identical or equal) to those of marriage, originally created for same-sex couples in jurisdictions where they were not legally allowed to marry.
comment: Uniones legalmente reconocidas con derechos similares (pero a menudo no idénticos o iguales) a los del matrimonio, creadas originalmente para parejas del mismo sexo en jurisdicciones donde no se les permitía casarse legalmente. @es
broader: Living arrangements
narrower: Civil union documents
narrower: Civil union certificates
related: Domestic partnerships
related: Legal status
related: LGBTQ+ personal and family law
related: Marriage
related: Marriage law
related: Official documentation
has top concept: Living arrangements
replaces: civilUnions
issued: 2019-05-14
modified: 2025-02-23
type: Concept
in scheme: v3
change note: Version 4.1.0

Civil union documents
preferred label: Documentos de unión civil @es
comment: Legal documents certifying civil unions established in compliance with the laws of certain jurisdictions.
comment: Documentos legales que certifican uniones civiles establecidas en conformidad con las leyes de determinadas jurisdicciones. @es
broader: Civil unions
broader: Official documentation
has top concept: Living arrangements
replaces: civilUnionDocuments
issued: 2019-05-14
modified: 2025-02-23
type: Concept
in scheme: v3
change note: Version 4.1.0

LGBTQ+ civil rights
preferred label: Derechos civiles LGBTQ+ @es
alternative label: LGBTQ rights
alternative label: Civil rights (LGBTQ)
alternative label: Derechos civiles (LGBTQ) @es
alternative label: Derechos LGBTQ @es
comment: Legal rights of LGBTQ+ people to political and social freedom and equality.
comment: Derechos legales de las personas LGBTQ+ a la libertad y la igualdad política y social. @es
broader: Human rights
narrower: Bisexual rights
narrower: Gay rights
narrower: Lesbian rights
narrower: Queer rights
narrower: Transgender rights
narrower: Asexual rights
related: Decriminalization
related: Intersex rights
related: LGBTQ+ movement
related: LGBTQ+ victims' rights
related: Two-Spirit rights
has top concept: Human rights
replaces: civilRightsLGBTQ
issued: 2019-05-14
modified: 2025-02-23
type: Concept
in scheme: v3
change note: Version 4.1.0

Civil union certificates
preferred label: Ceritificados de unión civil @es
comment: Official certificates certifying civil unions established in compliance with the laws of certain jurisdictions.
comment: Certificados oficiales que acreditan uniones civiles establecidas en conformidad con las leyes de determinadas jurisdicciones. @es
broader: Civil unions
broader: Official documentation
has top concept: Living arrangements
replaces: civilUnionCertificates
issued: 2019-05-14
modified: 2025-02-23
type: Concept
in scheme: v3
change note: Version 4.1.0

Sex workers' clients
preferred label: Clientes de trabajadores sexuales @es
alternative label: Johns
alternative label: Tricks
alternative label: Prostitutes' clients
alternative label: Prostitutes' customers
alternative label: Sex workers' customers
alternative label: Sex-buyers
alternative label: Janes
alternative label: Curb crawlers
alternative label: Punters
alternative label: Clientes de prostitutxs @es
alternative label: Clientes de prostitutos @es
alternative label: Clientes de prostitutas @es
alternative label: Compradores de sexo @es
alternative label: Clientes de sexo @es
comment: People who provide money or goods to sex workers in exchange for sexual services, performances, or companionship.
comment: Personas que ofrecen dinero o bienes a trabajadoras/es sexuales a cambio de servicios o actuaciones sexuales. @es
narrower: Sugar daddies
narrower: Sugar mamas
related: Curb crawling
related: Solicitation of sex work
replaces: prostitutesClients
issued: 2019-05-14
modified: 2025-02-23
type: Concept
in scheme: v3
change note: Version 4.1.0

Clit rings
preferred label: Anillos de clítoris @es
comment: Genital piercings placed directly through the hood of the clitoris, typically worn for aesthetic purposes or to enhance sexual arousal.
comment: Perforaciones genitales colocadas directamente a través del capuchón del clítoris, generalmente usadas para fines estéticos o para aumentar la excitación sexual. @es
broader: Sex accessories
related: Clitoris
has top concept: Sex accessories
replaces: clitRings
issued: 2019-05-14
modified: 2025-02-23
type: Concept
in scheme: v3
change note: Version 4.1.0

Clitoral sex
preferred label: Sexo clitoriano @es
comment: Sexual acts involving the clitoris.
comment: Actos sexuales que involucran el clítoris. @es
broader: Sex (Act)
broader: Sexual practices
narrower: Cunnilingus
narrower: Fucking
narrower: Clit twisting
related: Clitoris
related: Vaginal sex
has top concept: Sex (Act)
replaces: clitoralSex
issued: 2019-05-14
modified: 2025-02-23
type: Concept
in scheme: v3
change note: Version 4.1.0

Clitoridectomy
preferred label: Clitoridectomía @es
alternative label: Clitorectomy
alternative label: Female circumcision
alternative label: Clitorectomía @es
alternative label: Circuncisión femenina @es
comment: Surgical procedure involving the removal or reduction of the clitoris.
comment: Procedimiento quirúrgico que implica la extirpación o reducción del clítoris. @es
broader: Female genital mutilation
broader: Intersex genital mutilation
related: Circumcision
has top concept: Female genital mutilation
replaces: clitoridectomy
issued: 2019-05-14
modified: 2025-02-23
type: Concept
in scheme: v3
change note: Version 4.1.0

Clitoris
preferred label: Clítoris @es
comment: Erogenous external organ that is capable of erection under sexual stimulation.
comment: Órgano externo erógeno que es capaz de erección bajo estimulación sexual. @es
broader: Erogenous body parts
broader: Genitals
narrower: G-spot
related: Clit rings
related: Clitoral sex
related: Clitoroplasty
related: Vaginectomy
related: Clit twisting
has top concept: Erogenous body parts
replaces: clitoris
issued: 2019-05-14
modified: 2025-02-23
type: Concept
in scheme: v3
change note: Version 4.1.0

Clitoromegaly
preferred label: Clitoromegalia @es
alternative label: Enlarged clitoris
alternative label: Hipertrofia del clítoris @es
comment: People born with clitoromegaly have a clitoris that is larger than what society considers to be typical. Clitoromegaly is a trait associated with several different intersex variations, including congenital adrenal hyperplasia and progestin-induced virilization.
comment: Las personas que nacen con clitoromegalia tienen un clítoris más grande de lo que la sociedad considera típico. La clitoromegalia es un rasgo asociado con múltiples variaciones intersex diferentes, incluida la hiperplasia suprarrenal congénita y la virilización inducida por progestina. @es
broader: Intersex variations
has top concept: Sex (Body)
replaces: clitoromegaly
issued: 2019-05-14
modified: 2025-02-23
type: Concept
in scheme: v3
change note: Version 4.1.0

Clones (Gay culture)
preferred label: Clones (cultura gay) @es
alternative label: Clones (Gay men)
alternative label: Clones
alternative label: Clones gay @es
comment: Historical term for gay men who dress in a particular masculine fashion; often used in the Castro District of San Francisco.
comment: Término histórico para hombres gay que visten de una manera masculina particular; se utiliza a menudo en el distrito Castro de San Francisco. @es
broader: Gay men
broader: LGBTQ+ historical terms
has top concept: LGBTQ+ people
replaces: clonesGayMen
issued: 2019-05-14
modified: 2025-02-23
type: Concept
in scheme: v3
change note: Version 4.1.0

Closeted bisexual people
preferred label: Personas bisexuales en el clóset @es
comment: Bisexual people who do not identify as such to others.
comment: Personas bisexuales que no se autoidentifican como tales ante los demás. @es
broader: Bisexual people
broader: Closeted LGBTQ+ people
related: Closeted gay men
related: Closeted lesbians
related: Coming out
related: Down-low
related: Outing (LGBTQ+ culture)
related: Secrecy
related: Closeted transgender people
related: Closeted queer people
related: Closeted asexual people
has top concept: LGBTQ+ people
replaces: closetedBisexualPeople
issued: 2019-05-14
modified: 2025-02-23
type: Concept
in scheme: v3
change note: Version 4.1.0

Closeted gay men
preferred label: Hombres gay en el clóset @es
comment: Gay men who do not identify as such to others.
comment: Hombres gay que no se autoidentifican como tales ante los demás. @es
broader: Gay men
broader: Closeted LGBTQ+ people
related: Closeted bisexual people
related: Closeted lesbians
related: Coming out
related: Down-low
related: Outing (LGBTQ+ culture)
related: Secrecy
related: Closeted transgender people
related: Closeted queer people
related: Closeted asexual people
has top concept: LGBTQ+ people
replaces: closetedGayMen
issued: 2019-05-14
modified: 2025-02-23
type: Concept
in scheme: v3
change note: Version 4.1.0

Closeted lesbians
preferred label: Lesbianas en el clóset @es
comment: Lesbians who do not identify as such to others.
comment: Lesbianas que no se autoidentifican como tales ante los demás. @es
broader: Lesbians
broader: Closeted LGBTQ+ people
related: Closeted bisexual people
related: Closeted gay men
related: Coming out
related: Outing (LGBTQ+ culture)
related: Secrecy
related: Closeted transgender people
related: Closeted queer people
related: Closeted asexual people
has top concept: LGBTQ+ people
replaces: closetedLesbians
issued: 2019-05-14
modified: 2025-02-23
type: Concept
in scheme: v3
change note: Version 4.1.0

Stealth (Transgender)
preferred label: Discreción (transgénero) @es
alternative label: Stealth
comment: Term used to describe the experience of a trans person who is not openly trans and is choosing to pass as cisgender.
comment: Término utilizado para describir la experiencia de una persona trans que no es abiertamente trans y elige hacerse pasar por cisgénero. @es
related: Assigned gender
related: Coming out
related: Gender
related: Outing (LGBTQ+ culture)
related: Passing (Gender)
related: Secrecy
related: Transgender people
related: Clocking (Gender)
related: Closeted LGBTQ+ people
related: Closeted transgender people
related: Closeted queer people
related: Closeted intersex people
related: Closeted Two-Spirit people
replaces: stealthTransgender
issued: 2019-05-14
modified: 2025-02-23
type: Concept
in scheme: v3
change note: Version 4.1.0

Clothing
preferred label: Ropa @es
comment: Items worn on the body for protection, insulation, and self-expression; typically made of fabric or textiles.
comment: Artículos utilizados en el cuerpo para protección, aislamiento y autoexpresión; típicamente hechos de tela o textiles. @es
broader: Gender expression
narrower: Lingerie
narrower: Costumes
narrower: Binders (Chest)
related: Crossdressers
related: Crossdressing
related: Drab (LGBTQ+ culture)
related: Drag
related: Masquerading
related: Fursuits
related: Uniform fetish
related: LGBTQ+ fashion
has top concept: Gender
replaces: clothing
issued: 2019-05-14
modified: 2025-02-23
type: Concept
in scheme: v3
change note: Version 4.1.0

Party drugs
preferred label: LGBTQ+ people who use substances recreationally
preferred label: Personas LGBTQ+ que utilizan sustancias con fines recreativos @es
alternative label: Club drugs
broader: Cocaine
broader: LGBTQ+ people who use substances
related: Chemsex
related: Cocaine
related: Two-Spirit people who use substances for recreational purposes
has top concept: Cocaine
has top concept: LGBTQ+ people
is replaced by: homoit0001235
replaces: partyDrugs
replaces: recreationalDrugUse
issued: 2019-05-14
modified: 2022-12-21
modified: 2025-04-24
type: Concept
in scheme: v3
change note: Version 4.1.0
comment: The use of substances (that are typically deemed harmful or are subject to legal restriction, such as drugs or alcohol) by LGBTQ+ people for recreational or social purposes.
comment: El uso de sustancias (que suelen considerarse nocivas o que están sujetas a restricciones legales, como las drogas o el alcohol) por parte de personas LGBTQ+ con fines recreativos o sociales. @es

Cocaine
preferred label: Crystal meth
preferred label: Substance use in LGBTQ+ communities
preferred label: Uso de substancias en la comunidad LGBTQ+ @es
preferred label: MDMA
broader: Party drugs
related: Substance abuse
related: Medication
related: Poppers
related: Party drugs
related: LGBTQ+ people in recovery
related: LGBTQ+ people who use substances for medical purposes
is replaced by: homoit0000380
replaces: cocaine
replaces: crystalMeth
replaces: drugs
replaces: MDMA
issued: 2019-05-14
modified: 2022-08-22
modified: 2022-08-15
modified: 2025-02-23
type: Concept
in scheme: v3
change note: Version 4.1.0
alternative label: Tina
alternative label: Alcohol use (LGBTQ)
alternative label: Alcohol use in LGBTQ+ communities
alternative label: Drug use (LGBTQ)
alternative label: Drug use in LGBTQ+ communities
alternative label: LGBTQ+ substance use
alternative label: Substance use (LGBTQ)
alternative label: Consumo de substancias en la comunidad LGBTQ @es
alternative label: Uso de alcohol (LGBTQ) @es
alternative label: Consumo de alcohol (LGBTQ) @es
alternative label: Uso de drogas en la comunidad LGBTQ @es
alternative label: Uso de drogas (LGBTQ) @es
alternative label: Consumo de drogas (LGBTQ) @es
alternative label: Uso de substancias (LGBTQ) @es
alternative label: Ecstacy
alternative label: Molly
alternative label: XTC
comment: The use of substances (that are typically deemed harmful or are subject to legal restriction, such as drugs or alcohol) and discussions surrounding the particular impact of substance use within LGBTQ+ communities.
comment: El uso de sustancias (que normalmente se consideran dañinas o están sujetas a restricciones legales, como drogas o alcohol) y debates sobre el impacto particular del uso de sustancias dentro de las comunidades LGBTQ+. @es
comment: A type of methamphetamine commonly referred to as ecstasy or molly
narrower: LGBTQ+ people with addictions

Cock rings
preferred label: Anillos para el pene @es
comment: Rings or circular sex toys worn on the penis to maintain an erection and prevent orgasm.
comment: Anillos o juguetes sexuales circulares que se colocan en el pene para mantener la erección y prevenir el orgasmo. @es
broader: Sex accessories
related: Penis
has top concept: Sex accessories
replaces: cockRings
issued: 2019-05-14
modified: 2025-02-23
type: Concept
in scheme: v3
change note: Version 4.1.0

Enemas
alternative label: Colonic irrigation
alternative label: Lavativa @es
alternative label: Hidroterapia de colon @es
comment: A liquid application device used as a douche or to cleanse the bowels or vagina, or usage of such a device. Can be used for sexual or erotic purposes.
comment: Inyecciones de agua u otros líquidos en el recto, normalmente con fines médicos o higiénicos; también se puede utilizar en un contexto erótico. @es
broader: BDSM
broader: Sex accessories
broader: Sex (Act)
broader: Sexual practices
broader: Kink accessories
related: Ass fucking
related: Anal play
related: Douching
has top concept: Eroticism
replaces: enemas
issued: 2019-05-14
modified: 2025-02-23
type: Concept
in scheme: v3
change note: Version 4.1.0

Collars
preferred label: Collares @es
comment: Straps or bands of material worn around the neck. May be worn as a fashion statement, to signal "ownership" by a dominant partner within the context of a BDSM relationship, or during sex to restrict the wearer's movement and breath control.
broader: Sex accessories
related: Body adornment
has top concept: Sex accessories
replaces: collars
issued: 2019-05-14
modified: 2025-02-23
type: Concept
in scheme: v3
change note: Version 4.1.0

Coming out
preferred label: Salir del clóset @es
alternative label: Salir del armario @es
comment: Process of accepting and sharing one’s sexual or gender identity with oneself and/or others.
comment: Proceso de aceptar y compartir la propia identidad sexual o de género con uno mismo y/o con los demás. @es
related: Baby dykes
related: Baby gays
related: Closeted bisexual people
related: Closeted gay men
related: Closeted lesbians
related: Stealth (Transgender)
related: Outing (LGBTQ+ culture)
related: Secrecy
related: Closeted LGBTQ+ people
related: Closeted transgender people
related: Closeted queer people
related: Closeted intersex people
related: Closeted Two-Spirit people
related: Closeted asexual people
related: Questioning
replaces: comingOut
issued: 2019-05-14
modified: 2025-02-23
type: Concept
in scheme: v3
change note: Version 4.1.0

Common law marriage
preferred label: Matrimonio de hecho @es
alternative label: Pareja de hecho @es
alternative label: Unión de hecho @es
comment: Legal framework in which two partners are considered married without having formally registered their relationship as a civil or religious marriage. Common law marriage grants certain economic rights and legal privileges.
comment: Marco jurídico en el que dos cónyuges se consideran casados ​​sin haber registrado formalmente su relación como matrimonio civil o religioso. El matrimonio de hecho otorga ciertos derechos económicos y privilegios legales. @es
broader: Marriage
broader: Marriage law
has top concept: Living arrangements
replaces: commonLawMarriage
issued: 2019-05-14
modified: 2025-02-23
type: Concept
in scheme: v3
change note: Version 4.1.0

LGBTQ+ communities
preferred label: Comunidades LGBTQ+ @es
alternative label: Communities (LGBTQ)
alternative label: Comunidades (LGBTQ) @es
comment: Groups of LGBTQ+ people who share interests or interact regularly, typically living in some proximity.
comment: Grupos de personas LGBTQ+ que comparten intereses o interactúan regularmente y que generalmente viven en cierta proximidad. @es
narrower: Kink community
narrower: Bisexual community
narrower: Drag community
narrower: Gay community
narrower: Leather community
narrower: Lesbian community
narrower: LGBTQ+ communes
narrower: Queer community
narrower: Rubber and latex community
narrower: Transgender community
narrower: LGBTQ+ Deaf culture
narrower: Asexual community
narrower: Intersex community
narrower: LGBTQ+ alumni groups
narrower: LGBTQ+ punk community
related: LGBTQ+ community centers
related: LGBTQ+ neighborhoods
related: Two-Spirit community
related: LGBTQ+ spaces
related: LGBTQ+ survival guides
replaces: communitiesLGBTQ
issued: 2019-05-14
modified: 2025-03-20
type: Concept
in scheme: v3
change note: Version 4.1.0

LGBTQ+ community centers
preferred label: Centros comunitarios LGBTQ+ @es
preferred label: LGBTQ+ community centres
comment: Spaces in which people from LGBTQ+ communities meet for social, education, recreational, or organizing activities.
comment: Espacios en los que personas de comunidades LGBTQ+ se reúnen para realizar actividades sociales, educativas, recreativas u organizativas. @es
broader: LGBTQ+ centers
broader: LGBTQ+ meeting places
narrower: Bisexual community centers
narrower: Gay community centers
narrower: Lesbian community centers
narrower: Queer community centers
narrower: Transgender community centers
narrower: Women's community centers
narrower: Asexual community centers
narrower: Intersex community centers
related: LGBTQ+ communities
related: Two-Spirit community centers
has top concept: LGBTQ+ centers
replaces: communityCentresLGBTQ
issued: 2019-05-14
modified: 2025-02-23
type: Concept
in scheme: v3
change note: Version 4.1.0

Condoms
preferred label: Condones @es
alternative label: Prophylactics
alternative label: Rubbers
alternative label: Preservativos @es
alternative label: Gomas @es
alternative label: Profiláctico @es
alternative label: Forros @es
comment: Latex contraceptives used to cover penises during sexual activity for the purposes of preventing STIs and/or pregnancy.
comment: Anticonceptivos de látex utilizados para cubrir penes durante actividad sexual con el fin de prevenir ITS y/o embarazo. @es
broader: Sex accessories
related: Safer sex
has top concept: Sex accessories
replaces: condoms
issued: 2019-05-14
modified: 2025-02-23
type: Concept
in scheme: v3
change note: Version 4.1.0

LGBTQ+ Confucianists
preferred label: Confucionistas LGBTQ+ @es
alternative label: Confucianists (LGBTQ)
alternative label: LGBTQ Confucianists
alternative label: Confucionistas LGBTQ @es
alternative label: Confucionistas (LGBTQ) @es
comment: LGBTQ+ people who are Confucianists.
comment: Personas LGBTQ+ que son confucionistas. @es
broader: LGBTQ+ African religions
has top concept: LGBTQ+ African religions
replaces: LGBTQConfucianists
issued: 2019-05-14
modified: 2025-02-23
type: Concept
in scheme: v3
change note: Version 4.1.0

Congenital adrenal hyperplasia
preferred label: Hiperplasia suprarrenal congénita @es
alternative label: CAH
alternative label: HSC @es
comment: Congenital adrenal hyperplasia (CAH) is a group of different but related genetic variations that affect the enzymes that allow the adrenal glands to make hormones that regulate the body’s functions. People with CAH do not consistently produce the amount of cortisol or aldosterone they need, but they may naturally produce higher-than-typical levels of androgens such as testosterone to help the body compensate. Someone with CAH can be born with XX or XY chromosomes. People with CAH and XY chromosomes are usually not considered to have a variation in sex characteristics since an increased amount of androgens will not cause the development of any characteristics that are not considered typical for people assigned male at birth. In people with XX chromosomes and CAH, the increase in androgen production can result in genital differences such as a larger-than-typical clitoris, fused labia, and the fusion of the urethra and vaginal canal to form a single opening. They may also develop some characteristics like body and facial hair or increased muscle mass during childhood or puberty.
comment: La hiperplasia suprarrenal congénita (HSC) es un grupo de variaciones genéticas diferentes pero relacionadas que afectan las enzimas que permiten a las glándulas suprarrenales producir hormonas que regulan las funciones del cuerpo. Las personas con HSC no producen consistentemente la cantidad de cortisol o aldosterona que necesitan, pero puede que naturalmente produzcan niveles más altos de lo usual de andrógenos, como la testosterona, para ayudar al cuerpo a compensar. Alguien con HSC puede nacer con cromosomas XX o XY. Por lo general, no se considera que las personas con HSC y cromosomas XY tengan una variación en características sexuales, ya que una mayor cantidad de andrógenos no provocará el desarrollo de ninguna característica que no se considere típica de las personas asignadas al sexo masculino al nacer. En personas con HSC y cromosomas XX, el aumento en la producción de andrógenos puede resultar en diferencias genitales, como un clítoris más grande de lo usual, labios fusionados y la fusión de la uretra y el canal vaginal para formar una única apertura. También pueden desarrollar algunas características como vello corporal y facial o aumento de masa muscular durante la infancia o la pubertad. @es
broader: Intersex variations
narrower: Classical congenital adrenal hyperplasia
narrower: Non-classical congenital adrenal hyperplasia
has top concept: Sex (Body)
replaces: congenitalAdrenalHyperplasia
issued: 2019-05-14
modified: 2025-02-23
type: Concept
in scheme: v3
change note: Version 4.1.0

Consent
preferred label: Consentimiento @es
comment: Permission or agreement for a set of actions to occur, particularly in a sexual encounter and/or within a relational dynamic.
comment: Permiso o acuerdo para que ocurra un conjunto de acciones, particularmente en un encuentro sexual y/o dentro de una dinámica relacional. @es
narrower: Age of consent
narrower: Informed consent
related: Castration
related: BDSM
related: LGBTQ+ domestic violence
related: LGBTQ+ sexual abuse
related: LGBTQ+ victims of rape
related: LGBTQ+ victims of sexual abuse
related: Polyamory
related: Polygamy
related: Social privilege
related: Sex (Act)
related: Sexual practices
related: Rape/non-con (Content warning)
related: Underage (Content warning)
replaces: consent
issued: 2019-05-14
modified: 2025-02-23
type: Concept
in scheme: v3
change note: Version 4.1.0

Conversion therapy
alternative label: Reparative therapy
alternative label: Reorientation therapy
alternative label: Sexual reorientation therapy
comment: Efforts to change the sexual or gender identity of an individual who is or is suspected to be LGBTQ+ to meet heterosexual or cisgender norms, typically under the belief that being LGBTQ+ is dangerous and/or the result of mental illness or trauma. The processes involved in conversion therapy include visualization training, spiritual interventions, and other aversion treatments.
broader: Behavioral therapy
narrower: Gender conversion therapy
has top concept: Medical care
replaces: sexualReorientation
issued: 2019-05-14
modified: 2025-02-23
type: Concept
in scheme: v3
change note: Version 4.1.0

Second parent adoption
preferred label: Adopción por segundo padre @es
alternative label: Co-parent adoption
alternative label: Adopción co-parental @es
comment: An adoption process by which a legal child-parent relationship is established by granting the “second” parent the same rights as the “first” parent without the “first” or legal parent relinquishing any parental rights. A second or co-parent adoption can be important for LGBTQ+ parents to protect their parental rights as the relationship of the non-biological parent may not be recognized in some jurisdictions without such an adoption.
comment: Un proceso de adopción mediante el cual se establece una relación legal entre padres e hijos otorgando al “segundo” padre los mismos derechos que al “primer” padre sin que el “primer” padre o padre legal renuncie a ningún derecho de paternidad. Una segunda adopción o una adopción conjunta puede ser importante para que los padres LGBTQ+ protejan sus derechos de paternidad, ya que la relación del padre no biológico puede no ser reconocida en algunas jurisdicciones sin dicha adopción. @es
broader: LGBTQ+ adoption
related: LGBTQ+ personal and family law
has top concept: LGBTQ+ family planning
replaces: secondParentAdoption
issued: 2019-05-14
modified: 2025-02-23
type: Concept
in scheme: v3
change note: Version 4.1.0

Scat play
preferred label: Juego con heces @es
alternative label: Coprophilia
alternative label: Coprolagnia
alternative label: Extrementophilia
alternative label: Fecalphilia
alternative label: Fecophilia
alternative label: Poop fetish
alternative label: Poop fetishism
alternative label: Poop kink
alternative label: Scat fetish
alternative label: Scat fetishism
alternative label: Scat kink
alternative label: Scat
alternative label: Scatophilia
comment: Use of feces for erotic enjoyment.
comment: Uso de heces para disfrute erótico. @es
broader: BDSM
related: Anal play
related: Urine play
has top concept: Eroticism
replaces: scat
issued: 2019-05-14
modified: 2025-02-23
type: Concept
in scheme: v3
change note: Version 4.1.0

Corrective rape
preferred label: Violación correctiva @es
comment: Criminal practice in which men rape lesbians, sometimes under the supervision of members of the women's families or local communities, with the purported purpose of "curing" them of homosexuality.
comment: Práctica criminal en la que hombres violan a lesbianas, a veces bajo la supervisión de miembros de las familias de las mujeres o de las comunidades locales, con el supuesto propósito de "curarlas" de la homosexualidad. @es
broader: Sexual violence
related: Lesbian survivors of rape
related: Lesbian victims of rape
related: Rape culture
has top concept: Sexual violence
replaces: correctiveRape
issued: 2019-05-14
modified: 2025-02-23
type: Concept
in scheme: v3
change note: Version 4.1.0

Corsets
preferred label: Corsés @es
alternative label: Bondage corsets
alternative label: Tightlacing
alternative label: Fajas @es
comment: A garment worn to hold and train the torso into a desired shape, traditionally a smaller waist or larger bottom, for aesthetic purposes (either for the duration of wearing it or with a more lasting effect), or to support the breasts.
comment: Vestiduras ajustadas que se utilizan sobre el pecho y/o el estómago, generalmente con fines estéticos o médicos. @es
broader: Kink accessories
broader: LGBTQ+ fashion
related: Body modification
related: Breath control
has top concept: Eroticism
replaces: corsets
issued: 2019-05-14
modified: 2025-02-23
type: Concept
in scheme: v3
change note: Version 4.1.0

Cottages (Gay culture)
preferred label: Cottages (Cultura gay) @es
alternative label: Public urinals
alternative label: Cottages
alternative label: Urinarios públicos @es
alternative label: Baños públicos @es
comment: UK slang term for public bathrooms used as locations for sexual encounters, particularly by gay men.
comment: Término de la jerga británica para referirse a los baños públicos utilizados como lugares para encuentros sexuales, especialmente entre hombres gay. @es
broader: Sex locations
narrower: Glory holes
related: Cottaging (Gay culture)
related: Public bathrooms
related: Tearooms (Gay culture)
has top concept: Sex locations
replaces: cottages
issued: 2019-05-14
modified: 2025-02-23
type: Concept
in scheme: v3
change note: Version 4.1.0

Cottaging (Gay culture)
preferred label: Cottaging (Cultura gay) @es
alternative label: Cottaging
comment: UK slang term commonly used in gay communities to describe the practice of engaging in anonymous sex in a public bathroom or cruising for sexual partners there.
comment: Término de la jerga británica comúnmente utilizado en las comunidades gay para describir la práctica de tener relaciones sexuales anónimas en un baño público o buscar parejas sexuales allí. @es
broader: Sex (Act)
broader: Sexual practices
related: Anonymous sex
related: Cottages (Gay culture)
related: Cruising (LGBTQ+ culture)
related: Public sex
related: Tearoom sex
has top concept: Sex (Act)
replaces: cottaging
issued: 2019-05-14
modified: 2025-02-23
type: Concept
in scheme: v3
change note: Version 4.1.0

LGBTQ+ couples
preferred label: Parejas LGBTQ+ @es
alternative label: Couples (LGBTQ)
alternative label: Parejas (LGBTQ) @es
comment: Partnerships in which both people are LGBTQ+.
comment: Relaciones en las que ambas personas son LGBTQ+. @es
broader: Relationship satisfaction
narrower: Bisexual couples
narrower: Boston marriages
narrower: Gay couples
narrower: Lesbian couples
narrower: Queer couples
narrower: Transgender couples
narrower: Asexual couples
narrower: Intersex couples
related: LGBTQ+ partners
related: Two-Spirit couples
has top concept: Relationship satisfaction
replaces: couplesLGBTQ
issued: 2019-05-14
modified: 2025-02-23
type: Concept
in scheme: v3
change note: Version 4.1.0

Court orders
preferred label: Órdenes de la corte @es
alternative label: Orden judicial @es
alternative label: Mandato judicial @es
comment: Proclamations by a judge or panel of judges requiring or authorizing specific actions (e.g., court orders approving or denying requests for name or gender marker changes).
comment: Proclamaciones de un juez o de un panel de jueces que requieren o autorizan acciones específicas (por ejemplo, órdenes judiciales que aprueban o deniegan solicitudes de cambios de nombre o marcador de género). @es
broader: Law
broader: Official documentation
related: Birth certificates
related: Driver's licenses
related: Gender markers
has top concept: Law
replaces: courtOrders
issued: 2019-05-14
modified: 2025-02-23
type: Concept
in scheme: v3
change note: Version 4.1.0

LGBTQ+ victims of crime
preferred label: Víctimas LGBTQ+ de crimen @es
alternative label: Crime victims (LGBTQ)
alternative label: LGBTQ victims of crime
comment: LGBTQ+ people who have experienced crimes and may or may not have survived; follow the individual's preference for “victims” or “survivors” whenever possible.
comment: Personas LGBTQ+ que han sufrido crímenes y pueden o no haber sobrevivido; siga la preferencia de la persona sobre el uso de "víctimas" o "sobrevivientes" siempre que sea posible. @es
broader: LGBTQ+ people
narrower: LGBTQ+ victims of hate crimes
narrower: LGBTQ+ victims of rape
narrower: LGBTQ+ victims of sexual abuse
narrower: LGBTQ+ victims of human trafficking
related: LGBTQ+ victims' rights
has top concept: LGBTQ+ people
replaces: LGBTQVictimsOfCrime
issued: 2019-05-14
modified: 2025-02-23
type: Concept
in scheme: v3
change note: Version 4.1.0

Criminal law
preferred label: Derecho penal @es
comment: Body of law relating to crime that prescribes the legality and consequences of conduct perceived as threatening, harmful, or endangering to the property, health, safety, and/or moral welfare of oneself and others.
comment: Conjunto de leyes relativas al delito que prescribe la legalidad y las consecuencias de conductas percibidas como amenazantes, dañinas o que ponen en peligro la propiedad, la salud, la seguridad y/o el bienestar moral de uno mismo y de los demás. @es
broader: Law
narrower: Criminalization
narrower: Decriminalization
narrower: Sexual offenses laws
has top concept: Law
replaces: criminalLaw
issued: 2019-05-14
modified: 2025-02-23
type: Concept
in scheme: v3
change note: Version 4.1.0

Criminalization
preferred label: Criminalización @es
preferred label: Criminalisation
comment: The process by which behaviors and individuals are framed as and come to be known as criminal.
comment: El proceso mediante el cual conductas y personas son concebidas y llegan a ser conocidas como delictivas. @es
broader: Criminal law
narrower: LGBTQ+ criminalization
narrower: Criminalization of gender non-conformity
narrower: Criminalization of sex work
related: Decriminalization
related: Bathroom bans
related: Anti-transgender legislation
has top concept: Law
replaces: criminalisation
issued: 2019-05-14
modified: 2025-02-23
type: Concept
in scheme: v3
change note: Version 4.1.0

Cross-cultural relationships
preferred label: Relaciones interculturales @es
alternative label: Intercultural relationships
alternative label: Interracial relationships
alternative label: Relaciones interraciales @es
comment: Relationships between people of different ethnic or racial backgrounds.
comment: Relaciones entre personas de diferentes orígenes étnicos o raciales. @es
broader: Relationship satisfaction
related: Sexual identity
related: Relationship orientation
has top concept: Relationship satisfaction
replaces: cross-culturalRelationships
issued: 2019-05-14
modified: 2025-02-23
type: Concept
in scheme: v3
change note: Version 4.1.0

Crossdressers
preferred label: Transformistas @es
alternative label: Cross-dressers
comment: Individuals who wear clothes stereotypical to or associated with a gender other than their predominantly-identified gender. Crossdressers often develop a persona while crossdressing. Only use to describe individuals who self-identify as crossdressers.
comment: Personas que usan ropa estereotipada o asociada con un género distinto al género bajo el cual se autoidentifican predominantemente. Los transformistas a menudo desarrollan una personalidad en relación a la práctica. Utilícese únicamente para describir a personas que se autoidentifican como transformistas. @es
broader: Gender minorities
related: Clothing
related: Crossdressing
related: Drag kings
related: Drag queens
related: Eonist people
related: Lingerie
related: Parents of crossdressers
related: Partners of crossdressers
related: Passing (Gender)
related: Transgender people
related: Transvestites
related: Clocking (Gender)
has top concept: Gender minorities
replaces: crossdressers
issued: 2019-05-14
modified: 2025-02-23
type: Concept
in scheme: v3
change note: Version 4.1.0

Hormone therapy (Gender)
preferred label: Terapia hormonal (género) @es
alternative label: Cross-gender hormone therapy
alternative label: Hormone reassignment therapy
alternative label: Hormone replacement therapy
alternative label: Terapia de reemplazo hormonal @es
comment: The process of altering one's sex hormones using hormone blockers and/or doses of testosterone, estrogen, or progesterone.
comment: El proceso de alterar las hormonas sexuales utilizando bloqueadores hormonales y/o dosis de testosterona, estrógeno o progesterona. @es
broader: Therapies
narrower: Estrogen
narrower: Hormone blockers
narrower: Testosterone
related: Medication
related: No hormone identity
related: Transgender people
related: Androgens
has top concept: Medical care
replaces: hormoneTherapyGender
issued: 2019-05-14
modified: 2025-02-23
type: Concept
in scheme: v3
change note: Version 4.1.0

Crossdressing
preferred label: Transformismo @es
comment: The practice of wearing clothing stereotypical to a gender other than the individual's predominantly-identified gender.
comment: La práctica de usar ropa estereotipada de un género distinto al género bajo el cual se identifica una persona predominantemente. @es
broader: Gender expression
related: Clothing
related: Crossdressers
related: Eonism
related: Kabuki
related: Lingerie
related: Reading (Gender)
related: Transvestism
related: Masquerading
related: Dollification
related: Drag in film
has top concept: Gender
replaces: crossdressing
issued: 2019-05-14
modified: 2025-02-23
type: Concept
in scheme: v3
change note: Version 4.1.0

Cruising (LGBTQ+ culture)
preferred label: Cruising (Cultura LGBTQ+) @es
alternative label: Cruising
alternative label: Cancaneo @es
comment: Walking or driving about a locality in search of a sex partner, typically to engage in casual sex.
comment: Caminar o conducir por una localidad en busca de una pareja sexual, generalmente para tener relaciones sexuales casuales. @es
broader: Sex (Act)
broader: Sexual practices
related: Anonymous sex
related: Casual sex
related: Cottaging (Gay culture)
related: LGBTQ+ meeting places
related: Public sex
related: Tearoom sex
has top concept: Sex (Act)
replaces: cruising
issued: 2019-05-14
modified: 2025-02-23
type: Concept
in scheme: v3
change note: Version 4.1.0

Cubs (Gay culture)
preferred label: Cachorros (Cultura gay) @es
alternative label: Cubs
alternative label: Cubs (Cultura gay) @es
comment: Slang commonly used in gay communities in the United States to describe younger, heavy-set gay men, usually with hairy bodies and facial hair.
comment: Jerga comúnmente utilizada en las comunidades gay de Estados Unidos para describir a hombres gay más jóvenes y corpulentos, generalmente con cuerpos peludos y vello facial. @es
broader: Bears (Gay culture)
broader: Gay culture
broader: Gender roles
broader: Wolves (Gay culture)
related: Gender expression
has top concept: Subcultures
replaces: cubs
issued: 2019-05-14
modified: 2025-02-23
type: Concept
in scheme: v3
change note: Version 4.1.0

Non-Euro-American gender and sexual identities
preferred label: Identidades de género y sexuales no euro-americanas @es
preferred label: Namban
alternative label: Culturally-specific gender identities
alternative label: Identidades de género culturalmente específicas || @es
comment: Broad term describing gender and sexual identities specific to regions outside of North America and Europe.
comment: Término amplio que describe identidades sexuales y de género específicas a regiones fuera de Norteamérica y Europa. @es
broader: Gender identity
narrower: Acault
narrower: Agî
narrower: Akava'ine
narrower: Ali
narrower: Alyha
narrower: Androgynos
narrower: Aravani
narrower: Ashtime
narrower: Aylonit
narrower: Bading
narrower: Bakla
narrower: Bantut
narrower: Bayot
narrower: Binabae
narrower: Bissu
narrower: Biza'ah
narrower: Brotherboys
narrower: Burrnesha
narrower: Calabai
narrower: Calalai
narrower: Eunuchs
narrower: Chakka
narrower: Dee
narrower: Dhurani
narrower: Dilbaa
narrower: Fa'afafine
narrower: Fa'afatama
narrower: Fakaleitī
narrower: Femminiello
narrower: Galli
narrower: Güevedoce
narrower: Hemaneh
narrower: Hijras
narrower: Hwame
narrower: Jankha
narrower: Jogappa
narrower: Katoey
narrower: Khusra
narrower: Khwaja sira
narrower: Kinnar
narrower: Köçek
narrower: Kothis
narrower: Khteuy
narrower: Lakin-on
narrower: Takatāpui
narrower: Lhamana
narrower: Māhū
narrower: Mak nyahs
narrower: Mangaiko
narrower: Mashoga
narrower: Metis
narrower: Mukhannathun
narrower: Muxe
narrower: Nádleehi
narrower: Niizh manidoowag
narrower: Ninauposkitzipxpe
narrower: Palao'ana
narrower: Pangender people
narrower: Quariwarmi
narrower: Sak veng
narrower: Sekhet
narrower: Sekrata
narrower: Shiv-Shakthis
narrower: Sistergirls
narrower: Skoptsy
narrower: Srey sros
narrower: Third gender
narrower: Thirunangai
narrower: Thirunambi
narrower: Tida wena
narrower: Tom
narrower: Travestis

Cum
preferred label: Semen
alternative label: Leche @es
alternative label: Lefa @es
comment: Body fluids produced by sexual arousal and orgasm.
comment: Término coloquial para referirse al semen (o, con menos frecuencia, al fluido vaginal) eyaculado durante el orgasmo. @es
broader: Body fluids
related: Getting off
related: Happy endings
related: Jizz
related: Sexual excitement
related: Sexual climax
related: Bukkake
has top concept: Body fluids
replaces: cum
issued: 2019-05-14
modified: 2025-03-20
type: Concept
in scheme: v3
change note: Version 4.1.0

LGBTQ+ victims of cyberbullying
preferred label: Ciberacoso @es
alternative label: Victims of cyberbullying (LGBTQ)
alternative label: LGBTQ+ cyberbullying victims
alternative label: Cyberbullying victims (LGBTQ)
alternative label: Ciberbullying @es
comment: LGBTQ+ people who have experienced and may or may not have survived cyberbullying, a form of bullying or harassment that takes place online. Follow the individual's preference for "victims" or "survivors" whenever possible.
comment: Intimidación o acoso que se lleva a cabo en línea. @es
broader: LGBTQ+ victims of bullying
narrower: LGBTQ+ survivors of cyberbullying
has top concept: LGBTQ+ people
replaces: cyberbullying
issued: 2019-05-14
modified: 2025-04-01
type: Concept
in scheme: v3
change note: Version 4.1.0

Cybersex
preferred label: Cibersexo @es
alternative label: Internet sex
alternative label: Online sex
alternative label: Sexo online @es
alternative label: Sexo por Internet @es
alternative label: Sexo virtual @es
comment: Erotic or sexual communication and activity between two or more people that takes place online or using technology (e.g., texting, video chatting).
comment: Comunicación y actividad erótica o sexual entre dos o más personas que se lleva a cabo en línea o utilizando tecnología (por ejemplo, mensajes de texto, video chat). @es
related: Sexuality
replaces: cybersex
issued: 2019-05-14
modified: 2025-03-20
type: Concept
in scheme: v3
change note: Version 4.1.0

Dandies
preferred label: Dandis @es
comment: Men who place particular importance upon physical appearance, refined language, and leisurely hobbies.
comment: Hombres que dan especial importancia a la apariencia física, al lenguaje refinado y a las aficiones ociosas. @es
broader: Gender roles
broader: LGBTQ+ historical terms
broader: Sexual identity
related: Dandyism
related: Gender expression
has top concept: Role behavior
replaces: dandies
issued: 2019-05-14
modified: 2025-02-23
type: Concept
in scheme: v3
change note: Version 4.1.0

Dandyism
preferred label: Dandismo @es
comment: The style or conduct of a dandy.
comment: El estilo o la conducta de un dandi. @es
broader: Subcultures
related: Dandies
has top concept: Subcultures
replaces: dandyism
issued: 2019-05-14
modified: 2025-02-23
type: Concept
in scheme: v3
change note: Version 4.1.0

Dating applications
preferred label: Aplicaciones de citas @es
preferred label: LGBTQ+ dating applications
preferred label: Aplicaciones de citas LGBTQ+ @es
alternative label: Dating apps
alternative label: Apps de citas @es
alternative label: LGBTQ dating applications
alternative label: Aplicaciones de citas LGBTQ @es
comment: Software applications designed to generate connections between people interested in romantic or sexual relationships.
comment: Aplicaciones de software diseñadas para generar conexiones entre personas interesadas en relaciones románticas o sexuales. @es
comment: Software applications designed to generate connections between LGBTQ+ people interested in romantic or sexual relationships.
comment: Aplicaciones de software diseñadas para generar conexiones entre personas LGBTQ+ interesadas en relaciones románticas o sexuales. @es
broader: Social media
broader: LGBTQ+ social media
related: Cybersex
related: Dating websites
related: LGBTQ+ online dating
related: LGBTQ+ dating websites
related: LGBTQ+ meeting places
related: Digital identification of LGBTQ+ people by police
related: LGBTQ+ dating
has top concept: Social media
has top concept: LGBTQ+ social media
replaces: datingApplications
replaces: LGBTQDatingApplications
issued: 2019-05-14
modified: 2025-07-16
modified: 2025-04-01
type: Concept
in scheme: v3
change note: Version 4.1.0

Dating websites
preferred label: Sitios web de citas @es
comment: Online websites designed to generate connections between people interested in romantic or sexual relationships.
comment: Sitios web en línea diseñados para generar conexiones entre personas interesadas en relaciones románticas o sexuales. @es
broader: Social media
narrower: LGBTQ+ dating websites
related: LGBTQ+ online dating
has top concept: Social media
is replaced by: LGBTQ+ dating websites
replaces: datingWebsites
issued: 2019-05-14
modified: 2025-07-16
type: Concept
in scheme: v3
change note: Version 4.1.0

LGBTQ+ daughters
preferred label: Hijas LGBTQ+ @es
alternative label: Daughters (LGBTQ)
alternative label: Hijas (LGBTQ) @es
comment: Daughters who identify as LGBTQ+.
comment: Hijas que se autoidentifican como LGBTQ+. @es
broader: LGBTQ+ people
broader: Daughters
narrower: Bisexual daughters
narrower: Lesbian daughters
narrower: Queer daughters
narrower: Transgender daughters
narrower: Asexual daughters
narrower: Intersex daughters
related: Two-Spirit daughters
has top concept: LGBTQ+ people
replaces: daughtersLGBTQ
issued: 2019-05-14
modified: 2025-02-23
type: Concept
in scheme: v3
change note: Version 4.1.0

Daughters of bisexual people
preferred label: Hijas de personas bisexuales @es
comment: Daughters who have one or more bisexual parent.
comment: Hijas que tienen uno o más padres bisexuales. @es
broader: Daughters of LGBTQ+ people
has top concept: Family members
replaces: daughtersOfBisexualPeople
issued: 2019-05-14
modified: 2025-02-23
type: Concept
in scheme: v3
change note: Version 4.1.0

Daughters of gay men
preferred label: Hijas de hombres gay @es
comment: Daughters who have one or more gay parent.
comment: Hijas que tienen uno o más padres gay. @es
broader: Daughters of LGBTQ+ people
has top concept: Family members
replaces: daughtersOfGayMen
issued: 2019-05-14
modified: 2025-02-23
type: Concept
in scheme: v3
change note: Version 4.1.0

Daughters of lesbians
preferred label: Hijas de lesbianas @es
comment: Daughters who have one or more lesbian parent.
comment: Hijas que tienen uno o más padres lesbianas. @es
broader: Daughters of LGBTQ+ people
has top concept: Family members
replaces: daughtersOfLesbians
issued: 2019-05-14
modified: 2025-02-23
type: Concept
in scheme: v3
change note: Version 4.1.0

Daughters of transgender people
preferred label: Hijas de personas transgénero @es
comment: Daughters who have one or more transgender parent.
comment: Hijas que tienen uno o más padres transgénero. @es
broader: Daughters of LGBTQ+ people
has top concept: Family members
replaces: daughtersOfTransgenderPeople
issued: 2019-05-14
modified: 2025-02-23
type: Concept
in scheme: v3
change note: Version 4.1.0

Daughters of queer people
preferred label: Hijas de personas queer @es
comment: Daughters who have one or more queer parent.
comment: Hijas que tienen uno o más padres queer. @es
broader: Daughters of LGBTQ+ people
has top concept: Family members
replaces: daughtersOfQueerPeople
issued: 2019-05-14
modified: 2025-02-23
type: Concept
in scheme: v3
change note: Version 4.1.0

Deadnaming
alternative label: Uso del nombre muerto @es
alternative label: Uso del nombre pasado @es
alternative label: Necrónimo @es
alternative label: Necronombre @es
comment: The act of using or referring to a person’s assigned name rather than their chosen name, commonly with malicious intent.
comment: El acto de usar o hacer referencia al nombre asignado de una persona en lugar de utilizar su nombre elegido, comúnmente con intenciones maliciosas. @es
broader: Anti-transgender discrimination
related: Misgendering
related: Outing (LGBTQ+ culture)
related: Slurs
has top concept: LGBTQ+ discrimination
replaces: deadnaming
issued: 2019-05-14
modified: 2025-03-20
type: Concept
in scheme: v3
change note: Version 4.1.0

LGBTQ+ deaf people
alternative label: Deaf people (LGBTQ)
alternative label: LGBTQ auditive disabled people
alternative label: LGBTQ deaf
alternative label: LGBTQ deaf-mutes
alternative label: LGBTQ deaf people
narrower: Intersex Deaf people
is replaced by: homoit0001866
replaces: LGBTQDeafPeople
issued: 2019-05-14
modified: 2023-06-30
type: Concept
in scheme: v3
change note: Version 4.1.0

Decadence
preferred label: Decadencia @es
comment: A way of life characterized by mannerisms and affectations marked by excess.
comment: Una forma de vida caracterizada por manierismos y afectaciones marcadas por el exceso. @es
broader: Subcultures
related: Sexual identity
has top concept: Subcultures
replaces: decadence
issued: 2019-05-14
modified: 2025-02-23
type: Concept
in scheme: v3
change note: Version 4.1.0

Decriminalization
preferred label: Despenalización @es
preferred label: Decriminalisation
comment: The process of lessening or removing criminal penalties for certain acts.
comment: El proceso de reducir o eliminar las sanciones penales por determinados actos. @es
broader: Criminal law
narrower: Decriminalization of sex work
related: LGBTQ+ civil rights
related: Criminalization
has top concept: Law
replaces: decriminalisation
issued: 2019-05-14
modified: 2025-02-23
type: Concept
in scheme: v3
change note: Version 4.1.0

Dee
comment: In Thailand, cisgender women who conform to feminine gender norms and who often partner with masculine-identified toms; similar to a femme in U.S. lesbian culture.
comment: En Tailandia, las mujeres cisgénero que se conforman con las normas de género femeninas y que a menudo se emparejan con "toms"; similar a una mujer femme en la cultura lésbica estadounidense. @es
broader: Non-Euro-American gender and sexual identities
related: Katoey
related: Tom
has top concept: Gender
replaces: dee
issued: 2019-05-14
modified: 2025-02-23
type: Concept
in scheme: v3
change note: Version 4.1.0

Hate speech
preferred label: Discurso de odio @es
alternative label: Defamation against groups
alternative label: Group defamation
alternative label: Group libel
comment: Any form of expression (written or verbal) with the intention to vilify, humiliate, or incite hatred against a individual or group of people on the basis of their actual or perceived race, religion, nationality, sexual identity, gender identity, or ability status.
comment: Cualquier forma de expresión (escrita o verbal) con la intención de vilipendiar, humillar o incitar al odio contra una persona o grupo de personas por su raza, religión, nacionalidad, identidad sexual, identidad de género o estado de capacidad real o percibido. @es
related: Hate crimes
related: Intolerance towards LGBTQ+ people
related: LGBTQ+ defamation campaigns
replaces: hateSpeech
issued: 2019-05-14
modified: 2025-02-23
type: Concept
in scheme: v3
change note: Version 4.1.0

Demigender people
preferred label: Personas demigénero @es
comment: People who have a partial connection to a certain gender or concept of gender.
comment: Personas que tienen una conexión parcial con un determinado género o concepto de género. @es
broader: Transgender people
broader: Gender minorities
narrower: Demigirls
narrower: Demiboys
related: Gender identity
related: Demigender identity
has top concept: LGBTQ+ people
replaces: demigenderPeople
issued: 2019-05-14
modified: 2025-02-23
type: Concept
in scheme: v3
change note: Version 4.1.0

Demisexuality
preferred label: Demisexualidad @es
comment: A sexual orientation generally characterized by the lack of sexual attraction to other people unless or until emotional connections have been formed.
comment: Una orientación sexual generalmente caracterizada por la falta de atracción sexual hacia otras personas a menos o hasta que se hayan formado conexiones emocionales. @es
broader: Sexual orientation
related: Demisexual people
related: Compulsory sexuality
related: Demigender identity
related: Demiromanticism
has top concept: Sexual orientation
replaces: demisexuality
issued: 2019-05-14
modified: 2025-02-23
type: Concept
in scheme: v3
change note: Version 4.1.0

Demisexual people
preferred label: Personas demisexuales @es
comment: Individuals who do not experience sexual attraction unless they have first formed a strong emotional connection with a person.
comment: Personas que no experimentan atracción sexual a menos que primero hayan formado una fuerte conexión emocional con una persona. @es
broader: Sexual identity
broader: Sexual minorities
broader: Sexual preference
narrower: Demisexual college students
related: Demisexuality
related: Sexual relationships
related: Compulsory sexuality
related: Demiromantic people
has top concept: Sexual identity
replaces: demisexualPeople
issued: 2019-05-14
modified: 2025-02-23
type: Concept
in scheme: v3
change note: Version 4.1.0

Denial of sexual orientation
preferred label: Negación de la orientación sexual @es
comment: Refusal to acknowledge or affirm one's own sexual identity, or the sexual identity of another individual.
comment: Negarse a reconocer o afirmar la identidad sexual propia o la identidad sexual de otra persona. @es
related: Internalized homophobia
related: Latent homosexuality
related: LGBTQ+ self-repression
related: Sexual orientation
related: Internalized oppression
replaces: denialOfSexualOrientation
issued: 2019-05-14
modified: 2025-02-23
type: Concept
in scheme: v3
change note: Version 4.1.0

Dental dams
preferred label: Presas dentales @es
alternative label: Latex barriers
alternative label: Barreras de látex @es
alternative label: Diques dentales @es
alternative label: Diques de goma @es
alternative label: Barreras bucales @es
comment: A square sheet of latex or polyurethane used to create a barrier between the mouth and the vagina or anus during oral sex.
comment: Una lámina cuadrada de látex o poliuretano utilizada para crear una barrera entre la boca y la vagina o el ano durante el sexo oral. @es
broader: Sex accessories
related: Safer sex
has top concept: Sex accessories
replaces: dentalDams
issued: 2019-05-14
modified: 2025-02-23
type: Concept
in scheme: v3
change note: Version 4.1.0

Desire to have children
preferred label: Deseo de tener hijos @es
alternative label: Deseo por tener hijos @es
comment: A person's drive or desire to have children.
comment: El impulso o deseo de una persona de tener hijos. @es
related: Children
related: Conception by LGBTQ+ people
related: LGBTQ+ family planning
related: LGBTQ+ parenthood
replaces: desireToHaveChildren
issued: 2019-05-14
modified: 2025-02-23
type: Concept
in scheme: v3
change note: Version 4.1.0

Detention of LGBTQ+ people
preferred label: Detención de personas LGBTQ+ @es
alternative label: Detention of LGBTQ people
alternative label: Detención de personas LGBTQ @es
comment: Temporary physical and legal confinement of LGBTQ+ people by an institution or authority, typically pending criminal charges or deportation. Can also be used to describe individuals held in custody for political purposes or within the context of war.
comment: Confinamiento físico y legal temporal de personas LGBTQ+ por parte de una institución o autoridad, generalmente en espera de cargos penales o deportación. También se puede utilizar para describir a personas detenidas por motivos políticos o en contexto de guerra. @es
narrower: Arrests of LGBTQ+ people
narrower: Detention of LGBTQ+ people under a hospital order
narrower: LGBTQ+ incarceration
related: Legal status
related: LGBTQ+ immigration rights
related: LGBTQ+ incarcerated people
replaces: detentionOfLGBTQPeople
issued: 2019-05-14
modified: 2025-02-23
type: Concept
in scheme: v3
change note: Version 4.1.0

Detention of LGBTQ+ people under a hospital order
preferred label: Detención de personas LGBTQ+ por orden de un hospital @es
alternative label: Detention of LGBTQ people under a hospital order
alternative label: Detención de personas LGBTQ por orden de un hospital @es
comment: Physical and legal confinement of LGBTQ+ people in hospitals or medical institutions, typically to receive evaluation and treatment ordered by a court or other such authority. Can be used to describe both short-term or long-term institutionalization.
comment: Confinamiento físico y legal de personas LGBTQ+ en hospitales o instituciones médicas, generalmente para recibir evaluación y tratamiento, ordenado por un tribunal u otra autoridad similar. Puede usarse para describir el internamiento en instituciones tanto a corto como a largo plazo. @es
broader: Detention of LGBTQ+ people
related: Electroshock therapy
related: Mental health care for LGBTQ+ people
has top concept: Detention of LGBTQ+ people
replaces: detentionOfLGBTQPeopleUnderAHospital
issued: 2019-05-14
modified: 2025-02-23
type: Concept
in scheme: v3
change note: Version 4.1.0

Dhurani
comment: Bengali term for third sex people, often referring to feminine people who were assigned male at birth.
comment: Término bengalí para personas del tercer sexo, que a menudo se refiere a personas femeninas asignadas al sexo masculino al nacer. @es
broader: Non-Euro-American gender and sexual identities
has top concept: Gender
replaces: dhurani
issued: 2019-05-14
modified: 2025-02-23
type: Concept
in scheme: v3
change note: Version 4.1.0

DSM (Diagnostic and Statistical Manual of Mental Disorders)
preferred label: MDE (Manual diagnóstico y estadístico de los trastornos mentales) @es
alternative label: DSM
alternative label: Diagnostic and Statistical Manual of Mental Disorders
comment: The Diagnostic and Statistical Manual of Mental Disorders, produced by the American Psychiatric Association; can be used in reference to the DSM's historical or present day descriptions of LGBTQ+ identities and practices.
comment: El Manual Diagnóstico y Estadístico de los Trastornos Mentales, elaborado por la Asociación Estadounidense de Psiquiatría; se puede utilizar en referencia a las descripciones históricas o actuales del MDE de las identidades y prácticas LGBTQ+. @es
related: Mental health care for LGBTQ+ people
replaces: DSM
issued: 2019-05-14
modified: 2025-02-23
type: Concept
in scheme: v3
change note: Version 4.1.0

Intersex
alternative label: Differences in sex development
alternative label: Divergences in sex development
alternative label: DSDs
alternative label: Hermaphroditism
alternative label: Intersexuality
alternative label: Variations in sex development
alternative label: VSDs
alternative label: Intersexual @es
comment: An umbrella term used to refer to people born with variations in their physical sex characteristics--including genitals, gonads, chromosomes, and hormonal factors--that do not fit typical definitions of male or female bodies.
comment: Un término general utilizado para referirse a personas que nacen con variaciones en sus características sexuales físicas (incluidos genitales, gónadas, cromosomas y factores hormonales) que no se ajustan a las definiciones típicas de cuerpos masculinos o femeninos. @es
broader: Sex (Body)
narrower: Disorders of sexual development
narrower: Intersex variations
narrower: Early genital surgery model
narrower: Hopkins model
related: Intersex people
related: Intersexphobia
related: Intersex genital mutilation
related: Intersex identity
related: Intersex movement
related: Hermaphrodites
has top concept: Sex (Body)
replaces: intersex
issued: 2019-05-14
modified: 2025-02-23
type: Concept
in scheme: v3
change note: Version 4.1.0

Dilbaa
comment: Navajo term for a person assigned female at birth who takes on the role of a boy in childhood and a man in adulthood.
comment: Término navajo para una persona asignada al sexo femenino al nacer que asume el papel de niño en la infancia y de hombre en la edad adulta. @es
broader: Non-Euro-American gender and sexual identities
related: Nádleehi
related: Two-Spirit people
has top concept: Gender
replaces: dilbaa
issued: 2019-05-14
modified: 2025-02-23
type: Concept
in scheme: v3
change note: Version 4.1.0

Dildo harnesses
preferred label: Arneses para consoladores @es
alternative label: Strap-ons
comment: Devices worn to attach a dildo to a person's body, typically so they can penetrate a partner's vagina or anus.
comment: Dispositivos que se utilizan para sujetar un consolador al cuerpo de una persona, generalmente para que pueda penetrar la vagina o el ano de una pareja. @es
broader: Harnesses
broader: Sex accessories
related: Dildos
related: Packing (Phallus)
related: Strap-on sex
related: Thigh harnesses
has top concept: Sex accessories
replaces: dildoHarnesses
issued: 2019-05-14
modified: 2025-02-23
type: Concept
in scheme: v3
change note: Version 4.1.0

Dildos
preferred label: Consoladores @es
comment: A sex toy, often explicitly (although not necessarily) phallic in appearance, intended for sexual penetration or other sexual activity during masturbation or with sex partners.
comment: Instrumentos con forma fálica utilizados para la estimulación sexual, generalmente mediante la penetración del ano o la vagina. @es
broader: Sex accessories
related: Dildo harnesses
related: Penis
related: Strap-on sex
related: Vibrators
has top concept: Sex accessories
replaces: dildos
issued: 2019-05-14
modified: 2025-02-23
type: Concept
in scheme: v3
change note: Version 4.1.0

LGBTQ+ discrimination
preferred label: Discriminación LGBTQ+ @es
alternative label: Discrimination (LGBTQ)
alternative label: Discriminación (LGBTQ) @es
comment: The unjust or prejudicial treatment of LGBTQ+ people or communities due to their sexual or gender identities; may include the denial of legal rights, employment, and housing.
comment: El trato injusto o perjudicial hacia personas o comunidades LGBTQ+ debido a sus identidades sexuales o de género; puede incluir la negación de derechos legales, empleo y vivienda. @es
narrower: Anti-bisexual discrimination
narrower: Anti-gay discrimination
narrower: Anti-lesbian discrimination
narrower: Anti-queer discrimination
narrower: Anti-transgender discrimination
narrower: Anti-Two-Spirit discrimination
narrower: Anti-intersex discrimination
narrower: Anti-asexual discrimination
related: Anti-discrimination law
related: Intolerance towards LGBTQ+ people
related: Harassment
related: Lavender Scare
related: LGBTQ+ persecutions
related: Amatonormativity
related: Compulsory sexuality
related: Mononormativity
related: Slurs
related: Stigma
related: LGBTQ+ criminalization
related: Gentrification
replaces: discriminationLGBTQ
issued: 2019-05-14
modified: 2026-02-26
type: Concept
in scheme: v3
change note: Version 4.1.0

Disorders of sexual development
preferred label: Trastornos del desarrollo sexual @es
alternative label: Disorders of sex development
alternative label: Desórdenes del desarrollo sexual @es
comment: Term used within medical contexts to refer to a wide range of variations in sex characteristics. Many people with intersex variations consider these terms to be stigmatizing and pathologizing, though they often still encounter them in their medical records.
comment: Término utilizado en contextos médicos para referirse a una amplia gama de variaciones en las características sexuales. Muchas personas con variaciones intersex consideran que estos términos son estigmatizantes y patologizantes, aunque a menudo todavía los encuentran en sus registros médicos. @es
broader: Intersex
related: Medicalization
has top concept: Sex (Body)
replaces: disordersOfSexualDevelopment
issued: 2019-05-14
modified: 2025-02-23
type: Concept
in scheme: v3
change note: Version 4.1.0

Diversity
preferred label: Diversidad @es
comment: Diversity in characteristics of people in age, gender, religion, ethnicity, sexual orientation, lifestyle, etc.
comment: Diversidad en las características de las personas en cuanto a edad, género, religión, etnicidad, orientación sexual, estilo de vida, etc. @es
narrower: Gender diversity
narrower: Sexual diversity
related: Intersectionality
replaces: diversity
issued: 2019-05-14
modified: 2025-02-23
type: Concept
in scheme: v3
change note: Version 4.1.0

Divorced people
preferred label: Personas divorciadas @es
comment: People whose marriages have been legally dissolved.
comment: Personas cuyos matrimonios han sido legalmente disueltos. @es
broader: Marital status
related: LGBTQ+ divorce
related: Single people
has top concept: Living arrangements
replaces: divorcedPeople
issued: 2019-05-14
modified: 2025-02-23
type: Concept
in scheme: v3
change note: Version 4.1.0

Domestic partnership contracts
preferred label: Contratos de parejas de hecho @es
alternative label: Contratos de uniones de hecho @es
comment: Agreements, legal or otherwise, between two unmarried people in a domestic partnership that define property rights and support obligations if the relationship ends or if one partner dies.
comment: Acuerdos, legales o de otro tipo, entre dos personas no casadas en una pareja de hecho que definen los derechos de propiedad y respaldan las obligaciones si la relación termina o si una de las parejas muere. @es
broader: Official documentation
related: Domestic partnership retirement benefits
related: Domestic partnerships
related: LGBTQ+ personal and family law
related: LGBTQ+ weddings
related: Living arrangements
related: Marriage
has top concept: Legal status
replaces: domesticPartnershipContracts
issued: 2019-05-14
modified: 2025-02-23
type: Concept
in scheme: v3
change note: Version 4.1.0

Domestic partnership retirement benefits
preferred label: Beneficios de jubilación de parejas de hecho @es
alternative label: Same-sex pension benefits
alternative label: Beneficios de jubilación de uniones de hecho @es
alternative label: Beneficios de jubilación de parejas del mismo sexo @es
comment: Employee benefit plans for people in domestic partnerships that can be accessed upon retirement.
comment: Planes de beneficios para empleados para personas en parejas de hecho a los que se puede acceder al jubilarse. @es
related: Domestic partnership contracts
related: LGBTQ+ personal and family law
replaces: domesticPartnershipRetirementBenefits
issued: 2019-05-14
modified: 2025-02-23
type: Concept
in scheme: v3
change note: Version 4.1.0

Domestic partnerships
preferred label: Parejas de hecho @es
alternative label: Uniones de hecho @es
alternative label: Emparejamiento doméstico @es
alternative label: Asociación libre @es
comment: Legal or personal relationships between individuals who live together and share their lives but are not married or joined by civil union.
comment: Relaciones jurídicas o personales entre personas que viven juntas y comparten sus vidas pero que no están casadas ni unidas por unión civil. @es
broader: Living arrangements
related: Civil unions
related: Domestic partnership contracts
related: Marriage
related: Official documentation
related: Relationship satisfaction
related: Significant others
has top concept: Living arrangements
replaces: domesticPartnerships
issued: 2019-05-14
modified: 2025-02-23
type: Concept
in scheme: v3
change note: Version 4.1.0

LGBTQ+ dominatrices
preferred label: Dominatrices LGBTQ+ @es
alternative label: Dominatrices (LGBTQ)
alternative label: LGBTQ+ D-types
alternative label: LGBTQ+ Dommes
alternative label: LGBTQ+ Mistresses
comment: The person who takes on the position of authority or power in a power exchange relationship or kink activity. Most commonly used by feminine identified people and professional dominants.
comment: Mujeres que desempeñan un papel dominante en las actividades de BDSM; utilícese para dominatrices que se autoidentifiquen como LGBTQ+. @es
broader: Relationship minorities
broader: Kinky people
narrower: Bisexual dominatrices
narrower: Lesbian dominatrices
narrower: Queer dominatrices
narrower: Transgender dominatrices
narrower: Asexual dominatrices
related: Kink community
related: Leather community
related: LGBTQ+ dominants
related: LGBTQ+ mistresses (BDSM culture)
related: LGBTQ+ submissives
related: Power exchange
has top concept: Relationship minorities
replaces: dominatricesLGBTQ
issued: 2019-05-14
modified: 2025-02-23
type: Concept
in scheme: v3
change note: Version 4.1.0

Donors
preferred label: Donantes @es
comment: Individuals who donate their own biological materials, typically gametes (e.g., sperm or eggs), organs, or blood.
comment: Personas que donan sus propios materiales biológicos, normalmente gametos (p. ej., esperma u óvulos), órganos o sangre. @es
narrower: Egg donors
narrower: LGBTQ+ blood donors
narrower: Sperm donors
narrower: Anonymous donors (Reproduction)
narrower: Known donors (Reproduction)
narrower: Open identity donors (Reproduction)
related: Biological parenthood
related: Genetic parenthood
related: Conception by LGBTQ+ people
related: LGBTQ+ personal and family law
related: Medical care
related: Donor siblings
replaces: donors
issued: 2019-05-14
modified: 2025-02-23
type: Concept
in scheme: v3
change note: Version 4.1.0

Down-low
preferred label: Down-low (Cultura gay) @es
comment: African American slang term that describes a subculture of Black men who identify as heterosexual but have sex with men.
comment: Término de la jerga afroamericana que describe una subcultura de hombres negros que se autoidentifican como heterosexuales pero tienen relaciones sexuales con hombres. @es
broader: African American LGBTQ+ people
related: African American bisexual people
related: Closeted bisexual people
related: Closeted gay men
related: African American gay men
related: Men who have sex with men
related: Secrecy
related: Closeted LGBTQ+ people
related: Closeted queer people
related: Closeted intersex people
related: Closeted Two-Spirit people
related: Beards (Gay culture)
related: MLM (Men Loving Men)
has top concept: LGBTQ+ people
replaces: downLow
issued: 2019-05-14
modified: 2025-02-23
type: Concept
in scheme: v3
change note: Version 4.1.0

Drab (LGBTQ+ culture)
preferred label: Drab (cultura LGBTQ+) @es
alternative label: Drab
comment: Slang term used to describe people wearing masculine clothing, typically drag queens or crossdressers who also sometimes wear feminine clothing. Drab is a shortened form of the phrase "dressed as a boy" or "dress resembling a boy."
comment: Término de la jerga utilizado para describir a personas que visten ropa masculina, generalmente drag queens o transformistas que a veces también visten ropa femenina. Drab es una forma abreviada de la frase en inglés "dressed as a boy" o "dress resembling a boy". @es
broader: Gender expression
related: Clothing
related: Drag
has top concept: Gender
replaces: drab
issued: 2019-05-14
modified: 2025-02-23
type: Concept
in scheme: v3
change note: Version 4.1.0

Drag
comment: A performance genre involving dressing and/or using makeup to produce, emphasize, and/or exaggerate traits associated with a certain gender, which typically (but not always) is not the gender the performer primarily identifies with.
comment: Un tipo de actuación que implica vestirse y/o usar maquillaje para producir, enfatizar y/o exagerar rasgos asociados con un determinado género, que normalmente (pero no siempre) no es el género con el que el artista se identifica principalmente. @es
broader: Gender expression
narrower: Lingerie
narrower: Drag in film
narrower: Drag television programs
related: Camp (Gay culture)
related: Clothing
related: Drab (LGBTQ+ culture)
related: Drag balls
related: Drag bars
related: Drag community
related: Drag kings
related: Drag queens
related: LGBTQ+ arts
related: Voguing
related: Costumes
related: Masquerading
related: Drag performers
related: Drag shows
related: Drag pageants
has top concept: Gender
replaces: drag
issued: 2019-05-14
modified: 2025-02-23
type: Concept
in scheme: v3
change note: Version 4.1.0

Drag balls
preferred label: Bailes de drag @es
alternative label: Balls de drag @es
comment: Events that are part of the drag ball subculture that emerged in early 20th-century New York City among primarily African-American and Latin American LGBTQ+ people. During a drag ball, individuals "walk" or perform for prizes.
comment: Eventos que forman parte de la subcultura de bailes de drag que surgió a principios del siglo XX en la ciudad de Nueva York entre personas LGBTQ+ principalmente afroamericanas y latinoamericanas. Durante un drag ball, las personas "caminan" o actúan para ganar premios. @es
broader: Europride
related: Ball culture
related: Drag
related: Drag community
related: Voguing
has top concept: Europride
replaces: dragBalls
issued: 2019-05-14
modified: 2025-02-23
type: Concept
in scheme: v3
change note: Version 4.1.0

Drag bars
preferred label: Bares drag @es
comment: Establishments (typically serving alcohol) that host drag shows or other events featuring drag performers.
comment: Establecimientos (que usualmente sirven alcohol) que presentan espectáculos de drag u otros eventos con artistas drag. @es
broader: LGBTQ+ bars
related: Drag
related: Drag community
related: LGBTQ+ pubs
related: Drag shows
related: Drag pageants
has top concept: LGBTQ+ meeting places
replaces: dragBars
issued: 2019-05-14
modified: 2025-02-23
type: Concept
in scheme: v3
change note: Version 4.1.0

Drag community
preferred label: Comunidad drag @es
comment: Groups of people (typically drag performers) with a shared interest in drag performances and culture.
comment: Grupos de personas (usualmente artistas drag) con un interés compartido en las presentaciones y la cultura drag. @es
broader: LGBTQ+ communities
narrower: Drag families
related: Ball culture
related: Drag
related: Drag balls
related: Drag bars
related: Drag kings
related: Drag queens
related: Reading (LGBTQ+ culture)
related: Drag performers
has top concept: LGBTQ+ communities
replaces: dragCommunity
issued: 2019-05-14
modified: 2025-02-23
type: Concept
in scheme: v3
change note: Version 4.1.0

Drag families
preferred label: Familias drag @es
comment: Groups of drag performers who share a community and typically live in close quarters with one another. Drag families are headed by drag mothers or drag fathers, with other members termed drag daughters and sons. Members of a drag family typically use the same last name as their drag mother or father (e.g., Xtravaganza) in social contexts or while performing.
comment: Grupos de artistas drag que comparten una comunidad y usualmente viven cerca unos de otros. Las familias drag están encabezadas por madres drag o padres drag, y otros miembros se denominan hijas e hijos drag. Los miembros de una familia drag suelen utilizar el mismo apellido que su madre o padre drag (por ejemplo, Xtravaganza) en contextos sociales o mientras se presentan. @es
broader: Drag community
broader: LGBTQ+ families
broader: LGBTQ+ chosen families
narrower: Drag fathers
narrower: Drag mothers
related: Ballroom families
related: Drag kings
related: Drag queens
has top concept: LGBTQ+ communities
replaces: dragFamilies
issued: 2019-05-14
modified: 2025-02-23
type: Concept
in scheme: v3
change note: Version 4.1.0

Drag fathers
preferred label: Padres drag @es
comment: More experienced drag kings who support less experienced drag kings as they enter the drag scene as performers.
comment: Drag kings con más experiencia que apoyan a drag kings con menos experiencia cuando ingresan a la escena drag como artistas. @es
broader: Drag families
related: Drag kings
related: Drag mothers
related: Drag queens
has top concept: LGBTQ+ communities
replaces: dragFathers
issued: 2019-05-14
modified: 2025-02-23
type: Concept
in scheme: v3
change note: Version 4.1.0

Drag kings
alternative label: Reyes drag @es
comment: Performers, often people assigned female at birth, who dress in stereotypically masculine attire and enact masculine personas for the purpose of entertainment.
comment: Artistas, a menudo personas asignadas al sexo femenino al nacer, que se visten con atuendos estereotípicamente masculinos y representan personajes masculinos con el propósito de entretener. @es
related: Crossdressers
related: Drag
related: Drag community
related: Drag families
related: Drag fathers
related: Drag mothers
related: Drag queens
related: Male impersonators
related: Drag performers
replaces: dragKings
issued: 2019-05-14
modified: 2025-02-23
type: Concept
in scheme: v3
change note: Version 4.1.0

Drag mothers
preferred label: Madres drag @es
comment: More experienced drag queens who support less experienced drag queens as they enter the drag scene as performers.
comment: Drag queens con más experiencia que apoyan a drag queens con menos experiencia cuando ingresan a la escena drag como artistas. @es
broader: Drag families
related: Drag fathers
related: Drag kings
related: Drag queens
has top concept: LGBTQ+ communities
replaces: dragMothers
issued: 2019-05-14
modified: 2025-02-23
type: Concept
in scheme: v3
change note: Version 4.1.0

Drag queens
alternative label: Reinas drag @es
comment: Performers, often people assigned male at birth, who dress in stereotypically feminine attire and enact feminine personas for the purpose of entertainment.
comment: Artistas, a menudo personas asignadas al sexo masculino al nacer, que se visten con atuendos estereotípicamente femeninos y representan personajes femeninos con el propósito de entretener. @es
broader: Queens (Gay culture)
related: Crossdressers
related: Drag
related: Drag community
related: Drag families
related: Drag fathers
related: Drag kings
related: Drag mothers
related: Female impersonators
related: Drag performers
has top concept: Subcultures
replaces: dragQueens
issued: 2019-05-14
modified: 2025-02-23
type: Concept
in scheme: v3
change note: Version 4.1.0

LGBTQ+ drama
preferred label: Drama LGBTQ+ @es
alternative label: Drama (LGBTQ)
comment: Works of fiction written to be performed; use in reference to dramatic works focusing on LGBTQ+ characters or themes.
comment: Obras de ficción escritas para ser puestas en escena; utilícese en referencia a obras dramáticas que se centran en personajes o temas LGBTQ+. @es
broader: LGBTQ+ literature
narrower: Bisexual drama
narrower: Gay drama
narrower: Lesbian drama
narrower: Queer drama
narrower: Transgender drama
narrower: Aromantic drama
narrower: Asexual drama
narrower: Demisexual drama
narrower: Megasexual drama
narrower: Greyromantic drama
narrower: Intersex drama
related: LGBTQ+ plays
related: LGBTQ+ theater
related: LGBTQ+ authors
related: Two-Spirit drama
has top concept: Subcultures
replaces: dramaLGBTQ
issued: 2019-05-14
modified: 2025-02-23
type: Concept
in scheme: v3
change note: Version 4.1.0

Driver's licenses
preferred label: Licencias de conducir @es
alternative label: Carnet de conducir @es
alternative label: Licencia de manejar @es
alternative label: Carnet de manejo @es
alternative label: Licencia de manejo Carné de conducir @es
alternative label: Carné de manejar @es
alternative label: Carné de manejo|| @es
comment: Legal documents authorizing individuals to operate motor vehicles; commonly used as legal proof of identity; can be used in reference to LGBTQ+ people seeking driver's licenses or changes to existing licenses (e.g., name, gender or sex marker, photo).
comment: Documentos legales que autorizan a personas a operar vehículos de motor; comúnmente utilizado como prueba legal de identidad; se puede utilizar en referencia a personas LGBTQ+ que buscan licencias de conducir o cambios en las licencias existentes (por ejemplo, nombre, género o marcador de sexo, foto). @es
broader: Official documentation
narrower: Gender markers
related: Legal name change
related: Court orders
related: Medical practitioners' statements
related: Social security cards
related: Transitioning (Gender)
has top concept: Legal status
replaces: driversLicenses
issued: 2019-05-14
modified: 2025-03-20
type: Concept
in scheme: v3
change note: Version 4.1.0

LGBTQ+ people who use substances
preferred label: Personas LGBTQ+ que utilizan sustancias @es
alternative label: Drug users (LGBTQ)
alternative label: LGBTQ+ people who drink
alternative label: LGBTQ+ people who use drugs
alternative label: Substance users (LGBTQ)
comment: Umbrella term for LGBTQ+ people who use substances (that are typically deemed harmful or are subject to legal restriction, such as drugs or alcohol) for any reason. Apply more specific terms if possible.
comment: Término general para las personas LGBTQ+ que utilizan sustancias (que suelen ser consideradas nocivas o están sujetas a restricciones legales, como las drogas o el alcohol) por cualquier motivo. Aplique términos más específicos de ser posible. @es
broader: LGBTQ+ people
narrower: Party drugs
narrower: Alcoholics
narrower: LGBTQ+ people with addictions
narrower: LGBTQ+ people who use substances for medical purposes
related: Two-Spirit people who use substances
has top concept: LGBTQ+ people
replaces: drugUsers
issued: 2019-05-14
modified: 2025-04-24
type: Concept
in scheme: v3
change note: Version 4.1.0

Dutch boys
alternative label: Lesbros
comment: Slang for heterosexual men who are friends with lesbians and socialize in lesbian spaces.
broader: Heterosexual men
related: Fag hags
related: Friendships
related: Goldilocks (Gay culture)
related: Social privilege
related: Beards (Gay culture)
has top concept: Heterosexuals
replaces: dutchBoys
issued: 2019-05-14
modified: 2025-02-23
type: Concept
in scheme: v3
change note: Version 4.1.0

Lesbian culture
preferred label: Cultura lésbica @es
alternative label: Dyke culture
comment: Use to describe cultural experiences shared by members of lesbian communities or products of lesbian culture (e.g., art and media created by and for lesbians, activism focused on lesbian issues, slang commonly used in lesbian communities, etc.).
comment: Utilícese para describir experiencias culturales compartidas por miembros de comunidades lésbicas o productos de la cultura lésbica (p. ej., arte y medios creados por y para lesbianas, activismo centrado en cuestiones lésbicas, jerga comúnmente utilizada en comunidades lésbicas, etc.). @es
broader: LGBTQ+ culture
narrower: Butch-femme relationships
narrower: Dykes on bikes
narrower: Lesbian choruses
narrower: Women's music
narrower: Lesbian slang
related: Sexual identity
related: Queer culture
related: Bisexual culture
has top concept: Subcultures
replaces: lesbianCulture
issued: 2019-05-14
modified: 2025-02-23
type: Concept
in scheme: v3
change note: Version 4.1.0

Dyke demonstrations
preferred label: Marcha de las bolleras @es
alternative label: Dyke marches
alternative label: Dyke rallies
alternative label: Dyke protests
alternative label: Marchas dyke @es
alternative label: Marchas de lesbianas @es
comment: Marches, rallies, and other large, public gatherings organized to protest discrimination against dykes and advocate for dyke visibility, rights, and issues. This term should only be used to describe demonstrations explicitly for lesbians who identify as dykes or that are centered on the dyke identity and politics. Otherwise, use the more general term "Lesbian demonstrations."
comment: Marchas, protestas y otros encuentros centrados en la visibilidad, los asuntos y los derechos de las lesbianas. Utilícese únicamente para describir marchas explícitamente a favor de las bolleras o centradas en la identidad y la política de las bolleras. De lo contrario, utilícese el término más general "marchas de lesbianas". @es
broader: Lesbian demonstrations
related: Dyke solidarity
has top concept: LGBTQ+ activism
replaces: dykeMarches
issued: 2019-05-14
modified: 2025-04-23
type: Concept
in scheme: v3
change note: Version 4.1.0

Dykes
preferred label: Bolleras @es
comment: A largely reclaimed slur common in the U.S. that may be used to refer to lesbians who embrace a masculine style of presentation or lesbian political activists in general. Only use for individuals who self-identify as dykes.
comment: Un insulto ampliamente reclamado y común en los EE. UU. que puede utilizarse para referirse a lesbianas que adoptan un estilo de presentación masculino o a activistas políticas lesbianas en general. Utilícese únicamente para personas que se autoidentifiquen como dykes. @es
broader: Reclaimed terms
broader: Slurs
related: Butches
related: Femmes
related: Lesbians
related: Dyke bars
has top concept: LGBTQ+ slang
replaces: dykes
issued: 2019-05-14
modified: 2025-02-23
type: Concept
in scheme: v3
change note: Version 4.1.0

Dykes on bikes
preferred label: Dykes on Bikes @es
comment: A chartered motorcycle club with many loosely affiliated chapters that are comprised of lesbian members who identify as dykes; known for their participation in gay pride events.
comment: Un club de motociclistas autorizado con muchas secciones libremente afiliadas que están compuestas por miembros lesbianas que se autoidentifican como bolleras; conocido por su participación en eventos del orgullo gay. @es
broader: Lesbian culture
related: LGBTQ+ motorcycle clubs
related: Leather and kink clubs
has top concept: Subcultures
replaces: dykesOnBikes
issued: 2019-05-14
modified: 2025-02-23
type: Concept
in scheme: v3
change note: Version 4.1.0

LGBTQ+ Eastern Orthodox Christians
preferred label: Personas cristianas ortodoxas LGBTQ+ @es
alternative label: Eastern Orthodox Christians (LGBTQ)
alternative label: LGBTQ Orthodox Eastern Christians
alternative label: LGBTQ Eastern Orthodox Christians
comment: LGBTQ+ people who are members of the Eastern Orthodox Christian Church.
comment: Personas LGBTQ+ que son miembros de la Iglesia cristiana ortodoxa oriental. @es
broader: LGBTQ+ Christians
has top concept: LGBTQ+ African religions
replaces: LGBTQEasternOrthodoxChristians
issued: 2019-05-14
modified: 2025-02-23
type: Concept
in scheme: v3
change note: Version 4.1.0

Ecofeminism
preferred label: Ecofeminismo @es
comment: Political and philosophical movement that views feminism and concerns for the environment as inherently related.
comment: Movimiento político y filosófico que considera que el feminismo y la preocupación por el medio ambiente están intrínsecamente relacionados. @es
broader: Feminism
related: Eco-feminists
has top concept: Feminism
replaces: ecofeminism
issued: 2019-05-14
modified: 2025-02-23
type: Concept
in scheme: v3
change note: Version 4.1.0

Femininities
preferred label: Feminidades @es
alternative label: Effeminacy
alternative label: Femininity
alternative label: Feminidad @es
comment: Culture-specific sets of attributes, behaviors, and roles generally associated with women or girls.
comment: Conjuntos de atributos, comportamientos y roles específicos de una cultura que se asocian generalmente con las mujeres o las niñas. @es
broader: Gender expression
narrower: Transfemininity
narrower: Feminine of center
related: Androgyny
related: Femmes
related: Gender roles
related: Masculinities
related: Transfeminine people
has top concept: Gender
replaces: femininity
issued: 2019-05-14
modified: 2025-02-23
type: Concept
in scheme: v3
change note: Version 4.1.0

Egg donors
preferred label: Donantes de óvulos @es
comment: Individuals of any gender who donate their own eggs for the purpose of inducing pregnancy.
comment: Personas de cualquier género que donan sus propios óvulos con el fin de inducir el embarazo. @es
broader: Donors
related: Genetic parenthood
related: LGBTQ+ family planning
related: Surrogacy
related: Gestational surrogacy
has top concept: Donors
replaces: eggDonors
issued: 2019-05-14
modified: 2025-02-23
type: Concept
in scheme: v3
change note: Version 4.1.0

Internalized homophobia
preferred label: Homofobia internalizada @es
preferred label: Internalised homophobia
alternative label: Ego-dystonic homophobia
comment: This term is often used to describe internalized oppression held by and about LGBTQ+ people in general. It can also describe the more specific phenomenon in which gay men internalize or adopt homophobic beliefs (i.e., negative perceptions of and intolerance toward gay men and homosexuality) as a result of being raised or socialized within a homophobic environment or culture.
comment: Este término se utiliza a menudo para describir la opresión internalizada sostenida por y sobre las personas LGBTQ+ en general. También puede describir el fenómeno más específico a través del cual los hombres gay internalizan o adoptan creencias homofóbicas (es decir, percepciones negativas e intolerancia hacia los hombres gay y la homosexualidad) como resultado de haber sido criados o socializados dentro de un entorno o una cultura homofóbica. @es
broader: Homophobia
broader: Internalized oppression
narrower: Lateral homophobia
related: Denial of sexual orientation
related: Ego-dystonic sexual orientation
related: Latent homosexuality
related: LGBTQ+ self-repression
has top concept: LGBTQ+ phobia
replaces: internalisedHomophobia
issued: 2019-05-14
modified: 2025-02-23
type: Concept
in scheme: v3
change note: Version 4.1.0

Ego-dystonic sexual orientation
preferred label: Orientación sexual egodistónica @es
alternative label: Ego-dystonic homosexuality
alternative label: Homosexualidad egodistónica @es
comment: Internal conflict caused by having a sexual identity or attraction that is at odds with one’s idealized self-image.
comment: Conflicto interno causado por tener una identidad o atracción sexual que está en desacuerdo con la autoimagen idealizada. @es
broader: Mental disorders
related: Conversion therapy
related: Internalized homophobia
has top concept: Mental disorders
replaces: ego-dystonicSexualOrientation
issued: 2019-05-14
modified: 2025-02-23
type: Concept
in scheme: v3
change note: Version 4.1.0

LGBTQ+ older people
preferred label: Personas LGBTQ+ en su tercera edad @es
alternative label: Elderly (LGBTQ)
alternative label: Senior citizens (LGBTQ)
alternative label: Seniors (LGBTQ)
alternative label: Older people (LGBTQ)
alternative label: Personas envejecientes (LGBTQ) @es
alternative label: Personas de tercera edad LGBTQ+ @es
alternative label: Personas en su tercera edad (LGBTQ) @es
alternative label: Viejos LGBTQ+ @es
alternative label: Gente mayor LGBTQ+ @es
comment: LGBTQ+ people who are advanced in age, typically defined as older than 60 years of age.
comment: Personas LGBTQ+ de edad avanzada, normalmente definidas como mayores de 60 años. @es
broader: LGBTQ+ people
narrower: Older bisexual people
narrower: Older gay men
narrower: Older lesbians
narrower: Older queer people
narrower: Older transgender people
related: LGBTQ+ older people's organizations
related: LGBTQ+ retirement homes
has top concept: LGBTQ+ people
replaces: olderPeopleLGBTQ
issued: 2019-05-14
modified: 2025-02-23
type: Concept
in scheme: v3
change note: Version 4.1.0

Electroshock therapy
preferred label: Terapia de electroshock @es
alternative label: Electric shock therapy
alternative label: Electroconvulsive therapy
alternative label: Terapia de electro shock @es
alternative label: Terapia electroconvulsiva @es
comment: A form of psychiatric treatment for major depression, bipolar depression, and other mental health conditions that usually consists of brief electrical pulses to the brain through electrodes on the head that induce controlled seizures. Electroshock therapy has historically been used as an attempt to "cure" homosexuality and other non-normative sexualities and sexual practices.
comment: Una forma de tratamiento psiquiátrico para la depresión mayor, la depresión bipolar y otras condiciones de salud mental que generalmente consiste de breves pulsos eléctricos al cerebro a través de electrodos en la cabeza que inducen convulsiones controladas. Históricamente, la terapia de electroshock se ha utilizado como un intento para "curar" la homosexualidad y otras sexualidades y prácticas sexuales no normativas. @es
broader: Therapies
related: Detention of LGBTQ+ people under a hospital order
has top concept: Medical care
replaces: electroshockTherapy
issued: 2019-05-14
modified: 2025-02-23
type: Concept
in scheme: v3
change note: Version 4.1.0

Eonism
preferred label: Eonismo @es
comment: Historical term used to describe people assigned male at birth who adopt feminine behaviors.
comment: Término histórico utilizado para describir a las personas asignadas al sexo masculino al nacer y que adoptan comportamientos femeninos. @es
broader: Gender expression
broader: LGBTQ+ historical terms
broader: Medicalization
related: Crossdressing
related: Eonist people
related: Sexual inversion
related: Transgenderism
related: Transsexualism
related: Transvestism
has top concept: Gender
replaces: eonism
issued: 2019-05-14
modified: 2025-02-23
type: Concept
in scheme: v3
change note: Version 4.1.0

Eonist people
preferred label: Personas eonistas @es
alternative label: Eonistas @es
comment: Historical term for people assigned male at birth who adopt feminine behaviors.
comment: Término histórico para personas asignadas al sexo masculino al nacer que adoptan comportamientos femeninos. @es
broader: LGBTQ+ historical terms
related: Crossdressers
related: Eonism
related: Transgender people
has top concept: LGBTQ+ historical terms
replaces: eonistPeople
issued: 2019-05-14
modified: 2025-02-23
type: Concept
in scheme: v3
change note: Version 4.1.0

Erectile dysfunction
preferred label: Disfunción eréctil @es
alternative label: Impotence
alternative label: Impotencia @es
comment: Persistent difficulties in achieving or maintaining erections, typically for sexual activities.
comment: Dificultades persistentes para lograr o mantener erecciones, típicamente para actividades sexuales. @es
broader: Sexual dysfunction
related: Erection pills
related: Erections
related: Vacuum pumps
has top concept: Sexual dysfunction
replaces: erectileDysfunction
issued: 2019-05-14
modified: 2025-02-23
type: Concept
in scheme: v3
change note: Version 4.1.0

Erection pills
preferred label: Pastillas para la erección @es
comment: Medications used to relax muscles in the penis, increasing blood flow to allow for an erection in response to sexual stimuli.
comment: Medicamentos utilizados para relajar los músculos del pene, aumentando el flujo sanguíneo para permitir una erección en respuesta a los estímulos sexuales. @es
broader: Medication
related: Erectile dysfunction
related: Erections
related: Chemsex
has top concept: Medical care
replaces: erectionPills
issued: 2019-05-14
modified: 2025-02-23
type: Concept
in scheme: v3
change note: Version 4.1.0

Erections
preferred label: Erecciones @es
comment: Enlargement of the erectile tissue of the penis or clitoris due to increased blood flow; typically associated with sexual arousal.
comment: Agrandamiento del tejido eréctil del pene o del clítoris debido al aumento del flujo sanguíneo; típicamente asociado con la excitación sexual. @es
related: Erectile dysfunction
related: Erection pills
related: Penis
replaces: erections
issued: 2019-05-14
modified: 2025-02-23
type: Concept
in scheme: v3
change note: Version 4.1.0

Erogenous body parts
preferred label: Partes erógenas del cuerpo @es
comment: Areas of the body that are sensitive to sexual stimulation.
comment: Zonas del cuerpo sensibles a la estimulación sexual. @es
narrower: Breast
narrower: Butt
narrower: Clitoris
narrower: Penis
narrower: Testicle
narrower: Vagina
narrower: Nipple
narrower: Chest
narrower: Armpits
related: Genitals
related: Body part fetishes
replaces: erogenousBodyParts
issued: 2019-05-14
modified: 2025-02-23
type: Concept
in scheme: v3
change note: Version 4.1.0

Erotic massage
preferred label: Masaje erótico @es
comment: Massage intended to enhance sexual arousal.
comment: Masaje destinado a potenciar la excitación sexual. @es
broader: Massage
broader: Sex (Act)
broader: Sexual practices
related: Happy endings
related: Manual sex
related: Erotic massage businesses
has top concept: Massage
replaces: eroticMassage
issued: 2019-05-14
modified: 2025-02-23
type: Concept
in scheme: v3
change note: Version 4.1.0

Erotica
preferred label: Erótica @es
comment: The portrayal of sexuality with high-art aspirations, typically also focusing on feelings and emotions.
comment: La representación de la sexualidad con aspiraciones de alto nivel artístico, que normalmente también se centra en sentimientos y emociones. @es
narrower: LGBTQ+ erotic literature
related: LGBTQ+ arts
related: Pornography
replaces: erotica
issued: 2019-05-14
modified: 2025-02-23
type: Concept
in scheme: v3
change note: Version 4.1.0

Eroticism
preferred label: Erotismo @es
comment: The quality of being erotic, or causing sexual attraction, arousal, or desire.
comment: La cualidad de ser erótico, o causar atracción, excitación o deseo sexual. @es
narrower: BDSM
narrower: Homoeroticism
related: Physical affection
related: Sexual excitement
related: Sexuality
replaces: eroticism
issued: 2019-05-14
modified: 2025-02-23
type: Concept
in scheme: v3
change note: Version 4.1.0

Escort services
preferred label: Servicios de acompañantes @es
comment: Agencies that serve to connect paying clients with escorts offering services by appointment. Escort services may be less stigmatized than other forms of sex work, in part because it tends to be safer for escorts and because some escorts offer a broader range of services, including accompaniment or entertainment without the promise of sexual contact. However, the tendency to frame escorting as separate from or superior to other forms of sex work obscures the labor undertaken by escorts and perpetuates discrimination against the most marginalized and vulnerable sex workers.
comment: Agencias que ponen en contacto a clientes de pago con acompañantes que ofrecen servicios con cita previa. Los servicios de acompañantes pueden estar menos estigmatizados que otras formas de trabajo sexual, en parte porque tienden a ser más seguros para los acompañantes y porque algunos de ellos ofrecen una gama más amplia de servicios, incluido el acompañamiento o el entretenimiento sin la promesa de contacto sexual. Sin embargo, la tendencia a considerar el acompañamiento como algo distinto o superior a otras formas de trabajo sexual oculta el trabajo que realizan los acompañantes y perpetúa la discriminación contra los trabajadores sexuales más marginados y vulnerables. @es
broader: Sex work
related: Escorts
has top concept: Sex industry
replaces: escortServices
issued: 2019-05-14
modified: 2025-02-23
type: Concept
in scheme: v3
change note: Version 4.1.0

Escorts
preferred label: Acompañantes @es
alternative label: Call boys
alternative label: Call girls
alternative label: Acompañante @es
comment: Sex workers whose clients are required to make appointments for their services. Unlike sex workers who solicit clients on the street or in institutions like brothels, escorts typically advertise their services online, whether independently or through agencies. Escorting may be less stigmatized than other forms of sex work, in part because it tends to be safer for escorts and because some escorts offer a broader range of services, including accompaniment or entertainment without the promise of sexual contact. However, the tendency to frame escorting as separate from or superior to other forms of sex work obscures the labor undertaken by escorts and perpetuates discrimination against the most marginalized and vulnerable sex workers.
comment: Trabajadores sexuales cuyos clientes deben tener una cita previa por servicios. A diferencia de los trabajadores sexuales que solicitan clientes en la calle o en instituciones como burdeles, los acompañantes suelen anunciar sus servicios en Internet, ya sea de forma independiente o a través de agencias. El acompañamiento puede estar menos estigmatizado que otras formas de trabajo sexual, en parte porque tiende a ser más seguro para los acompañantes y porque algunos de ellos ofrecen una gama más amplia de servicios, incluido el acompañamiento o el entretenimiento sin la promesa de contacto sexual. Sin embargo, la tendencia a considerar el acompañamiento como algo distinto o superior a otras formas de trabajo sexual oculta el trabajo que realizan los acompañantes y perpetúa la discriminación contra los trabajadores sexuales más marginados y vulnerables. @es
broader: Sex workers
related: Escort services
has top concept: Sex workers
replaces: escorts
issued: 2019-05-14
modified: 2025-02-23
type: Concept
in scheme: v3
change note: Version 4.1.0

Estrogen
preferred label: Estrógeno @es
comment: A category of steroid hormones including estrone, estradiol, estriol, and estetrol. Estrogens are commonly utilized in feminizing hormone therapy regimens. Estrogens are produced mainly in the ovaries, in addition to the adrenal glands and fat cells. Responsible for certain secondary sexual characteristics, including breast growth, thickening of the endometrium, menstrual cycle regulation, and sperm maturation.
comment: Una categoría de hormonas esteroides que incluye la estrona, estradiol, estriol y estetrol. Los estrógenos se utilizan comúnmente en regímenes de terapia hormonal feminizante. Los estrógenos se producen principalmente en los ovarios, además de las glándulas suprarrenales y las células grasas. Son responsables de ciertas características sexuales secundarias, incluido el crecimiento de los senos, el engrosamiento del endometrio, la regulación del ciclo menstrual y la maduración de los espermatozoides. @es
broader: Hormone therapy (Gender)
broader: Hormones
related: MtFs
related: Trans women
has top concept: Medical care
replaces: estrogen
issued: 2019-05-14
modified: 2025-02-23
type: Concept
in scheme: v3
change note: Version 4.1.0

Etiology
preferred label: Etiología @es
comment: Inquiries and speculations regarding the causes of sexual behaviors or diseases.
comment: Investigaciones y especulaciones sobre las causas de las conductas o enfermedades sexuales. @es
broader: Theories
has top concept: Theories
replaces: etiology
issued: 2019-05-14
modified: 2025-02-23
type: Concept
in scheme: v3
change note: Version 4.1.0

Eurogames
preferred label: Gay Games
preferred label: LGBTQ+ sporting events
preferred label: Eventos deportivos LGBTQ+ @es
preferred label: Outgames
comment: The most important gay and lesbian sporting event in Europe, hosted by license of the European Gay and Lesbian Sport Federation (EGLSF)
comment: An international sport and cultural event held by the Federation of Gay Games since 1982 that promotes acceptance of LGBTQ+ people and features LGBTQ+ athletes, artists, and other individuals
comment: Organized games or sports activities for LGBTQ+ people or communities; includes both competitive and recreational events.
comment: Juegos o actividades deportivas organizadas para personas o comunidades LGBTQ+; incluye eventos competitivos y recreativos. @es
comment: A sporting and cultural event open to anyone regardless of sexual identity or qualifying standards that is intended to bring together athletes and artists from around the globe, many from countries where homosexuality remains illegal; separate from the Gay Games
broader: Europride
has top concept: Europride
is replaced by: homoit0000949
replaces: eurogames
replaces: gayGames
replaces: LGBTQSportingEvents
replaces: outgames
issued: 2019-05-14
modified: 2022-08-22
modified: 2022-08-15
modified: 2025-02-23
type: Concept
in scheme: v3
change note: Version 4.1.0
related: LGBTQ+ athletes
alternative label: LGBTQ sporting events
alternative label: Eventos deportivos LGBTQ @es
alternative label: Eventos de deporte LGBTQ @es

Europride
preferred label: LGBTQ+ events
preferred label: Eventos LGBTQ+ @es
preferred label: Sydney Gay and Lesbian Mardi Gras
comment: A pan-European international event dedicated to LGBTQ+ pride that is hosted by a different European city each year
comment: Organized public or social occasions for LGBTQ+ people and communities.
comment: Ocasiones públicas o sociales organizadas para personas y comunidades LGBTQ+. @es
comment: Annual gay pride parade and festival in Sydney, Australia
broader: Gay pride
has top concept: LGBTQ+ pride
is replaced by: homoit0000861
replaces: europride
replaces: LGBTQEvents
replaces: sydneyGayAndLesbianMardiGras
issued: 2019-05-14
modified: 2022-10-04
modified: 2025-02-23
type: Concept
in scheme: v3
change note: Version 4.1.0
alternative label: LGBTQ events
narrower: Drag balls
narrower: Halloween (LGBTQ+ culture)
narrower: Eurogames
narrower: Leather and kink conventions
narrower: Title contests
narrower: Drag shows
narrower: Drag pageants
narrower: Lesbian events
narrower: Gay events
narrower: Bisexual events
narrower: Transgender events
narrower: Queer events
narrower: Non-binary events
narrower: Intersex events
narrower: Asexual events
narrower: Aromantic events
narrower: Demisexual events
narrower: Greyromantic events
narrower: Megasexual events
narrower: Pride events
narrower: LGBTQ+ History Month
narrower: LGBTQ+ street fairs
narrower: LGBTQ+ conferences
related: LGBTQ+ direct action
related: LGBTQ+ meeting places
related: Fandom conventions
related: Furry conventions
related: Slash conventions
related: Two-Spirit events
related: Women's events

Ex-gay movement
preferred label: Movimiento ex-gay @es
comment: People and organizations that encourage people to resist entering or pursuing same-sex relationships, to eliminate homosexual desires, to develop heterosexual desires, and/or to enter into heterosexual relationships.
comment: Personas y organizaciones que alientan a las personas a resistirse a entablar o mantener relaciones con personas del mismo sexo, a eliminar los deseos homosexuales, a desarrollar deseos heterosexuales y/o a entablar relaciones heterosexuales. @es
broader: Social movements
related: Conversion therapy
related: Heterosexism
has top concept: Social movements
replaces: ex-gayMovement
issued: 2019-05-14
modified: 2025-02-23
type: Concept
in scheme: v3
change note: Version 4.1.0

Exhibitionism
preferred label: Exhibicionismo @es
comment: A kink characterized by the sexual desire to display one's body or engage in sexual activities in public.
broader: BDSM
broader: Sexual practices
related: Public sex
related: Voyeurism
related: LGBTQ+ people with sexual addictions
has top concept: Eroticism
replaces: exhibitionism
issued: 2019-05-14
modified: 2025-02-23
type: Concept
in scheme: v3
change note: Version 4.1.0

Fa'afafine
comment: In New Zealand, Samoan people who were assigned male at birth but behave in feminine ways and may consider themselves women.
comment: En Nueva Zelanda, los samoanos a quienes se les asignó al sexo masculino al nacer pero que se comportan de manera femenina y pueden considerarse mujeres. @es
broader: Non-Euro-American gender and sexual identities
broader: MVPFAFF+
related: Fa'afatama
has top concept: Gender
replaces: faafafine
issued: 2019-05-14
modified: 2025-02-23
type: Concept
in scheme: v3
change note: Version 4.1.0

Fa'afatama
comment: In New Zealand, Samoan people who were assigned female at birth but behave in masculine ways and may consider themselves men.
comment: En Nueva Zelanda, los samoanos a quienes se les asignó al sexo femenino al nacer pero que se comportan de manera masculina y pueden considerarse hombres. @es
broader: Non-Euro-American gender and sexual identities
related: Fa'afafine
has top concept: Gender
replaces: faafatama
issued: 2019-05-14
modified: 2025-02-23
type: Concept
in scheme: v3
change note: Version 4.1.0

Faeries (LGBTQ+ culture)
preferred label: Faeries @es
alternative label: Radical Faeries
alternative label: Faes (LGBTQ+ culture)
alternative label: Hadas @es
alternative label: Hadas radicales @es
alternative label: Faes @es
comment: Queer people who are involved with or identify with the countercultural movement seeking to redefine queer consciousness through secular spirituality. Often but not always associated with the Radical Faeries, a loosely affiliated worldwide network that formed in the 1970s.
comment: Personas queer que están involucradas o se autoidentifican con el movimiento contracultural que busca redefinir la conciencia queer a través de la espiritualidad secular. A menudo, pero no siempre, se asocia con Radical Faeries, una red mundial libremente afiliada que se formó en la década de 1970. @es
replaces: faeries
issued: 2019-05-14
modified: 2025-03-20
type: Concept
in scheme: v3
change note: Version 4.1.0

Fag hags
preferred label: Mariliendre (Spain) @es
alternative label: Mariliendra (Spain) @es
alternative label: Mosca de la fruta @es
comment: Slang for heterosexual women who are friends with gay men and socialize in gay spaces.
comment: Jerga para mujeres heterosexuales que son amigas de hombres gay y socializan en espacios gay. @es
broader: Heterosexual women
related: Dutch boys
related: Friendships
related: Goldilocks (Gay culture)
related: Social privilege
related: Beards (Gay culture)
has top concept: Heterosexuals
replaces: fagHags
issued: 2019-05-14
modified: 2025-02-23
type: Concept
in scheme: v3
change note: Version 4.1.0

Fag stags
preferred label: fag stag @es
alternative label: Mosca de la fruta @es
comment: Slang for heterosexual men who enjoy the company of gay men.
comment: Jerga para hombres heterosexuales que disfrutan de la compañía de hombres gay. @es
broader: Heterosexual men
related: Friendships
related: Social privilege
has top concept: Heterosexuals
replaces: fagStags
issued: 2019-05-14
modified: 2025-02-23
type: Concept
in scheme: v3
change note: Version 4.1.0

Faggots
preferred label: Maricones @es
alternative label: Fags
alternative label: Maricas @es
comment: Slur used chiefly in North America to refer to gay men (or, in some cases, LGBTQ+ people in general). Some gay men have reclaimed this term and use it to describe themselves.
comment: Insulto utilizado principalmente en Norteamérica para referirse a hombres gay (o, en algunos casos, a personas LGBTQ+ en general). Algunos hombres gay han recuperado este término y lo utilizan para describirse a sí mismos. @es
broader: LGBTQ+ historical terms
broader: Reclaimed terms
broader: Slurs
related: Gay men
has top concept: LGBTQ+ historical terms
replaces: faggots
issued: 2019-05-14
modified: 2025-02-23
type: Concept
in scheme: v3
change note: Version 4.1.0

Fakaleitī
alternative label: Fakaleiti @ton
comment: Tongan people assigned male at birth who behave in an effeminate manner.
comment: Personas tonganas asignadas al sexo masculino al nacer que se comportan de forma afeminada. @es
broader: Non-Euro-American gender and sexual identities
broader: MVPFAFF+
has top concept: Gender
replaces: fakaleiti
issued: 2019-05-14
modified: 2025-02-23
type: Concept
in scheme: v3
change note: Version 4.1.0

LGBTQ+ families
preferred label: Familias LGBTQ+ @es
alternative label: Families (LGBTQ)
comment: Families, whether biological, adoptive, or chosen, in which one or more individuals identify as LGBTQ+.
comment: Familias, ya sean biológicas, adoptivas o elegidas, en las que una o más personas se autoidentifican como LGBTQ+. @es
narrower: Bisexual families
narrower: Drag families
narrower: Gay families
narrower: Lesbian families
narrower: LGBTQ+ adoptive families
narrower: LGBTQ+ adoptive parents
narrower: LGBTQ+ biological parents
narrower: LGBTQ+ chosen families
narrower: LGBTQ+ foster families
narrower: LGBTQ+ foster parents
narrower: LGBTQ+ parents
narrower: LGBTQ+ partners
narrower: Queer families
narrower: Transgender families
narrower: Aromantic families
narrower: Asexual families
narrower: Intersex families
narrower: LGBTQ+ family generations
related: LGBTQ+ adoption
related: LGBTQ+ adoptive parenthood
related: LGBTQ+ family planning
related: LGBTQ+ foster parenthood
related: LGBTQ+ parenthood
related: LGBTQ+ social parenthood
related: Siblings
related: Bothies
related: LGBTQ+ children of LGBTQ+ parents
related: Polyamorous families
replaces: familiesLGBTQ
issued: 2019-05-14
modified: 2025-03-20
type: Concept
in scheme: v3
change note: Version 4.1.0

Family members
preferred label: Membros de familia @es
alternative label: Familiares @es
alternative label: Miembros de la familia @es
comment: A group of people in kinship through adoption, biology, or choice.
comment: Un grupo de personas en parentesco por adopción, biología o elección. @es
narrower: Children
narrower: Fathers
narrower: Grandchildren
narrower: Grandparents
narrower: Mothers
narrower: Siblings
narrower: Piblings
narrower: Niblings
narrower: Daughters
narrower: Sons
narrower: LGBTQ+ family members
narrower: Family members of LGBTQ+ people
narrower: Parents
replaces: familyMembers
issued: 2019-05-14
modified: 2025-02-23
type: Concept
in scheme: v3
change note: Version 4.1.0

Fat distribution
preferred label: Distribución de grasa @es
comment: Location and arrangement of fat on the body, typically increasing during puberty as a secondary sex characteristic.
comment: Ubicación y disposición de la grasa en el cuerpo, que generalmente aumenta durante la pubertad como característica sexual secundaria. @es
broader: Secondary sex characteristics
has top concept: Sex (Body)
replaces: fatDistribution
issued: 2019-05-14
modified: 2025-02-23
type: Concept
in scheme: v3
change note: Version 4.1.0

Fathers
preferred label: Padres @es
alternative label: Papás @es
comment: People who are fathers.
comment: Personas que son padres. @es
broader: Family members
narrower: LGBTQ+ fathers
narrower: Fathers of LGBTQ+ people
narrower: Two-Spirit fathers
related: LGBTQ+ fatherhood
related: Fatherhood
has top concept: Family members
replaces: fathers
issued: 2019-05-14
modified: 2025-02-23
type: Concept
in scheme: v3
change note: Version 4.1.0

Fathers of bisexual people
preferred label: Padres de personas bisexuales @es
alternative label: Papás de personas bisexuales @es
comment: People who assume the role of father to bisexual people. Only use to describe individuals who identify as fathers.
comment: Personas que asumen el rol de padre de personas bisexuales. Utilícese únicamente para describir a personas que se autoidentifiquen como padres. @es
broader: Fathers of LGBTQ+ people
has top concept: Family members
replaces: fathersOfBisexualPeople
issued: 2019-05-14
modified: 2025-02-23
type: Concept
in scheme: v3
change note: Version 4.1.0

Fathers of gay men
preferred label: Padres de hombres gay @es
alternative label: Papás de hombres gay @es
comment: People who assume the role of father to gay men. Only use to describe individuals who identify as fathers.
comment: Personas que asumen el rol de padre de hombres gay. Utilícese únicamente para describir a personas que se autoidentifiquen como padres. @es
broader: Fathers of LGBTQ+ people
has top concept: Family members
replaces: fathersOfGayMen
issued: 2019-05-14
modified: 2025-02-23
type: Concept
in scheme: v3
change note: Version 4.1.0

Fathers of lesbians
preferred label: Padres de lesbianas @es
alternative label: Papás de lesbianas @es
comment: People who assume the role of father to lesbians. Only use to describe individuals who identify as fathers.
comment: Personas que asumen el rol de padre de lesbianas. Utilícese únicamente para describir a personas que se autoidentifiquen como padres. @es
broader: Fathers of LGBTQ+ people
has top concept: Family members
replaces: fathersOfLesbians
issued: 2019-05-14
modified: 2025-02-23
type: Concept
in scheme: v3
change note: Version 4.1.0

Fathers of queer people
preferred label: Padres de personas queer @es
alternative label: Papás de personas queer @es
comment: People who assume the role of father to queer people. Only use to describe individuals who identify as fathers.
comment: Personas que asumen el rol de padre de personas queer. Utilícese únicamente para describir a personas que se autoidentifiquen como padres. @es
broader: Fathers of LGBTQ+ people
has top concept: Family members
replaces: fathersOfQueerPeople
issued: 2019-05-14
modified: 2025-02-23
type: Concept
in scheme: v3
change note: Version 4.1.0

Fathers of transgender people
preferred label: Padres de personas transgénero @es
alternative label: Papás de personas transgénero @es
comment: People who assume the role of father to transgender people. Only use to describe individuals who identify as fathers.
comment: Personas que asumen el rol de padre de personas transgénero. Utilícese únicamente para describir a personas que se autoidentifiquen como padres. @es
broader: Fathers of LGBTQ+ people
has top concept: Family members
replaces: fathersOfTransgenderPeople
issued: 2019-05-14
modified: 2025-02-23
type: Concept
in scheme: v3
change note: Version 4.1.0

Women's friendships
preferred label: Amistades entre mujeres @es
alternative label: Female friendships
alternative label: Amistades femininas @es
alternative label: Amistades de mujeres @es
comment: Connections based on affection and trust between two or more women.
comment: Conexiones basadas en el afecto y la confianza entre dos o más mujeres. @es
broader: Friendships
broader: Homosociality
has top concept: Relationship satisfaction
replaces: womensFriendships
issued: 2019-05-14
modified: 2025-02-23
type: Concept
in scheme: v3
change note: Version 4.1.0

Female genital mutilation
preferred label: Mutilación genital femenina @es
comment: The practice of cutting or removing the female genitals, sometimes to control sexual drive or punish lesbianism.
comment: Práctica que consiste en cortar o extirpar los genitales femeninos, a veces, para controlar el impulso sexual o castigar el lesbianismo. @es
narrower: Clitoridectomy
related: Sexual sterilization
replaces: femaleGenitalMutilation
issued: 2019-05-14
modified: 2025-02-23
type: Concept
in scheme: v3
change note: Version 4.1.0

Female impersonators
preferred label: Imitadores femeninos @es
alternative label: Imitador femenino @es
comment: Historical term describing performers, often male-identified people, who enact female personas for the purpose of entertainment, often for straight audiences. Eclipsed by other terms (such as drag queen) in the late 20th century.
comment: Término histórico para describir a artistas, a menudo, personas que se identificaban como masculinas, que encarnan personajes femeninos con fines de entretenimiento, a menudo, para audiencias heterosexuales. Fue por otros términos (como "drag queen") a finales del siglo XX. @es
broader: LGBTQ+ theater
related: Drag queens
related: Female impersonation shows
has top concept: LGBTQ+ theater
replaces: femaleImpersonators
issued: 2019-05-14
modified: 2025-02-23
type: Concept
in scheme: v3
change note: Version 4.1.0

Female masculinity
preferred label: Masculinidad femenina @es
comment: Form of masculinity enacted by people with a female or feminine gender identity, often by performing masculine roles, characteristics, and styles of dress.
comment: Forma de masculinidad representada por personas con una identidad de género femenina, a menudo, por medio de la actuación de roles, características y estilos de vestir masculinos. @es
broader: Masculinities
related: Bois
related: Butches
has top concept: Gender
replaces: femaleMasculinity
issued: 2019-05-14
modified: 2025-03-20
type: Concept
in scheme: v3
change note: Version 4.1.0

Women sex workers
preferred label: Trabajadoras sexuales mujeres @es
alternative label: Female prostitutes
alternative label: Female prostitution
alternative label: Women prostitutes
alternative label: Women prostitution
alternative label: Working girls
alternative label: Women sex work
alternative label: Female sex work
alternative label: Female sex workers
alternative label: Prostitutas @es
alternative label: Prostitución femenina @es
alternative label: Trabajo sexual femenino @es
comment: Women who receive money or goods in exchange for sexual services, performances, or companionship. Use to describe women working across the broad spectrum of sex work.
broader: Sex workers
has top concept: Sex workers
replaces: femaleProstitutes
issued: 2019-05-14
modified: 2025-02-23
type: Concept
in scheme: v3
change note: Version 4.1.0

Female prostitution
broader: Prostitution
has top concept: Sex industry
is replaced by: homoit0000433
replaces: femaleProstitution
issued: 2019-05-14
modified: 2025-01-28
type: Concept
in scheme: v3
change note: Version 4.1.0

Females
preferred label: Women
preferred label: Mujeres @es
narrower: Cissexual people
narrower: Trans women
narrower: Amazons
narrower: Bisexual women
narrower: Cisgender women
narrower: Heterosexual women
narrower: Women who have sex with women
narrower: WLW (Women Loving Women)
narrower: Pregnant women
has top concept: Gender
is replaced by: homoit0001509
replaces: females
replaces: women
issued: 2019-05-14
modified: 2022-10-25
modified: 2025-02-23
type: Concept
in scheme: v3
change note: Version 4.1.0
comment: Adults who self-identify as women and understand their gender in terms of Western conceptions of womanness, femaleness, and/or femininity. The term has typically been defined as adult female humans, though not all women identify with the term "female" depending on the context in which it is used.
comment: Personas adultas que se autoidentifican como mujeres y entienden su género en términos de las concepciones occidentales del ser mujer, lo femenino y/o la feminidad. El término normalmente se ha definido como humanas adultas femeninas, aunque no todas las mujeres se autoidentifican con el término "femenino" según el contexto en el que se utiliza. @es
broader: Gender identity
related: Cisgender people
related: Non-Euro-American gender and sexual identities
related: Feminism
related: Lesbians
related: Gender binaries
related: Males
related: Transgender people
related: Wimmin
related: Womyn
related: Women in fandom

FtMs
preferred label: FTMs @es
alternative label: Females transitioning to males
alternative label: FtM transsexuals
alternative label: F2Ms
alternative label: Transsexual men
alternative label: Female-to-male
alternative label: Mujer-a-hombre @es
alternative label: Mujeres transicionando a hombres @es
alternative label: Transexuales FTM @es
alternative label: Hombres transexuales @es
comment: FtM (female-to-male) is a mostly historical term which has been largely replaced by “trans men.” This is due in part to the term's role in the medicalization of transgender people and the assumption that trans men were previously “female” and have become “male” (typically through hormones and/or surgery).
comment: FtM (del inglés "female-to-male", traducido como "de mujer a hombre") es un término mayoritariamente histórico que ha sido reemplazado en gran medida por "hombres trans". Esto se debe, en parte, al rol del término en la medicalización de las personas transgénero y a la suposición de que los hombres trans antes eran “femeninos” y se han convertido en “masculinos” (generalmente, a través de hormonas y/o cirugía). @es
broader: LGBTQ+ historical terms
broader: Transsexual people
broader: Trans men
related: Binding (Chest)
related: Brotherboys
related: FtXs
related: MtFs
related: MtXs
related: Testosterone
has top concept: LGBTQ+ historical terms
replaces: FtMs
issued: 2019-05-14
modified: 2025-02-23
type: Concept
in scheme: v3
change note: Version 4.1.0

Feminism
preferred label: Feminismo @es
comment: Collection of movements aimed at defining, establishing, and defending equal political, economic, and social rights and equal opportunities for women.
comment: Conjunto de movimientos que buscan definir, establecer y defender la igualdad de derechos políticos, económicos y sociales y la igualdad de oportunidades para las mujeres. @es
narrower: Ecofeminism
narrower: First-wave feminism
narrower: Heterosexual feminism
narrower: Lesbian feminism
narrower: Radical feminism
narrower: Second-wave feminism
narrower: Black feminism
narrower: White feminism
narrower: Transfeminism
narrower: Third-wave feminism
narrower: Sex-positive feminism
narrower: Anti-sex work feminism
narrower: Anti-pornography feminism
related: Anti-feminism
related: Women's movement
related: Wimmin
related: Females
related: Womyn
related: Feminist theory
related: Gender equality
related: Trans-exclusionary radical feminists
related: Trans-exclusionary radical feminism
replaces: feminism
issued: 2019-05-14
modified: 2025-03-20
type: Concept
in scheme: v3
change note: Version 4.1.0

Women's movement
preferred label: Movimiento de mujeres @es
alternative label: Feminist movement
alternative label: Movimiento feminista @es
comment: Social and political movement originating in the 1800s for reforms on women’s issues stemming from social, cultural, political, and economic inequality between men and women. Feminist issues include reproductive rights, women’s liberation, and equal pay. This term encompasses the women’s movement in its entirety, including different waves of feminist thought and activism.
comment: Movimiento social y político que se originó en el siglo XIX para reformar asuntos de las mujeres derivados de la desigualdad social, cultural, política y económica entre hombres y mujeres. Los asuntos feministas incluyen los derechos reproductivos, la liberación de la mujer y la igualdad salarial. Este término abarca el movimiento de mujeres en su totalidad, incluidas diferentes olas de pensamiento y activismo feminista. @es
broader: Social movements
related: Feminism
related: Lesbian movement
related: Gender equality
has top concept: Social movements
replaces: womensMovement
issued: 2019-05-14
modified: 2025-02-23
type: Concept
in scheme: v3
change note: Version 4.1.0

Feminists
preferred label: Feministas @es
comment: People who support and advocate for defining, establishing, and defending equal political, economic, and social rights and opportunities for women.
comment: Personas que apoyan y defienden la definición, el establecimiento y la defensa de la igualdad de derechos y oportunidades políticas, económicas y sociales para las mujeres. @es
narrower: Suffragettes
narrower: Lesbian feminists
narrower: Black feminists
narrower: Eco-feminists
narrower: First-wave feminists
narrower: Second-wave feminists
narrower: Third-wave feminists
narrower: Radical feminists
replaces: feminists
issued: 2019-05-14
modified: 2025-02-28
type: Concept
in scheme: v3
change note: Version 4.1.0

Femmes
comment: Feminine people of any gender, though this term is commonly used in lesbian communities.
comment: Personas femeninas de cualquier género, aunque este término se utiliza comúnmente en las comunidades lésbicas. @es
broader: Gender roles
broader: Sexual identity
broader: Sexual roles
related: Butch-femme relationships
related: Butches
related: Dykes
related: Femininities
related: Gender expression
related: Lipstick lesbians
related: Soft butches
related: Stone butches
related: Feminine of center
has top concept: Role behavior
replaces: femmes
issued: 2019-05-14
modified: 2025-02-23
type: Concept
in scheme: v3
change note: Version 4.1.0

Femminiello
comment: In Italy, this is a Neapolitan term for homosexual men with feminine gender expression. Often considered a third gender; associated with good luck.
comment: En Italia, es un término napolitano para referirse a los hombres homosexuales con expresión de género femenina. A menudo, se considera un tercer género, asociado con la buena suerte. @es
broader: Non-Euro-American gender and sexual identities
has top concept: Gender
replaces: femminiello
issued: 2019-05-14
modified: 2025-02-23
type: Concept
in scheme: v3
change note: Version 4.1.0

LGBTQ+ fiction
preferred label: Ficción LGBTQ+ @es
alternative label: Fiction (LGBTQ)
comment: Works of fiction featuring LGBTQ+ characters or themes.
comment: Obras de ficción con personajes o temas LGBTQ+. @es
broader: LGBTQ+ literature
narrower: Bisexual fiction
narrower: Gay fiction
narrower: Lesbian fiction
narrower: LGBTQ+ comics
narrower: LGBTQ+ mystery and detective fiction
narrower: LGBTQ+ erotic literature
narrower: LGBTQ+ fantasy fiction
narrower: LGBTQ+ graphic novels
narrower: LGBTQ+ science fiction
narrower: Queer fiction
narrower: Transgender fiction
narrower: LGBTQ+ horror fiction
narrower: LGBTQ+ romance fiction
narrower: LGBTQ+ short stories
narrower: Intersex fiction
narrower: Aromantic fiction
narrower: Asexual fiction
narrower: Demisexual fiction
narrower: Megasexual fiction
narrower: Greyromantic fiction
narrower: Non-binary fiction
related: LGBTQ+ characters
related: LGBTQ+ authors
related: Two-Spirit fiction
related: Bury your gays
related: Fanfiction
related: LGBTQ+ fanfiction
related: LGBTQ+ headcanons
related: Original slash fiction
related: Māhū fiction
related: Māhū fantasy fiction
related: Māhū science fiction
related: Māhū horror fiction
related: Māhū mystery and detective fiction
related: Māhū romance fiction
related: Two-Spirit fantasy fiction
related: Two-Spirit science fiction
related: Two-Spirit horror fiction
related: Two-Spirit mystery and detective fiction
related: Two-Spirit romance fiction
has top concept: Subcultures
replaces: fictionLGBTQ
issued: 2019-05-14
modified: 2026-02-23
type: Concept
in scheme: v3
change note: Version 4.1.0

First-wave feminism
preferred label: Primera ola del feminismo @es
alternative label: First wave feminism
alternative label: Feminismo de la primera ola @es
comment: Period of women's rights activism in the 19th and early 20th centuries that was primarily focused on legal rights such as women's right to vote.
comment: Período de activismo por los derechos de las mujeres en el siglo XIX y principios del XX que se centró principalmente en derechos legales como el derecho de las mujeres al voto. @es
broader: Feminism
related: First-wave feminists
has top concept: Feminism
replaces: firstWaveFeminism
issued: 2019-05-14
modified: 2025-02-23
type: Concept
in scheme: v3
change note: Version 4.1.0

Fisting
alternative label: Fist fucking
alternative label: Handballing
alternative label: Manual penetration
comment: The insertion of a hand (or fist) into the vagina or anus.
comment: Acto sexual que consiste en introducir toda la mano, apretada o con los dedos estirados, en la vagina o el ano. @es
broader: Sexual practices
narrower: Anal fisting
narrower: Vaginal fisting
related: Fingering
related: Sex swings
has top concept: Sexual practices
replaces: fisting
issued: 2019-05-14
modified: 2025-02-23
type: Concept
in scheme: v3
change note: Version 4.1.0

Fingering
preferred label: Dedear @es
alternative label: Finger banging
alternative label: Finger fucking
alternative label: Dar dedo @es
alternative label: Dedeo @es
alternative label: Penetración digital @es
alternative label: Hacer un dedo @es
alternative label: Hacerse un dedo @es
alternative label: Hacer dedos @es
alternative label: Hacerse dedos @es
comment: Sexual act involving the use of and insertion of the fingers to stimulate the vagina and/or anus.
comment: Acto sexual que consiste en utilizar e introducir los dedos para estimular la vagina y/o el ano. @es
broader: Manual sex
broader: Vaginal sex
related: Fisting
has top concept: Sex (Act)
replaces: fingering
issued: 2019-05-14
modified: 2025-02-23
type: Concept
in scheme: v3
change note: Version 4.1.0

Flagellation
preferred label: Flagelación @es
comment: Consensual flogging of a person.
comment: Impacto o latigazos consensuados a una persona. @es
broader: Whipping
broader: Impact play
related: Whips
has top concept: Eroticism
replaces: flagellation
issued: 2019-05-14
modified: 2025-02-23
type: Concept
in scheme: v3
change note: Version 4.1.0

Floggers
preferred label: Azotadores @es
alternative label: Flagelo @es
comment: Lightweight whips or scourges with multiple lashes that are used on oneself or a partner to increase sexual arousal.
comment: Látigos o flagelos ligeros con múltiples colas que se utilizan sobre una misma persona o sobre una pareja para aumentar la excitación sexual. @es
broader: Sex accessories
has top concept: Sex accessories
replaces: floggers
issued: 2019-05-14
modified: 2025-02-23
type: Concept
in scheme: v3
change note: Version 4.1.0

Forced castration
preferred label: Castración forzada @es
comment: Forced or coerced removal of the testes or use of the testes, typically through surgical or chemical means, enacted by legal authorities or as a hate crime.
comment: Extirpación forzada o bajo coacción de los testículos o la utilización de los mismos, normalmente por medios quirúrgicos o químicos, por las autoridades legales o como crimen de odio. @es
broader: Anti-gay violence
broader: Castration
has top concept: Anti-LGBTQ+ violence
replaces: forcedCastration
issued: 2019-05-14
modified: 2025-02-23
type: Concept
in scheme: v3
change note: Version 4.1.0

Foreskin restoration
preferred label: Restauración prepucial @es
alternative label: Uncircumcision
comment: The process of altering a circumcised penis to reconstruct or restore the foreskin.
comment: El proceso de alterar un pene circuncidado para reconstruir o restaurar el prepucio. @es
related: Circumcision
replaces: foreskinRestoration
issued: 2019-05-14
modified: 2025-02-23
type: Concept
in scheme: v3
change note: Version 4.1.0

Social parenthood
preferred label: Paternidad social @es
alternative label: Foster parenthood
alternative label: Familias de acogida @es
comment: A basis of parenthood understood to be in opposition to biological parenthood, that challenges the assumption that parenthood presupposes blood relation. Social parenthood is the full- or part-time care, nurturing, and protection of a child by an adult who has taken on that duty.
comment: Una base de la paternidad entendida como opuesta a la paternidad biológica, que desafía la suposición de que la paternidad presupone una relación de sangre. La paternidad social es el cuidado, la crianza y la protección a tiempo completo o parcial de un niño por parte de un adulto que ha asumido ese deber. @es
related: Adoptive parenthood
related: Adoptive parents
related: Biological parenthood
related: Foster parents
replaces: socialParenthood
issued: 2019-05-14
modified: 2025-02-23
type: Concept
in scheme: v3
change note: Version 4.1.0

Foster parents
preferred label: Madres y padres de acogida @es
alternative label: Madres de acogida @es
alternative label: Padres de acogida @es
alternative label: Padres de crianza @es
alternative label: Madres de crianza @es
alternative label: Madres y padres de crianza @es
comment: A person or family unit who takes in and cares for a child or children on behalf of the state.
comment: Una persona o unidad familiar que acoge y cuida a un niño o niños en nombre del Estado. @es
broader: Parents
related: Social parenthood
has top concept: Family members
replaces: fosterParents
issued: 2019-05-14
modified: 2025-02-23
type: Concept
in scheme: v3
change note: Version 4.1.0

Freedom rings
preferred label: Anillos de libertad @es
alternative label: Aros de libertad @es
comment: A symbol designed by David Spada that consists of six aluminum rings in colors based on the rainbow flag; typically worn as jewelry.
comment: Un símbolo diseñado por David Spada que consta de seis anillos de aluminio en colores basados ​​en la bandera arcoíris; normalmente utilizado como joyería. @es
broader: LGBTQ+ symbols
has top concept: LGBTQ+ symbols
replaces: freedomRings
issued: 2019-05-14
modified: 2025-02-23
type: Concept
in scheme: v3
change note: Version 4.1.0

Fricatrices
comment: A historical term for lesbians. Only use in a historical context.
comment: Un término histórico para las lesbianas. Utilícese únicamente en un contexto histórico. @es
broader: LGBTQ+ historical terms
related: Lesbians
has top concept: LGBTQ+ historical terms
replaces: fricatrices
issued: 2019-05-14
modified: 2025-02-23
type: Concept
in scheme: v3
change note: Version 4.1.0

Friendships
preferred label: Amistades @es
comment: Connections based on affection and trust between two or more people.
comment: Conexiones basadas en el afecto y la confianza entre dos o más personas. @es
broader: Relationship satisfaction
narrower: Boys' friendships
narrower: Women's friendships
narrower: Girls' friendships
narrower: Men's friendships
narrower: Romantic friendships
related: Dutch boys
related: Fag hags
related: Fag stags
related: Goldilocks (Gay culture)
related: Homosociality
related: Kiki (Social Gathering)
has top concept: Relationship satisfaction
replaces: friendships
issued: 2019-05-14
modified: 2025-02-23
type: Concept
in scheme: v3
change note: Version 4.1.0

Frottage
comment: Non-penetrative sex act in which individuals rub parts of their body (usually the genitals) against another person's body. Not to be confused with "frotteurism" (nonconsensual frottage), though both are often abbreviated as "frot."
comment: Acto sexual sin penetración en el que las personas frotan partes de su cuerpo (generalmente los genitales) contra el cuerpo de otra persona. No debe confundirse con el "frotteurismo" (frottage no consensual), aunque ambos términos suelen abreviarse como "frot". @es
broader: Sex (Act)
broader: Sexual practices
narrower: Scissoring
has top concept: Sex (Act)
replaces: frottage
issued: 2019-05-14
modified: 2025-02-23
type: Concept
in scheme: v3
change note: Version 4.1.0

FtXs
preferred label: FTXs @es
comment: People who transition from female to unknown or not female.
comment: Personas que transicionan de mujer a un género desconocido o a no mujer. @es
broader: Transgender people
related: FtMs
related: MtFs
related: MtXs
related: X-jendā
has top concept: LGBTQ+ people
replaces: ftxs
issued: 2019-05-14
modified: 2025-02-23
type: Concept
in scheme: v3
change note: Version 4.1.0

Fuck buddies
preferred label: Follamigos @es
alternative label: Compañeros de sexo @es
alternative label: Compañeras de sexo @es
comment: Two friends who regularly have sex with one another but are not committed to a romantic relationship.
comment: Dos amigos que tienen relaciones sexuales regularmente pero que no están comprometidos en una relación romántica. @es
related: LGBTQ+ lovers
related: Sexual identity
related: Sexual relationships
replaces: fuckBuddies
issued: 2019-05-14
modified: 2025-02-23
type: Concept
in scheme: v3
change note: Version 4.1.0

Fucking
preferred label: Follar @es
alternative label: Culear @es
alternative label: Garchar @es
alternative label: Echar un polvo @es
alternative label: Tirar @es
alternative label: Acostar @es
alternative label: Chingar @es
alternative label: Joder @es
alternative label: Coger @es
alternative label: Chichar @es
comment: Slang term (typically regarded as vulgar) for the sexual act of penetrating another individual’s mouth, anus, or vagina with a penis or dildo. May also be used to describe sex acts in general (e.g., "They were fucking.").
comment: Término de la jerga (generalmente considerado vulgar) para el acto sexual de penetrar la boca, el ano o la vagina de otra persona con un pene o un consolador. También se puede utilizar para describir actos sexuales en general (por ejemplo, "Estaban follando"). @es
broader: Clitoral sex
broader: Phallic sex
broader: Sex (Act)
broader: Vaginal sex
narrower: Ass fucking
related: Getting laid
related: Sexual intercourse
related: Sex swings
has top concept: Sex (Act)
replaces: fucking
issued: 2019-05-14
modified: 2025-02-23
type: Concept
in scheme: v3
change note: Version 4.1.0

G-spot
preferred label: Punto G @es
comment: Commonly characterized as an erogenous area of the front anterior wall of the vagina that, when stimulated, can lead to sexual arousal, orgasms, and/or ejaculation.
comment: Comúnmente se caracteriza como un área erógena de la pared anterior de la vagina que, cuando se estimula, puede provocar excitación sexual, orgasmos y/o eyaculación. @es
broader: Clitoris
broader: Vagina
has top concept: Erogenous body parts
replaces: g-spot
issued: 2019-05-14
modified: 2025-03-20
type: Concept
in scheme: v3
change note: Version 4.1.0

Galli
comment: A term originating in Ancient Rome that describes eunuch priestesses who were voluntarily castrated as part of an annual celebration.
comment: Término originado en la Antigua Roma que describe a las sacerdotisas eunucos que fueron castradas voluntariamente como parte de una celebración anual. @es
broader: Non-Euro-American gender and sexual identities
has top concept: Gender
replaces: galli
issued: 2019-05-14
modified: 2025-02-23
type: Concept
in scheme: v3
change note: Version 4.1.0

Gay activism
preferred label: Activismo gay @es
comment: Direct action and organizing to achieve political or social change and acceptance for gay men.
comment: Acción directa y organización para lograr el cambio político o social y la aceptación de los hombres gay. @es
broader: LGBTQ+ activism
related: Gay political activists
has top concept: LGBTQ+ activism
replaces: gayActivism
issued: 2019-05-14
modified: 2025-02-23
type: Concept
in scheme: v3
change note: Version 4.1.0

African American gay men
preferred label: Hombres gay afroamericanos @es
alternative label: Gay African American people
alternative label: Gay African Americans
alternative label: Afroamericanos gay|| @es
comment: Gay men of African descent born in the United States or gay men born in African countries who live in or have a strong connection to the United States. Use for individuals who self-identity as African American. Follow the individual’s preference for African American or Black whenever possible.
comment: Hombres gay de ascendencia africana nacidos en los Estados Unidos o hombres gay nacidos en países africanos que viven o tienen una conexión fuerte con los Estados Unidos. Utilícese para personas que se autoidentifiquen como afroamericanas. @es
broader: African American LGBTQ+ people
related: Down-low
has top concept: LGBTQ+ people
replaces: gayAfricanAmericans
issued: 2019-05-14
modified: 2025-02-23
type: Concept
in scheme: v3
change note: Version 4.1.0

Afro-Canadian gay men
preferred label: Hombres gay afrocanadienses @es
alternative label: Gay Afro-Canadian people
alternative label: Gay Afro-Canadians
alternative label: Afrocanadienses gay @es
comment: Gay men of African descent born in Canada or gay men born in African countries who live in or have a strong connection to Canada. Use for individuals who self-identify as Afro-Canadian.
comment: Hombres gay de ascendencia africana nacidos en Canadá u hombres gay nacidos en países africanos que viven o tienen una conexión fuerte con Canadá. Utilícese para personas que se autoidentifiquen como afrocanadienses. @es
broader: Afro-Canadian LGBTQ+ people
has top concept: LGBTQ+ people
replaces: gayAfroCanadians
issued: 2019-05-14
modified: 2025-02-23
type: Concept
in scheme: v3
change note: Version 4.1.0

Afro-Caribbean gay men
preferred label: Hombres gay afrocaribeños @es
alternative label: Gay Afro-Caribbean men
alternative label: Gay Afro-Caribbeans
alternative label: Afrocaribeños gay @es
comment: Gay men of African descent born in the Caribbean or gay men born in African countries who live in or have a strong connection to the Caribbean. Only use for individuals who self-identify as Afro-Caribbean.
comment: Hombres gay de ascendencia africana nacidos en el Caribe u hombres gay nacidos en países africanos que viven o tienen una conexión fuerte con el Caribe. Utilícese únicamente para personas que se a identifiquen como afrocaribeñas. @es
broader: Afro-Caribbean LGBTQ+ people
has top concept: LGBTQ+ people
replaces: gayAfroCaribbeans
issued: 2019-05-14
modified: 2025-02-23
type: Concept
in scheme: v3
change note: Version 4.1.0

Afro-European gay men
preferred label: Hombres gay afroeuropeos @es
alternative label: Gay Afro-European men
alternative label: Gay Afro-Europeans
alternative label: Afroeuropeos gay @es
comment: Gay men of African descent born in European countries or gay men born in African countries who live in or have a strong connection to Europe. Only use for individuals who self-identify as Afro-European.
comment: Hombres gay de ascendencia africana nacidos en países europeos u hombres gay nacidos en países africanos que viven o tienen una conexión fuerte con Europa. Utilícese únicamente para personas que se identifiquen como afroeuropeas. @es
broader: Afro-European LGBTQ+ people
has top concept: LGBTQ+ people
replaces: gayAfroEuropeans
issued: 2019-05-14
modified: 2025-02-23
type: Concept
in scheme: v3
change note: Version 4.1.0

Afro-Latin American gay men
preferred label: Hombres gay afrolatinoamericanos @es
alternative label: Gay Afro-Latin American men
alternative label: Gay Afro-Latin Americans
alternative label: Hombres afrolatinoamericanos gay @es
alternative label: Afrolatinoamericanos gay @es
comment: Gay men of African descent born in Latin American countries or gay men born in African countries who live in or have a strong connection to Latin America. Only use for individuals who self-identify as Afro-Latin American.
comment: Hombres gay afrodescendientes nacidos en países latinoamericanos u hombres gay nacidos en países africanos que viven o tienen una fuerte conexión con América Latina. Utilícese únicamente para personas que se identifiquen como afrolatinoamericanas. @es
broader: Afro-Latin American LGBTQ+ people
has top concept: LGBTQ+ people
replaces: gayAfroLatinAmericans
issued: 2019-05-14
modified: 2025-02-23
type: Concept
in scheme: v3
change note: Version 4.1.0

Gay and lesbian youth
preferred label: Gay youth
preferred label: Juventud gay @es
alternative label: Lesbian and gay youth
alternative label: Gay teenagers
alternative label: Gay adolescents
alternative label: Gay teens
alternative label: Adolescentes gay @es
alternative label: Jóvenes gay @es
comment: Younger gay men and lesbians, typically between the ages of childhood and adulthood or adolescence
comment: Gay people between the ages of childhood and adulthood.
comment: Hombres gay entre las edades de la niñez y la edad adulta. @es
broader: Queer youth
broader: LGBTQ+ youth
narrower: Gay boys
narrower: Lesbian girls
narrower: Pups (Roleplay)
narrower: Twinks (Gay culture)
has top concept: LGBTQ+ people
has top concept: Youth
is replaced by: homoit0000544
replaces: gayAndLesbianYouth
replaces: gayYouth
issued: 2019-05-14
modified: 2022-06-27
modified: 2025-02-23
type: Concept
in scheme: v3
change note: Version 4.1.0
related: Gay characters
related: Gay identity
related: Gay men
related: Gay youth literature

Gay archives
preferred label: Archivos gay @es
comment: Collections of records and materials relating to gay men or gay communities; can include a variety of organizations and institutions from community to government archives.
comment: Colecciones de registros y materiales relacionados con hombres gay o comunidades gay; puede incluir una variedad de organizaciones e instituciones, desde archivos comunitarios hasta gubernamentales. @es
broader: LGBTQ+ archives
has top concept: LGBTQ+ cultural heritage institutions
replaces: gayArchives
issued: 2019-05-14
modified: 2025-02-23
type: Concept
in scheme: v3
change note: Version 4.1.0

Gay artists
preferred label: Artistas gay @es
comment: Gay men who practice any of various creative arts.
comment: Artistas conocidos por ser hombres gay. @es
broader: LGBTQ+ artists
has top concept: LGBTQ+ people
replaces: gayArtists
issued: 2019-05-14
modified: 2025-02-23
type: Concept
in scheme: v3
change note: Version 4.1.0

Asian American gay men
preferred label: Hombres gay asiático-americanos @es
alternative label: Gay Asian American people
alternative label: Gay Asian Americans
alternative label: Asiático-americanos gay @es
comment: Gay men of Asian heritage or descent born in the United States or born in Asian countries who live in or have a strong connection to the United States. Only use for individuals who self-identify as Asian American.
comment: Hombres gay de herencia o ascendencia asiática nacidos en Estados Unidos u hombres gay nacidos en países asiáticos que viven en o tienen una conexión fuerte con Estados Unidos. Utilícese para personas que se autoidentifiquen como asiático-americanos. @es
broader: Asian American LGBTQ+ people
broader: Asian gay men
has top concept: LGBTQ+ people
replaces: gayAsianAmericans
issued: 2019-05-14
modified: 2025-02-23
type: Concept
in scheme: v3
change note: Version 4.1.0

Asian gay men
preferred label: Hombres gay asiáticos @es
alternative label: Gaysians
alternative label: Gay Asians
alternative label: Hombres asiáticos gay @es
alternative label: Asiáticos gay @es
comment: Gay men of Asian heritage or descent, living in Asia or part of the Asian diaspora. Only use for people who self-identify as Asian.
comment: Hombres gay nacidos en países asiáticos o descendientes de ellos. Utilícese únicamente para personas que se autoidentifiquen como asiáticas. @es
broader: Asian LGBTQ+ people
narrower: Asian American gay men
has top concept: LGBTQ+ people
replaces: gayAsians
issued: 2019-05-14
modified: 2025-02-23
type: Concept
in scheme: v3
change note: Version 4.1.0

Gay atheists
preferred label: Ateos gay @es
comment: Gay men who are atheists.
comment: Hombres gay que son ateos. @es
broader: LGBTQ+ atheists
has top concept: LGBTQ+ people
replaces: gayAtheists
issued: 2019-05-14
modified: 2025-02-23
type: Concept
in scheme: v3
change note: Version 4.1.0

Gay bars
preferred label: Bares gay @es
comment: Drinking establishments that primarily cater to gay men.
comment: Establecimientos de bebidas que atienden principalmente a hombres gay. @es
broader: LGBTQ+ bars
narrower: Bear bars
related: Dark rooms
related: Gay community
related: LGBTQ+ pubs
related: Leather bars
has top concept: LGBTQ+ meeting places
replaces: gayBars
issued: 2019-05-14
modified: 2025-02-23
type: Concept
in scheme: v3
change note: Version 4.1.0

Gay saunas
preferred label: Saunas gay @es
alternative label: Gay bathhouses
alternative label: Gay baths
comment: Commercial saunas or bathhouses intended for gay men to meet and engage in sexual activities.
comment: Saunas o baños comerciales destinados a que hombres gay se reúnan y realicen actividades sexuales. @es
broader: Sex industry
broader: LGBTQ+ night life
broader: Sex locations
narrower: Glory holes
related: Public sex
related: Sex clubs
related: Police raids on LGBTQ+ bathhouses
related: Play spaces
has top concept: Sex industry
replaces: gaySaunas
issued: 2019-05-14
modified: 2025-02-23
type: Concept
in scheme: v3
change note: Version 4.1.0

Gay beaches
preferred label: Playas gay @es
comment: Beaches set aside for use by gay men or beaches known to be frequented by gay men.
comment: Playas reservadas para el uso de hombres gay o playas conocidas por ser frecuentadas por hombres gay. @es
broader: LGBTQ+ beaches
has top concept: LGBTQ+ meeting places
replaces: gayBeaches
issued: 2019-05-14
modified: 2025-02-23
type: Concept
in scheme: v3
change note: Version 4.1.0

Black gay men
preferred label: Hombres gay negros @es
alternative label: Gay Black men
alternative label: Hombres negros gay @es
comment: Black men who are gay. Use only for individuals who self-identity as Black. Follow the individual’s preference for African American or Black whenever possible.
comment: Hombres negros que son gay. Utilícese únicamente para personas que seautoidentificancomo negras. Siga la preferencia del individuo para el uso de afroamericanos o negros siempre que sea posible. @es
broader: Black LGBTQ+ people
has top concept: LGBTQ+ people
replaces: gayBlackPeople
issued: 2019-05-14
modified: 2025-02-23
type: Concept
in scheme: v3
change note: Version 4.1.0

Gay bookshops
preferred label: Librerías gay @es
comment: Bookshops that sell materials intended for use by gay men or addressing topics related to gay men.
comment: Librerías que venden materiales destinados a hombres gay o que abordan temas relacionados con hombres gay. @es
broader: LGBTQ+ bookshops
has top concept: LGBTQ+ bookshops
replaces: gayBookshops
issued: 2019-05-14
modified: 2025-02-23
type: Concept
in scheme: v3
change note: Version 4.1.0

Gay boys
preferred label: Niños gay @es
comment: Boys (typically children younger than 18) who are gay.
comment: Niños (normalmente menores de 18 años) que son gay. @es
broader: Boys
broader: Gay and lesbian youth
related: Gay characters
related: Gay identity
related: Gay men
related: Gay children
has top concept: Family members
replaces: gayBoys
issued: 2019-05-14
modified: 2025-02-23
type: Concept
in scheme: v3
change note: Version 4.1.0

Gay Buddhists
preferred label: Budistas gay @es
comment: Gay men who are Buddhist.
comment: Hombres gay que son budistas. @es
broader: LGBTQ+ Buddhists
has top concept: LGBTQ+ African religions
replaces: gayBuddhists
issued: 2019-05-14
modified: 2025-02-23
type: Concept
in scheme: v3
change note: Version 4.1.0

Gay characters
preferred label: Personajes gay @es
comment: Characters in creative works who are gay men.
comment: Personajes de obras creativas que son hombres gay. @es
broader: LGBTQ+ characters
related: Gay boys
related: Gay men
related: Gay and lesbian youth
has top concept: LGBTQ+ characters
replaces: gayCharacters
issued: 2019-05-14
modified: 2025-02-23
type: Concept
in scheme: v3
change note: Version 4.1.0

Gay choruses
preferred label: Coros gay @es
alternative label: Gay choirs
comment: Organized groups of gay men who sing together.
comment: Grupos organizados de hombres gay que cantan juntos. @es
broader: LGBTQ+ choruses
related: Lesbian choruses
has top concept: LGBTQ+ choruses
replaces: gayChoruses
issued: 2019-05-14
modified: 2025-02-23
type: Concept
in scheme: v3
change note: Version 4.1.0

Gay Christians
preferred label: Cristianos gay @es
comment: Gay men who are Christian.
comment: Hombres gay que son cristianos. @es
broader: LGBTQ+ Christians
has top concept: LGBTQ+ African religions
replaces: gayChristians
issued: 2019-05-14
modified: 2025-02-23
type: Concept
in scheme: v3
change note: Version 4.1.0

Gay clergy
preferred label: Clero gay @es
alternative label: Gay pastors
alternative label: Pastores gay @es
comment: Gay men who are ordained for religious duties, particularly in the Christian Church.
comment: Hombres gay ordenados para deberes religiosos, particularmente en la Iglesia cristiana. @es
broader: LGBTQ+ clergy
narrower: Gay priests
related: Bisexual clergy
related: Celibacy
related: Lesbian clergy
related: Queer clergy
related: Transgender clergy
has top concept: LGBTQ+ clergy
replaces: gayClergy
issued: 2019-05-14
modified: 2025-02-23
type: Concept
in scheme: v3
change note: Version 4.1.0

Gay community
preferred label: Comunidad gay @es
comment: Groups of people who share the experience of being gay men.
comment: Grupos de personas que comparten la experiencia de ser hombres gay. @es
broader: LGBTQ+ communities
related: Gay bars
related: Gay community centers
related: Gay men
related: LGBT
related: LGB
related: LGBTI
related: LGBTQ
related: LGBTQ+
related: LGBTQIA
related: 2SLGBTQ+
has top concept: LGBTQ+ communities
replaces: gayCommunity
issued: 2019-05-14
modified: 2025-02-23
type: Concept
in scheme: v3
change note: Version 4.1.0

Gay community centers
preferred label: Centros comunitarios gay @es
preferred label: Gay community centres
comment: Spaces in which people from gay communities meet for social, education, recreational, or organizing activities.
comment: Espacios donde las personas de comunidades gay se reúnen para actividades sociales, educativas, recreativas u organizativas. @es
broader: LGBTQ+ community centers
related: Gay community
related: Gay movement
has top concept: LGBTQ+ centers
replaces: gayCommunityCentres
issued: 2019-05-14
modified: 2025-02-23
type: Concept
in scheme: v3
change note: Version 4.1.0

Gay culture
preferred label: Cultura gay @es
comment: Use to describe cultural experiences shared by members of gay communities or products of gay culture (e.g., art and media created by and for gay men, activism focused on gay issues, slang commonly used in gay communities, etc.).
comment: Utilícese para describir experiencias culturales compartidas por miembros de comunidades gay o productos de la cultura gay (p. ej., arte y medios creados por y para hombres gay, activismo centrado en cuestiones gay, jerga comúnmente utilizada en comunidades gay, etc.). @es
broader: LGBTQ+ culture
narrower: Bears (Gay culture)
narrower: Chubs (Gay culture)
narrower: Cubs (Gay culture)
narrower: Gay slang
narrower: Otters (Gay culture)
narrower: Pups (Roleplay)
narrower: Queens (Gay culture)
narrower: Twinks (Gay culture)
narrower: Wolves (Gay culture)
narrower: Beards (Gay culture)
related: Camp (Gay culture)
related: Sexual identity
related: Gym subculture
related: Queer culture
related: Bisexual culture
related: Fairies (Gay culture)
has top concept: Subcultures
replaces: gayCulture
issued: 2019-05-14
modified: 2025-03-20
type: Concept
in scheme: v3
change note: Version 4.1.0

Gay discos
preferred label: Discotecas gay @es
alternative label: Gay discotheques
alternative label: Gay night clubs
alternative label: Gay nightclubs
alternative label: Discos gay @es
alternative label: Clubs gay @es
comment: Nightlife entertainment venues or clubs where people dance to recorded music; use in reference to discos that primarily cater to gay men.
comment: Lugares o clubes de entretenimiento nocturno donde se baila con música grabada; utilícese en referencia a discotecas que principalmente atienden a hombres gay. @es
broader: LGBTQ+ night life
related: LGBTQ+ bars
has top concept: LGBTQ+ night life
replaces: gayDiscos
issued: 2019-05-14
modified: 2025-02-23
type: Concept
in scheme: v3
change note: Version 4.1.0

Gay drama
preferred label: Drama gay @es
comment: Works of fiction written to be performed; use in reference to dramatic works focusing on gay characters or themes.
comment: Obras de ficción escritas para ser puestas en escena; utilícese en referencia a obras dramáticas que se centran en personajes o temas gay. @es
broader: LGBTQ+ drama
related: Gay authors
has top concept: Subcultures
replaces: gayDrama
issued: 2019-05-14
modified: 2025-02-23
type: Concept
in scheme: v3
change note: Version 4.1.0

Gay information centers
preferred label: Centros de información gay @es
preferred label: Gay information centres
comment: Institutions providing education, support, and information about gay men and gay communities to gay men.
comment: Instituciones que brindan educación, apoyo e información sobre hombres gay y comunidades gay a hombres gay. @es
broader: LGBTQ+ information centers
related: Gay movement
has top concept: LGBTQ+ centers
replaces: gayInformationCentres
issued: 2019-05-14
modified: 2025-02-23
type: Concept
in scheme: v3
change note: Version 4.1.0

Gay families
preferred label: Familias gay @es
comment: Families, whether biological, adoptive, or chosen, in which one or more individuals identify as gay men.
comment: Familias, ya sean biológicas, adoptivas o elegidas, en las que una o más personas se autoidentifican como hombres gay. @es
broader: LGBTQ+ families
related: Children of gay men
related: Gay parents
has top concept: LGBTQ+ families
replaces: gayFamilies
issued: 2019-05-14
modified: 2025-02-23
type: Concept
in scheme: v3
change note: Version 4.1.0

Gay parents
preferred label: Paganos gay @es
alternative label: Gay fathers
comment: Gay men who are parents.
comment: Hombres gay que son miembros de religiones politeístas u otras religiones fuera de la cultura dominante que típicamente incorporan el culto a la naturaleza y/o lo sagrado femenino, como la Wicca, el druidismo, el paganismo, etc. Utilícese para describir a los hombres gay que se autoidentifiquen como paganos. @es
broader: Gay men
broader: LGBTQ+ parents
related: Children of gay men
related: Gay families
has top concept: LGBTQ+ people
replaces: gayParents
issued: 2019-05-14
modified: 2025-02-23
type: Concept
in scheme: v3
change note: Version 4.1.0

Gay fiction
preferred label: Ficción gay @es
comment: Written works describing imagined events or people; use in reference to fictional works focusing on gay characters or themes.
comment: Obras escritas que describen eventos o personas imaginadas; utilícese en referencia a obras de ficción que se centran en personajes o temas gay. @es
broader: LGBTQ+ fiction
related: Gay authors
related: Intersex fiction
related: Aromantic fiction
related: Asexual fiction
related: Gay men in fandom
related: Yaoi
has top concept: Subcultures
replaces: gayFiction
issued: 2019-05-14
modified: 2026-02-23
type: Concept
in scheme: v3
change note: Version 4.1.0

Gay for pay
preferred label: Gay por paga @es
comment: Sex workers who identify as heterosexual but are paid to perform as if they are gay or lesbian.
comment: Actores o actrices, estrellas pornográficas o trabajadores sexuales que se autoidentifican como heterosexuales pero a quienes se les paga por actuar como si fueran gay. @es
broader: Sex work
related: Porn stars
related: Sex workers
has top concept: Sex industry
replaces: gayForPay
issued: 2019-05-14
modified: 2025-02-23
type: Concept
in scheme: v3
change note: Version 4.1.0

Gay identity
preferred label: Identidad gay @es
comment: Term used to describe the sexual identity of men and mascs who are sexually and/or romantically attracted to other men and mascs. Do not use as a broader term for LGBTQ+ people.
comment: Término utilizado para describir la identidad sexual de hombres y personas masc que se sienten atraídos sexual y/o románticamente a otros hombres y personas masc. No debe utilizarse como un término más amplio para las personas LGBTQ+. @es
broader: Sexual identity
related: Gay boys
related: Gay men
related: Gay and lesbian youth
has top concept: Sexual identity
replaces: gayIdentity
issued: 2019-05-14
modified: 2025-02-23
type: Concept
in scheme: v3
change note: Version 4.1.0

Jewish gay men
preferred label: Hombres gay judíos @es
alternative label: Gay Jews
alternative label: Jewish gay people
alternative label: Jewish gays
alternative label: Judíos gay @es
alternative label: Personas judías gay @es
comment: Gay men who are Jewish.
comment: Hombres gay que son judíos. @es
broader: Jewish LGBTQ+ people
has top concept: LGBTQ+ people
replaces: gayJews
issued: 2019-05-14
modified: 2025-02-23
type: Concept
in scheme: v3
change note: Version 4.1.0

Latino/a/x gay men
preferred label: Hombres gay Latinx @es
alternative label: Gay Latine
alternative label: Gay Latinos
alternative label: Gay Latinx
alternative label: Latine gay men
alternative label: Latino gay men
alternative label: Latinx gay men
comment: Latin American men who are gay; only use to describe individuals who self-identify as Latino, Latina, or Latinx. Do not conflate with Chicano/a/x or Hispanic.
comment: Hombres latinoamericanos que son gay; utilícese únicamente para describir a personas que se autoidentifican como latinos, latinas o latinxs. No debe confundirse con chicano/a/x o hispano/a/x. @es
broader: Latino/a/x LGBTQ+ people
has top concept: LGBTQ+ people
replaces: gayLatinos
issued: 2019-05-14
modified: 2025-02-23
type: Concept
in scheme: v3
change note: Version 4.1.0

Lesbian-gay relations
preferred label: Relaciones lésbicas-gay @es
alternative label: Gay-lesbian relations
alternative label: Relaciones gay-lésbicas @es
comment: Connections between individuals and communities of lesbians and gay men, including historic and ongoing solidarity, advocacy, and activism.
comment: Conexiones entre personas y comunidades de lesbianas y hombres gay, incluida la solidaridad, la incidencia política y el activismo histórico y continuo. @es
broader: Gender relations
related: Gay men
related: Lesbians
has top concept: LGBTQ+ social processes
replaces: lesbian-gayRelations
issued: 2019-05-14
modified: 2025-02-23
type: Concept
in scheme: v3
change note: Version 4.1.0

Gay liberation
preferred label: Liberación gay @es
alternative label: Gay liberation movement
alternative label: Movimiento de liberación gay @es
comment: Movement of the late 1960s and early to mid 1970s that urged lesbians and gay men to “come out" and publicly reveal their sexuality to family, friends, and colleagues as a form of activism and as a means of countering shame with pride.
comment: Movimiento de finales de la década de 1960 y principios y mediados de la década de 1970 que instaba a lesbianas y hombres gay a “salir del clóset” y revelar públicamente su sexualidad a familiares, amistades y colegas como una forma de activismo y como un medio para contrarrestar la vergüenza con orgullo. @es
broader: LGBTQ+ social processes
related: Gay movement
related: Lesbian liberation
related: Lesbian movement
related: LGBTQ+ emancipation
related: Stonewall riots
has top concept: LGBTQ+ social processes
replaces: gayLiberation
issued: 2019-05-14
modified: 2026-02-24
type: Concept
in scheme: v3
change note: Version 4.1.0

Gay libraries
preferred label: Bibliotecas gay @es
comment: Libraries that hold materials primarily pertaining to gay men or intended for use by gay men.
comment: Bibliotecas que contienen materiales principalmente relacionados con hombres gay o destinados a ser utilizados por hombres gay. @es
broader: LGBTQ+ libraries
has top concept: LGBTQ+ cultural heritage institutions
replaces: gayLibraries
issued: 2019-05-14
modified: 2025-02-23
type: Concept
in scheme: v3
change note: Version 4.1.0

Gay literature
preferred label: Literatura gay @es
comment: Written literary works about gay men, gay characters, or gay themes.
comment: Obras literarias escritas sobre hombres gay, personajes gay o temas gay. @es
broader: LGBTQ+ literature
related: Gay authors
related: Gay men in literature
has top concept: Subcultures
replaces: gayLiterature
issued: 2019-05-14
modified: 2025-04-23
type: Concept
in scheme: v3
change note: Version 4.1.0

Gay couples
preferred label: Parejas gay @es
comment: Partnerships in which both people are gay men.
comment: Parejas en las que ambas personas son hombres gay. @es
broader: LGBTQ+ couples
has top concept: Relationship satisfaction
replaces: gayMaleCouples
issued: 2019-05-14
modified: 2025-02-23
type: Concept
in scheme: v3
change note: Version 4.1.0

Same-sex marriage
preferred label: Matrimonio entre personas del mismo sexo @es
alternative label: Gay marriage
alternative label: Lesbian marriage
alternative label: Matrimonio gay @es
alternative label: Matrimonio lesbiana @es
comment: Legal union between two people of the same sex who are in a partnership. In the United States, same-sex marriage differs from civil unions in that the former is recognized at the federal level, whereas the latter is only recognized at the state level and may not be recognized by other states.
comment: Unión jurídica entre dos personas del mismo sexo que forman una pareja. En los Estados Unidos, el matrimonio entre personas del mismo sexo se diferencia de las uniones civiles en que el primero se reconoce a nivel federal, mientras que el segundo sólo se reconoce a nivel estatal y puede no ser reconocido por otros estados. @es
broader: Marriage
related: LGBTQ+ conscientious objection
related: Women's marriages
has top concept: Living arrangements
replaces: same-sexMarriage
issued: 2019-05-14
modified: 2025-02-23
type: Concept
in scheme: v3
change note: Version 4.1.0

Gay dominants
preferred label: Personas gay dominantes @es
comment: Gay men who are part of the BDSM scene and assume the dominant role in sexual relationships with a master/slave dynamic.
comment: Hombres gay que forman parte de la escena BDSM y asumen el rol dominante en las relaciones sexuales con una dinámica amo/esclavo. @es
broader: LGBTQ+ dominants
has top concept: Sexual identity
replaces: gayMasters
issued: 2019-05-14
modified: 2025-02-23
type: Concept
in scheme: v3
change note: Version 4.1.0

Gay men
preferred label: Amos gay @es
alternative label: Gays
comment: Men who self-identify as gay and belong to gay communities. Predominately used to describe men who are exclusively or primarily romantically and/or sexually attracted to other men. While "gay" is often used as an identifier by people of all genders, this term specifically refers to gay men.
comment: Hombres gay que forman parte de la escena BDSM y asumen el rol de amos en las relaciones sexuales con una dinámica amo/esclavo. @es
broader: LGBTQ+ people
broader: Males
broader: Sexual minorities
narrower: Baby gays
narrower: Bears (Gay culture)
narrower: Clones (Gay culture)
narrower: Closeted gay men
narrower: Gay parents
narrower: Macho men
narrower: Older gay men
narrower: Otters (Gay culture)
narrower: Pups (Roleplay)
narrower: Queens (Gay culture)
narrower: Twinks (Gay culture)
narrower: Wolves (Gay culture)
narrower: Gay college students
related: Faggots
related: Gay boys
related: Gay characters
related: Gay community
related: Gay identity
related: Lesbian-gay relations
related: Parents of gay men
related: Gay and lesbian youth
related: Homophobia
related: Homosexuality
related: Men who have sex with men
related: Persecution of gay men
related: Queer men
related: Sea queens
related: Gay men in fandom
has top concept: LGBTQ+ people
replaces: gayMen
issued: 2019-05-14
modified: 2025-02-23
type: Concept
in scheme: v3
change note: Version 4.1.0

Gay men in the military
preferred label: Hombres gay en fandom @es
comment: Gay men serving in state and national armed forces.
comment: La participación e inclusión de hombres gay en las comunidades de fans. @es
broader: LGBTQ+ people in the military
has top concept: Legal status
replaces: gayMenInTheMilitary
issued: 2019-05-14
modified: 2025-02-23
type: Concept
in scheme: v3
change note: Version 4.1.0

Gay men of color
preferred label: Hombres gay en el lugar de trabajo @es
preferred label: Gay men of colour
comment: Primarily used in the United States, this term refers to gay men who are not white and who identify as people of color.
comment: La presencia de hombres gay en el lugar de trabajo, incluida la aceptación de los trabajadores gay y los problemas a los que se enfrentan. @es
broader: LGBTQ+ people of color
has top concept: LGBTQ+ people
replaces: gayMenOfColour
issued: 2019-05-14
modified: 2025-02-23
type: Concept
in scheme: v3
change note: Version 4.1.0

Parents of gay men
preferred label: Madres y padres de hombres gay @es
alternative label: Gay men's parents
alternative label: Madres de hombres gay @es
alternative label: Padres de hombres gay @es
comment: People who act as parents to one or more gay man. For parents who are themselves gay, use the term "Gay parents."
comment: Personas que actúan como padres de uno o más hombres gay. Para padres que son gay, utilice el término "madres y padres gay". @es
broader: Parents of LGBTQ+ people
related: Gay men
has top concept: Family members
replaces: parentsOfGayMen
issued: 2019-05-14
modified: 2025-02-23
type: Concept
in scheme: v3
change note: Version 4.1.0

Gay movement
preferred label: Madres gay @es
alternative label: Gay organisations
alternative label: Gay organizations
alternative label: Mamás gay @es
comment: Umbrella term for activism focused on the rights of gay men and issues faced by gay communities.
comment: Hombres gay que son madres. Esto incluye a hombres trans que tuvieron hijos antes de su transición y aún se identifican como madres de esos niños. No se debe utilizar para describir a padres gay a menos que se autoidentifiquen como madres. @es
broader: LGBTQ+ movement
narrower: Gay trade union groups
related: Gay community centers
related: Gay information centers
related: Gay liberation
related: Gay press
related: Gay radio
related: Gay television
related: Gay demonstrations
has top concept: Social movements
replaces: gayMovement
issued: 2019-05-14
modified: 2025-04-17
type: Concept
in scheme: v3
change note: Version 4.1.0

Gay museums
preferred label: Movimiento gay @es
alternative label: Organizaciones gay @es
comment: Institutions dedicated to the storage, exhibition, conservation, and preservation of materials relating to gay men or gay history.
comment: Término general para el activismo centrado en los derechos de los hombres gay y los problemas que enfrentan las comunidades gay. @es
broader: LGBTQ+ museums
has top concept: LGBTQ+ cultural heritage institutions
replaces: gayMuseums
issued: 2019-05-14
modified: 2025-02-23
type: Concept
in scheme: v3
change note: Version 4.1.0

Gay Muslims
preferred label: Musicales gay @es
comment: Gay men who are Muslim.
comment: Musicales creados por directores gay, que representan a hombres gay o a personas consideradas importantes dentro de la cultura gay. @es
broader: LGBTQ+ Muslims
has top concept: LGBTQ+ African religions
replaces: gayMuslims
issued: 2019-05-14
modified: 2025-02-23
type: Concept
in scheme: v3
change note: Version 4.1.0

Native American gay men
preferred label: Hombres gay nativoamericanos @es
alternative label: American Indian gay men
alternative label: Gay American Indians
alternative label: Gay Native Americans
alternative label: Hombres nativoamericanos gay @es
comment: People who are part of the Native peoples of the continental United States and Canada (excluding Inuit people) and self-identity as gay men. Use more specific terms when available.
comment: Hombres gay que son nativoamericanos o parte de los pueblos indígenas de Norteamérica; utilícese únicamente para personas que se autoidentifiquen como nativoamericanas y hombres gay. @es
broader: Native American LGBTQ+ people
has top concept: LGBTQ+ people
replaces: gayNativeAmericans
issued: 2019-05-14
modified: 2025-02-23
type: Concept
in scheme: v3
change note: Version 4.1.0

Gay newsletters
preferred label: Hombres gay neurodivergentes @es
alternative label: Personas neurodivergentes gay @es
comment: Serialized print or digital periodicals created by or for gay men, often with the purpose of sharing news and information related to gay communities and issues.
comment: Hombres gay cuyos cerebros procesan, aprenden y/o se comportan de manera diferente a lo que la sociedad considera típico. Algunas de estas diferencias neurológicas pueden presentarse como problemas de aprendizaje, trastornos médicos y otras condiciones. @es
broader: Gay press
broader: LGBTQ+ newsletters
related: Gay newspapers
has top concept: LGBTQ+ press
replaces: gayNewsletters
issued: 2019-05-14
modified: 2025-02-23
type: Concept
in scheme: v3
change note: Version 4.1.0

Gay newspapers
preferred label: Boletines gay @es
comment: Serialized print or digital publications about gay men or gay issues (and typically produced by gay men or gay organizations) that contain news, articles, columns, correspondence, and advertisements.
comment: Publicaciones periódicas impresas o digitales serializadas creadas por o para hombres gay, a menudo con el propósito de compartir noticias e información relacionadas con comunidades y temas gay. @es
broader: Gay press
broader: LGBTQ+ newspapers
related: Gay newsletters
has top concept: LGBTQ+ press
replaces: gayNewspapers
issued: 2019-05-14
modified: 2025-02-23
type: Concept
in scheme: v3
change note: Version 4.1.0

Gay Pagans
preferred label: Óperas gay @es
comment: Gay men who are members of polytheistic religions or other religions outside of the dominant culture that typically incorporate nature worship and/or the sacred feminine, such as Wicca, Druidry, Heathenry, etc. Use to describe gay men who self-identify as Pagan.
comment: Óperas creadas por directores gay, que representan a hombres gay o a personas consideradas importantes dentro de la cultura gay. @es
broader: LGBTQ+ Pagans
related: Gay witches
has top concept: LGBTQ+ African religions
replaces: gayPagans
issued: 2019-05-14
modified: 2025-02-23
type: Concept
in scheme: v3
change note: Version 4.1.0

Gay poetry
preferred label: Poesía gay @es
comment: Literary work, typically written in verse, that focuses on gay characters, themes, or identity.
comment: Obras literarias, normalmente escritas en verso, que se centran en personajes, temas o identidades gay. @es
broader: LGBTQ+ poetry
related: Gay authors
has top concept: Subcultures
replaces: gayPoetry
issued: 2019-05-14
modified: 2025-02-23
type: Concept
in scheme: v3
change note: Version 4.1.0

Gay political activists
preferred label: Activistas políticos gay @es
comment: Gay men working to bring about political or social change through public organizing.
comment: Hombres gay que trabajan para lograr cambios políticos o sociales a través de la organización pública. @es
broader: LGBTQ+ political activists
related: Gay activism
has top concept: LGBTQ+ people
replaces: gayPoliticalActivists
issued: 2019-05-14
modified: 2025-02-23
type: Concept
in scheme: v3
change note: Version 4.1.0

Gay political groups
preferred label: Grupos políticos gay @es
comment: Organized groups centered on political change and action for gay rights that may or may not be aligned with major political parties.
comment: Grupos organizados centrados en el cambio y la acción política por los derechos de los hombres gay, que pueden o no estar alineados con los principales partidos políticos. @es
broader: LGBTQ+ political groups
has top concept: LGBTQ+ political groups
replaces: gayPoliticalGroups
issued: 2019-05-14
modified: 2025-02-23
type: Concept
in scheme: v3
change note: Version 4.1.0

Gay porn films
preferred label: Películas pornográficas gay @es
comment: Erotic or sexually explicit films featuring gay men.
comment: Películas eróticas o sexualmente explícitas protagonizadas por hombres gay. @es
broader: LGBTQ+ porn films
broader: Gay films
broader: Gay erotic art
related: Gay erotic films
has top concept: Subcultures
replaces: gayPornFilms
issued: 2019-05-14
modified: 2025-02-23
type: Concept
in scheme: v3
change note: Version 4.1.0

Gay press
preferred label: Prensa gay @es
comment: Newspapers, magazines, or other publishing outlets aimed at gay audiences and/or operated by gay men.
comment: Periódicos, revistas u otros medios editoriales dirigidos a audiencias gay y/o operados por hombres gay. @es
broader: LGBTQ+ press
narrower: Gay newsletters
narrower: Gay newspapers
narrower: Gay zines
related: Gay movement
related: LGBTQ+ magazines
has top concept: LGBTQ+ press
replaces: gayPress
issued: 2019-05-14
modified: 2026-02-24
type: Concept
in scheme: v3
change note: Version 4.1.0

Gay pride
preferred label: Orgullo gay @es
comment: The recognition and celebration of gay people and culture, thereby affirming the visibility, dignity, and diversity of gay communities. This term can be used to refer to gay men specifically, but it is often used as an umbrella term for LGBTQ+ pride as a whole, particularly in historical contexts.
comment: La celebración y el reconocimiento de las identidades LGBTQ+, que afirma la visibilidad, dignidad y diversidad de las comunidades LGBTQ+. Si bien "orgullo gay" puede referirse específicamente a hombres gay, se usa más comúnmente como un término abarcador para el orgullo LGBTQ+ en general. @es
broader: LGBTQ+ pride
has top concept: LGBTQ+ pride
replaces: gayPride
issued: 2019-05-14
modified: 2025-02-23
type: Concept
in scheme: v3
change note: Version 4.1.0

Gay Pride Week
preferred label: Semana del orgullo gay @es
alternative label: Pink Saturday
alternative label: Pink Week
alternative label: Pride Week
alternative label: Sábado rosado @es
alternative label: Sábado rosa @es
alternative label: Semana rosa @es
alternative label: Semana rosada @es
comment: A period of public recognition and celebration of LGBTQ+ people and culture, usually organized over the course of a week with local events, parades, marches, and rallies. Gay pride week occurs at different times during the year in different places but is typically held in June in the United States to commemorate the Stonewall uprising.
comment: Eventos que celebran la autoaceptación y la aceptación social, los logros y los derechos LGBTQ+, generalmente organizados en el transcurso de una semana con eventos locales, desfiles, marchas y concentraciones. Ocurre en diferentes momentos del año en diferentes lugares, pero normalmente se lleva a cabo en junio para conmemorar las revueltas de Stonewall. @es
broader: Pride Month
has top concept: LGBTQ+ pride
replaces: gayPrideWeek
issued: 2019-05-14
modified: 2025-02-23
type: Concept
in scheme: v3
change note: Version 4.1.0

Gay priests
preferred label: Sacerdotes gay @es
comment: Gay men who are ordained as priests in different denominations of the Christian Church.
comment: Hombres gay que son ordenados sacerdotes en diferentes denominaciones de la Iglesia cristiana. @es
broader: Gay clergy
has top concept: LGBTQ+ clergy
replaces: gayPriests
issued: 2019-05-14
modified: 2025-02-23
type: Concept
in scheme: v3
change note: Version 4.1.0

Gay sex workers
preferred label: Trabajadores sexuales gay @es
alternative label: Gay prostitutes
alternative label: Gay prostitution
alternative label: Gay sex work
comment: Gay men who receive money or goods in exchange for sexual services, performances, or companionship. Use to describe gay men working across the broad spectrum of sex work.
broader: LGBTQ+ sex workers
has top concept: Sex workers
replaces: gayProstitutes
issued: 2019-05-14
modified: 2025-02-23
type: Concept
in scheme: v3
change note: Version 4.1.0

Gay Protestants
preferred label: Protestantes gay @es
comment: Gay men who are members of the Protestant Church.
comment: Hombres gay que son miembros de la Iglesia protestante. @es
broader: LGBTQ+ Protestants
has top concept: LGBTQ+ African religions
replaces: gayProtestants
issued: 2019-05-14
modified: 2025-02-23
type: Concept
in scheme: v3
change note: Version 4.1.0

Gay publishers
preferred label: Editoriales gay @es
comment: Companies and organizations that publish materials for gay communities or addressing gay issues.
comment: Empresas y organizaciones que publican materiales para comunidades gay o que abordan asuntos gay. @es
broader: LGBTQ+ publishers
has top concept: LGBTQ+ publishers
replaces: gayPublishers
issued: 2019-05-14
modified: 2025-02-23
type: Concept
in scheme: v3
change note: Version 4.1.0

Gay radio
preferred label: Radio gay @es
comment: Auditory content broadcast on the radio (analog or digital) about gay men and gay issues.
comment: Contenido auditivo emitido por radio (analógica o digital) sobre hombres gay y asuntos gay. @es
broader: LGBTQ+ radio
related: Gay movement
has top concept: LGBTQ+ radio
replaces: gayRadio
issued: 2019-05-14
modified: 2026-02-23
type: Concept
in scheme: v3
change note: Version 4.1.0

Gay relationships
preferred label: Relaciones gay @es
comment: Ongoing connections (romantic, sexual, or platonic) between two or more gay men.
comment: Conexiones continuas (románticas, sexuales o platónicas) entre dos o más hombres gay. @es
broader: Relationship satisfaction
related: Bisexual relationships
related: Queer relationships
related: Transgender relationships
has top concept: Relationship satisfaction
replaces: gayRelationships
issued: 2019-05-14
modified: 2025-02-23
type: Concept
in scheme: v3
change note: Version 4.1.0

LGBTQ+-affirming religious groups
preferred label: Grupos religiosos que afirman las identidades LGBTQ+ @es
preferred label: Lesbian religious groups
preferred label: Metropolitan Community Church
alternative label: Gay religious groups
alternative label: LGBTQ+ affirming religious groups
alternative label: LGBTQ+ inclusive religious groups
alternative label: LGBTQ+-inclusive religious groups
alternative label: MCC
comment: Groups of people united by a religion or religious practices that are accepting and supportive of LGBTQ+ people and their identities. Includes large-scale organized groups, such as denominations or sects, as well as small-scale groups, such as specific churches, mosques, temples, or congregations.
comment: Grupos de personas unidas por una religión o prácticas religiosas que aceptan y apoyan a las personas LGBTQ+ y sus identidades. Incluye a grupos organizados a gran escala, como denominaciones o sectas, así como grupos de pequeña escala, como iglesias, mezquitas, templos o congregaciones específicas. @es
comment: Christian church founded in 1968 by Troy Perry as a welcoming spiritual gathering place for LGBT Christians; MCC is now an international denomination
related: LGBTQ+-affirming religious services
related: LGBTQ+ Protestants
has top concept: Social movements
replaces: gayReligiousGroups
replaces: lesbianReligiousGroups
replaces: metropolitanCommunityChurch
issued: 2019-05-14
modified: 2026-02-23
modified: 2022-08-22
modified: 2022-08-15
type: Concept
in scheme: v3
change note: Version 4.1.0
broader: Lesbian movement
is replaced by: homoit0000530

Gay rights
preferred label: Derechos gay @es
comment: Legal, social, or ethical principles of freedom or entitlement held by gay men.
comment: Principios legales, sociales o éticos de libertad o derechos que tienen los hombres gay. @es
broader: LGBTQ+ civil rights
has top concept: Human rights
replaces: gayRights
issued: 2019-05-14
modified: 2025-02-23
type: Concept
in scheme: v3
change note: Version 4.1.0

Gay Roman Catholics
preferred label: Personas católico romanas gay @es
alternative label: Católico Romanos gay @es
comment: Gay men who are members of the Roman Catholic Church.
comment: Hombres gay que son miembros de la Iglesia católica romana. @es
broader: LGBTQ+ Roman Catholics
has top concept: LGBTQ+ African religions
replaces: gayRomanCatholics
issued: 2019-05-14
modified: 2025-02-23
type: Concept
in scheme: v3
change note: Version 4.1.0

Gay sensibility
preferred label: Sensibilidad gay @es
comment: A way of reading and looking at cultural texts (books, movies, television, magazines, etc.) through a gay lens, often including the appropriation of texts otherwise thought of as heterosexual.
comment: Una forma de leer y mirar textos culturales (libros, películas, televisión, revistas, etc.) a través de un lente gay, a menudo incluyendo la apropiación de textos que, de lo contrario, se considerarían heterosexuales. @es
related: Lesbian sensibility
replaces: gaySensibility
issued: 2019-05-14
modified: 2025-02-23
type: Concept
in scheme: v3
change note: Version 4.1.0

Gay shame
preferred label: Vergüenza gay @es
comment: Movement within queer communities that is described as a radical alternative to gay culture being brought into the mainstream; directly posits an alternative view of gay pride events and activities that rejects increasing commercialization, corporate sponsors, and "safer" agendas to avoid offending heterosexual supporters and sponsors.
comment: Movimiento dentro de comunidades queer que se describe como una alternativa radical a la incorporación de la cultura gay a la corriente principal; postula directamente una visión alternativa a los eventos y actividades del orgullo gay que rechaza su creciente comercialización, los patrocinadores corporativos y las agendas "más seguras" que evitan ofender a partidarios y patrocinadores heterosexuales. @es
related: LGBTQ+ activism
related: Stigma
replaces: gayShame
issued: 2019-05-14
modified: 2025-02-23
type: Concept
in scheme: v3
change note: Version 4.1.0

Gay slang
preferred label: Jerga gay @es
alternative label: Gay speak
alternative label: Habla gay @es
alternative label: Modismos gay @es
alternative label: Argot gay @es
comment: Colloquial or informal language related to gay men or used by gay men.
comment: Lenguaje coloquial o informal relacionado con hombres gay o utilizado por hombres gay. @es
broader: Gay culture
broader: LGBTQ+ slang
related: Fairies (Gay culture)
has top concept: Subcultures
replaces: gaySlang
issued: 2019-05-14
modified: 2025-02-23
type: Concept
in scheme: v3
change note: Version 4.1.0

Gay sons
preferred label: Hijos gay @es
comment: Sons who identify as gay men.
comment: Hijos que se autoidentifican como hombres gay. @es
broader: LGBTQ+ sons
has top concept: LGBTQ+ people
replaces: gaySons
issued: 2019-05-14
modified: 2025-02-23
type: Concept
in scheme: v3
change note: Version 4.1.0

Gay sports clubs
preferred label: Clubs de deporte gay @es
comment: Groups of gay men formed for the purpose of playing sports; includes professional and amateur sports clubs.
comment: Grupos de hombres gay formados con el fin de practicar deportes; incluye clubes deportivos profesionales y amateurs. @es
broader: LGBTQ+ sports clubs
related: Gay athletes
has top concept: LGBTQ+ clubs and organizations
replaces: gaySportsClubs
issued: 2019-05-14
modified: 2025-02-23
type: Concept
in scheme: v3
change note: Version 4.1.0

Gay-straight alliances
preferred label: Alianzas Gay-Heterosexual @es
alternative label: GSAs
alternative label: Alianza de Género y Sexualidad @es
alternative label: AGS @es
comment: Alliances to make schools, sports clubs, etc. safe and welcoming to all people regardless of sexual orientation or gender identity.
comment: Alianzas para hacer que las escuelas, clubes deportivos, etc. sean seguros y acogedores para todas las personas sin importar su orientación sexual o identidad de género. @es
broader: LGBTQ+ social processes
related: Allies
related: LGBTQ+ friendliness
related: LGBTQ+ movement
related: LGBTQ+ safe spaces
has top concept: LGBTQ+ social processes
replaces: gay-straightAlliances
issued: 2019-05-14
modified: 2025-02-23
type: Concept
in scheme: v3
change note: Version 4.1.0

Gay studies
preferred label: Estudios gay @es
comment: Academic field of research and study about gay men, gay identity, and gay communities.
comment: Campo académico de investigación y estudio sobre los hombres gay, la identidad gay y las comunidades gay. @es
broader: Gender studies
related: Bisexual studies
related: Lesbian studies
related: Queer studies
related: Transgender studies
has top concept: Gender studies
replaces: gayStudies
issued: 2019-05-14
modified: 2026-02-24
type: Concept
in scheme: v3
change note: Version 4.1.0

Gay survivors of hate crimes
preferred label: Sobrevivientes gay de crímenes de odio @es
comment: Gay men who have experienced and survived hate crimes; follow the individual's preference for "victims" or "survivors" whenever possible.
comment: Hombres gay que han sufrido y sobrevivido a crímenes de odio; siga la preferencia de la persona sobre el uso de "víctimas" o "sobrevivientes" siempre que sea posible. @es
broader: Gay victims of hate crimes
broader: LGBTQ+ survivors of hate crimes
has top concept: LGBTQ+ people
replaces: gaySurvivorsOfHateCrimes
issued: 2019-05-14
modified: 2025-02-23
type: Concept
in scheme: v3
change note: Version 4.1.0

Gay survivors of rape
preferred label: Sobrevivientes gay de violación @es
comment: Gay men who have experienced and survived rape; follow the individual's preference for "victims" or "survivors" whenever possible.
comment: Hombres gay que han sufrido y sobrevivido a una violación; siga la preferencia de la persona sobre el uso de "víctimas" o "sobrevivientes" siempre que sea posible. @es
broader: Gay victims of rape
broader: LGBTQ+ survivors of rape
has top concept: LGBTQ+ people
replaces: gaySurvivorsOfRape
issued: 2019-05-14
modified: 2025-02-23
type: Concept
in scheme: v3
change note: Version 4.1.0

Gay survivors of sexual abuse
preferred label: Sobrevivientes gay de abuso sexual @es
comment: Gay men who have experienced and survived sexual abuse; follow the individual's preference for "victims" or "survivors" whenever possible.
comment: Hombres gay que han sufrido y sobrevivido a abusos sexuales; siga la preferencia de la persona sobre el uso de "víctimas" o "sobrevivientes" siempre que sea posible. @es
broader: Gay victims of sexual abuse
broader: LGBTQ+ survivors of sexual abuse
has top concept: LGBTQ+ people
replaces: gaySurvivorsOfSexualAbuse
issued: 2019-05-14
modified: 2025-02-23
type: Concept
in scheme: v3
change note: Version 4.1.0

Gay survivors of war
preferred label: Sobrevivientes gay de guerra @es
comment: Gay men who have experienced and survived war; follow the individual's preference for "victims" or "survivors" whenever possible.
comment: Hombres gay que han sufrido y sobrevivido a la guerra; siga la preferencia de la persona sobre el uso de "víctimas" o "sobrevivientes" siempre que sea posible. @es
broader: Gay victims of war
broader: LGBTQ+ survivors of war
has top concept: LGBTQ+ people
replaces: gaySurvivorsOfWar
issued: 2019-05-14
modified: 2025-02-23
type: Concept
in scheme: v3
change note: Version 4.1.0

Gay television
preferred label: Televisión gay @es
comment: Television shows featuring gay men or themes.
comment: Programas de televisión que presentan temas u hombres gay. @es
broader: LGBTQ+ television
related: Gay movement
has top concept: LGBTQ+ television
replaces: gayTelevision
issued: 2019-05-14
modified: 2025-02-23
type: Concept
in scheme: v3
change note: Version 4.1.0

Gay theater
preferred label: Teatro gay @es
preferred label: Gay theatre
comment: Works in the performance arts that focus on gay characters, communities, or issues.
comment: Trabajos en las artes escénicas que se centran en personajes, comunidades o temas gay. @es
broader: LGBTQ+ theater
related: Gay theater groups
related: Lesbian theater
related: LGBTQ+ plays
has top concept: LGBTQ+ theater
replaces: gayTheatre
issued: 2019-05-14
modified: 2025-02-23
type: Concept
in scheme: v3
change note: Version 4.1.0

Gay theater groups
preferred label: Grupos de teatro gay @es
preferred label: Gay theatre groups
comment: Groups of theatrical performers comprised of gay men; may focus on performing works written by gay men or about gay issues.
comment: Grupos de artistas teatrales compuestos por hombres gay; pueden centrarse en la interpretación de obras escritas por hombres gay o sobre temas gay. @es
related: Gay theater
related: Lesbian theater groups
related: LGBTQ+ musicals
replaces: gayTheatreGroups
issued: 2019-05-14
modified: 2025-02-23
type: Concept
in scheme: v3
change note: Version 4.1.0

Gay theology
broader: LGBTQ+ theology
has top concept: LGBTQ+ theology
is replaced by: homoit0001218
replaces: gayTheology
issued: 2019-05-14
modified: 2022-08-22
type: Concept
in scheme: v3
change note: Version 4.1.0

Gay trade union groups
preferred label: Grupos sindicales gay @es
comment: Organized groups of gay workers who are united to make decisions relating to the conditions affecting their labor.
comment: Grupos organizados de trabajadores gay que se unen para tomar decisiones relacionadas con las condiciones que afectan su trabajo. @es
broader: Gay movement
related: Lesbian trade union groups
has top concept: Social movements
replaces: gayTradeUnionGroups
issued: 2019-05-14
modified: 2025-02-23
type: Concept
in scheme: v3
change note: Version 4.1.0

Gay victims of sexual abuse
preferred label: Víctimas gay de abuso sexual @es
comment: Gay men who have experienced sexual abuse and may or may not have survived; follow the individual's preference for "victims" or "survivors" whenever possible.
comment: Hombres gay que han sufrido abuso sexual y pueden haber sobrevivido o no; siga la preferencia de la persona sobre el uso de "víctimas" o "sobrevivientes" siempre que sea posible. @es
broader: LGBTQ+ victims of sexual abuse
narrower: Gay survivors of sexual abuse
has top concept: LGBTQ+ people
replaces: gayVictimsOfSexualAbuse
issued: 2019-05-14
modified: 2025-02-23
type: Concept
in scheme: v3
change note: Version 4.1.0

Gay victims of hate crimes
preferred label: Víctimas gay de crímenes de odio @es
comment: Gay men who have experienced hate crimes and may or may not have survived; follow the individual's preference for "victims" or "survivors" whenever possible.
comment: Hombres gay que han sufrido crímenes de odio y pueden haber sobrevivido o no; siga la preferencia de la persona sobre el uso de "víctimas" o "sobrevivientes" siempre que sea posible. @es
broader: LGBTQ+ victims of hate crimes
narrower: Gay survivors of hate crimes
has top concept: LGBTQ+ people
replaces: gayVictimsOfHateCrimes
issued: 2019-05-14
modified: 2025-02-23
type: Concept
in scheme: v3
change note: Version 4.1.0

Gay victims of rape
preferred label: Víctimas gay de violación @es
comment: Gay men who have experienced rape and may or may not have survived; follow the individual's preference for "victims" or "survivors" whenever possible.
comment: Hombres gay que han sufrido una violación y pueden haber sobrevivido o no; siga la preferencia de la persona sobre el uso de "víctimas" o "sobrevivientes" siempre que sea posible. @es
broader: LGBTQ+ victims of rape
narrower: Gay survivors of rape
has top concept: LGBTQ+ people
replaces: gayVictimsOfRape
issued: 2019-05-14
modified: 2025-02-23
type: Concept
in scheme: v3
change note: Version 4.1.0

Gay victims of war
preferred label: Víctimas gay de guerra @es
comment: Gay men who have experienced war and may or may not have survived; follow the individual's preference for "victims" or "survivors" whenever possible.
comment: Hombres gay que han sufrido la guerra y que pueden haber sobrevivido o no; siga la preferencia de la persona sobre el uso de "víctimas" o "sobrevivientes" siempre que sea posible. @es
broader: LGBTQ+ victims of war
narrower: Gay survivors of war
has top concept: LGBTQ+ people
replaces: gayVictimsOfWar
issued: 2019-05-14
modified: 2025-02-23
type: Concept
in scheme: v3
change note: Version 4.1.0

Gay victims' rights
preferred label: Derechos de víctimas gay @es
comment: Gay men's legal rights to be informed, present, and heard within the criminal justice system after having been harmed or injured as the result of of a crime, accident, or other event.
comment: Los derechos legales de los hombres gay a estar informados, estar presentes y a ser escuchados dentro del sistema de justicia penal después de haber sido perjudicados o lesionados como resultado de un delito, accidente u otro evento. @es
broader: LGBTQ+ victims' rights
has top concept: Law
replaces: gayVictimsRights
issued: 2019-05-14
modified: 2025-02-23
type: Concept
in scheme: v3
change note: Version 4.1.0

White gay men
preferred label: Hombres gay blancos @es
alternative label: Caucasian gay men
alternative label: Gay Caucasian men
alternative label: Gay white men
alternative label: Hombres gay caucásicos @es
alternative label: Hombres caucásicos gay @es
alternative label: Hombres blancos gay @es
comment: Gay men who are white.
comment: Hombres gay que son blancos. @es
broader: White LGBTQ+ people
has top concept: White LGBTQ+ people
replaces: gayWhitePeople
issued: 2019-05-14
modified: 2025-02-23
type: Concept
in scheme: v3
change note: Version 4.1.0

Lesbians
preferred label: Lesbianas @es
alternative label: Gay women
alternative label: Lesbian women
alternative label: Lesbian people
alternative label: Mujeres gay @es
alternative label: Personas lesbianas @es
alternative label: Mujeres lesbianas @es
comment: Individuals who self-identify as lesbian and belong to lesbian communities. The term has been predominately used to describe women who are exclusively or primarily romantically and/or sexually attracted to other women. However, not all lesbians are women, and gender non-conforming people who belong to lesbian communities have often identified as lesbian.
comment: Personas que se identifican como lesbianas y pertenecen a comunidades lesbianas. El término se ha utilizado predominantemente para describir a mujeres que se sienten exclusiva o principalmente atraídas romántica y/o sexualmente por otras mujeres. Sin embargo, no todas las lesbianas son mujeres, y las personas disidentes de género que pertenecen a comunidades lésbicas a menudo se han identificado como lesbianas. @es
broader: LGBTQ+ people
broader: Sexual minorities
narrower: Baby dykes
narrower: Closeted lesbians
narrower: Lesbian youth
narrower: Lipstick lesbians
narrower: Older lesbians
narrower: Lesbian college students
narrower: Lesbians with breast cancer
related: Amazons
related: Anti-lesbian violence
related: Bois
related: Butches
related: Dykes
related: Fricatrices
related: Lesbian-gay relations
related: Homosexuality
related: Lesbian characters
related: Lesbian identity
related: Lesbianism
related: Parents of lesbians
related: Lesbophobia
related: Persecution of lesbians
related: Queer women
related: Soft butches
related: Stone butches
related: Tribades
related: Females
related: Women who have sex with women
related: Lesbians in fandom
has top concept: LGBTQ+ people
replaces: lesbians
issued: 2019-05-14
modified: 2025-04-29
type: Concept
in scheme: v3
change note: Version 4.1.0

Gay youth literature
preferred label: Literatura juvenil gay @es
comment: Written literary works for an audience of readers from 12-18 years of age, also known as young adult literature or YA; use in reference to youth literature focusing on gay characters or themes.
comment: Obras literarias escritas para una audiencia de lectores de 12 a 18 años de edad, también conocidas como literatura para adultos jóvenes o YA; utilícese en referencia a la literatura juvenil que se centra en personajes o temas gay. @es
broader: LGBTQ+ youth literature
related: Gay and lesbian youth
related: Boys' Love (Genre)
has top concept: Subcultures
replaces: gayYouthLiterature
issued: 2019-05-14
modified: 2025-02-23
type: Concept
in scheme: v3
change note: Version 4.1.0

LGBTQ+ neighborhoods
preferred label: Barrios LGBTQ+ @es
preferred label: LGBTQ+ neighbourhoods
alternative label: Vecindarios LGBTQ+ @es
alternative label: Vecindarios LGBTQ @es
comment: Districts or portions of towns or cities that are (typically unofficial) social and/or residential centers for LGBTQ+ people and communities.
comment: Distritos o partes de pueblos o ciudades que son (usualmente de forma informal) centros sociales y/o residenciales para personas y comunidades LGBTQ+. @es
related: LGBTQ+ communities
replaces: LGBTQNeighbourhoods
issued: 2019-05-14
modified: 2025-02-23
type: Concept
in scheme: v3
change note: Version 4.1.0

Gaydar
preferred label: Radar gay @es
comment: Term describing a person's intuitive ability to identify others' sexual orientations.
comment: Término que describe la capacidad intuitiva de una persona para identificar las orientaciones sexuales de las demás personas. @es
related: Sexual orientation
replaces: gaydar
issued: 2019-05-14
modified: 2025-02-23
type: Concept
in scheme: v3
change note: Version 4.1.0

Gender
preferred label: Género @es
comment: A socially constructed system that gives meaning to masculinity and femininity and that unevenly distributes power and opportunity according to cultural interpretations of sex. As an element of personal identity, a gender is developed through the interaction of social roles and expectations, one’s response to those expectations, one’s physiology, and one’s internal sense of self. Gender is culturally specific, meaning that different cultures have different understandings of what gender means and how many genders should be recognized.
comment: Un sistema socialmente construido que da significado a la masculinidad y la feminidad y que distribuye de manera desigual el poder y las oportunidades según las interpretaciones culturales del sexo. Como elemento de identidad personal, el género se desarrolla a través de la interacción de roles y expectativas sociales, la respuesta de una persona a esas expectativas, la fisiología y el sentido interno de la propia persona. El género es culturalmente específico, lo que significa que diferentes culturas tienen diferentes interpretaciones de lo que significa el género y cuántos géneros deben reconocerse. @es
narrower: Assigned gender
narrower: Gender expression
narrower: Gender identity
narrower: Neurogender
related: Stealth (Transgender)
related: Gender-affirming surgery
related: Gender binaries
related: Genderism
related: Gender diversity
related: Gender relations
related: Gender segregation
related: Gender studies
related: Gendercide
related: Passing (Gender)
related: Sex (Body)
related: Transgenderism
related: Gender transgression
related: Gender minorities
related: Gender ambiguity
replaces: gender
issued: 2019-05-14
modified: 2025-02-23
type: Concept
in scheme: v3
change note: Version 4.1.0

Gender-affirming surgery
preferred label: Cirugía de afirmación de género @es
alternative label: Gender affirmation surgery
alternative label: Gender confirmation surgery
alternative label: Gender realignment surgery
alternative label: Gender reassignment surgery
alternative label: Sex reassignment surgery
alternative label: SRS
alternative label: Gender confirming surgery
alternative label: Gender-confirming surgery
alternative label: Gender affirming surgery
comment: Any of various surgeries undertaken to affirm an individual's gender. Most often applied to transgender people, but may also refer to certain procedures undergone by cisgender and intersex people.
comment: Cualquiera de las diversas cirugías realizadas para afirmar el género de una persona. Se aplica con mayor frecuencia a personas transgénero, pero también puede referirse a ciertos procedimientos a los que se someten personas cisgénero e intersex. @es
broader: Medical care
broader: Gender-affirming care
narrower: Bottom surgery
narrower: Neovagina
narrower: Facial gender affirming surgery
narrower: Top surgery
narrower: Feminizing vocal surgery
narrower: Masculinizing vocal surgery
narrower: Neophallus
related: Gender
related: Non-operative
related: Post-operative
related: Pre-operative
related: Transgender people
related: Transsexual people
related: Transitioning status
related: Transitioning (Gender)
related: Transgender health care bans
has top concept: Medical care
replaces: genderConfirmingSurgery
issued: 2019-05-14
modified: 2025-02-23
type: Concept
in scheme: v3
change note: Version 4.1.0

Gender bending
preferred label: Transgresión de género @es
comment: The practice of transgressing or "bending" expected gender roles, which often involves adopting or exaggerating stereotypically feminine or masculine traits to expose them as artificial. Gender bending is similar to drag, though drag is often associated with artistic or stage performances, whereas gender bending is typically enacted in everyday life.
comment: La práctica de transgredir o "doblar" los roles de género esperados, lo que a menudo implica adoptar o exagerar rasgos estereotípicamente femeninos o masculinos para exponerlos como artificiales. La transgresión de género es similar al drag, aunque el drag se asocia, a menudo, con representaciones artísticas o escénicas, mientras que la transgresión de género suele representarse en la vida cotidiana. @es
broader: Gender expression
related: Androgyny
related: Gender roles
related: Gender creative
related: Gender transgression
has top concept: Gender
replaces: genderBending
issued: 2019-05-14
modified: 2025-02-23
type: Concept
in scheme: v3
change note: Version 4.1.0

Gender binaries
preferred label: Binarios de género @es
comment: Cultural conceptions of gender as two distinct and opposing categories, typically man and woman or masculine and feminine.
comment: Concepciones culturales del género como dos categorías distintas y opuestas, típicamente hombre y mujer o masculino y femenino. @es
related: Boys
related: Gender
related: Gender identity
related: Gender roles
related: Gender segregation
related: Girls
related: Males
related: Females
related: Gender role stereotypes
replaces: genderBinary
issued: 2019-05-14
modified: 2025-02-23
type: Concept
in scheme: v3
change note: Version 4.1.0

Gender blending
preferred label: Mezcla de género @es
comment: Gender expression that involves blending dress and behaviors associated with different genders. Do not use to describe the identities of genderqueer or non-binary people.
comment: Expresión de género que implica mezclar vestimenta y comportamientos asociados a diferentes géneros. No debe utilizarse para describir las identidades de personas queer o no binarias. @es
broader: Gender expression
has top concept: Gender
replaces: genderBlending
issued: 2019-05-14
modified: 2025-02-23
type: Concept
in scheme: v3
change note: Version 4.1.0

Genderism
preferred label: Generismo @es
alternative label: Gender discrimination
alternative label: Discriminación de género @es
comment: The systematic belief that there are only two genders (men and women) and that individuals must conform to the gender they were assigned at or shortly after birth.
comment: La creencia sistemática de que solo existen dos géneros (hombres y mujeres) y que las personas deben adaptarse al género que les fue asignado al nacer o poco después. @es
broader: LGBTQ+ phobia
narrower: Trans-exclusionary radical feminism
related: Gender
related: Gender identity
related: Sexism
related: Patriarchy
has top concept: LGBTQ+ phobia
replaces: genderism
issued: 2019-05-14
modified: 2025-02-23
type: Concept
in scheme: v3
change note: Version 4.1.0

Gender diversity
preferred label: Diversidad de género @es
comment: An umbrella term encompassing a range of gender identities.
comment: Un término general que abarca una variedad de identidades de género. @es
broader: Diversity
related: Gender
related: Gender expression
related: Gender identity
related: Non-binary people
related: Transgender people
related: Gender minorities
has top concept: Diversity
replaces: genderDiversity
issued: 2019-05-14
modified: 2025-02-23
type: Concept
in scheme: v3
change note: Version 4.1.0

Gender dysphoria
preferred label: Disforia de género @es
comment: A psychological diagnosis (replacing the outdated and offensive "gender identity disorder") used to describe the sense of unease or dissatisfaction an individual feels as a result of incongruence between their gender identity and their assigned gender, gender expression, and/or the way their gender is perceived by others. This term is also used colloquially by individuals to describe the discomfort and distress they experience as a result of this incongruence. Though gender dysphoria is often associated with trans people, people of any identity may experience gender dysphoria when they do not feel "right" in their body or the way their gender is being expressed.
comment: Un diagnóstico psicológico (que reemplaza al término anticuado y ofensivo de "trastorno de identidad de género") utilizado para describir la sensación de malestar o insatisfacción que siente una persona como resultado de la incongruencia entre su identidad de género y su género asignado, su expresión de género y/o la forma en que su género es percibido por otras personas. Este término también se utiliza coloquialmente por personas para describir el malestar y la angustia que experimentan como resultado de esta incongruencia. Aunque la disforia de género a menudo se asocia con las personas trans, las personas de cualquier identidad pueden experimentar disforia de género cuando no se sienten "bien" con su cuerpo o con la forma en que se expresan su género. @es
narrower: Gender dysphoria in children
narrower: Gender dysphoria in youth
related: Gender assigned at birth
related: Gender expression
related: Gender identity
related: Gender identity disorder
related: Medicalization
related: Gender euphoria
related: Transmedicalism
related: Transmedicalists
replaces: genderDysphoria
issued: 2019-05-14
modified: 2025-04-23
type: Concept
in scheme: v3
change note: Version 4.1.0

Gender expression
preferred label: Expresión de género @es
comment: Term used to describe the way individuals express their gender identity through their appearance and behaviors, including gestures, movement, dress, and grooming.
comment: Término utilizado para describir la forma en que las personas expresan su identidad de género a través de su apariencia y comportamientos, incluidos gestos, movimientos, vestimenta y arreglo personal. @es
broader: Gender
narrower: Androgyny
narrower: Binding (Chest)
narrower: Clothing
narrower: Crossdressing
narrower: Drab (LGBTQ+ culture)
narrower: Drag
narrower: Femininities
narrower: Eonism
narrower: Gender bending
narrower: Gender blending
narrower: Gender swapping
narrower: Hair removal
narrower: Masculinities
narrower: Packing (Phallus)
narrower: Transvestism
narrower: Tucking (Phallus)
narrower: Voice therapy (Gender)
narrower: Gender creative
narrower: Packers (Phallus)
narrower: Gender transgression
narrower: Transmasculinity
narrower: Transfemininity
narrower: Stand-to-Pee devices
narrower: Gender ambiguity
related: Bears (Gay culture)
related: Butches
related: Cubs (Gay culture)
related: Dandies
related: Femmes
related: Gender diversity
related: Gender dysphoria
related: Gender identity
related: Gender roles
related: Genderfuck
related: Otters (Gay culture)
related: Pups (Roleplay)
related: Queens (Gay culture)
related: Twinks (Gay culture)
related: Wolves (Gay culture)
related: Gender euphoria
related: Gender role stereotypes
related: Gender dysphoria in children
related: Gender dysphoria in youth
related: LGBTQ+ fashion
related: Dollification
has top concept: Gender
replaces: genderExpression
issued: 2019-05-14
modified: 2025-02-23
type: Concept
in scheme: v3
change note: Version 4.1.0

Genderfluid identity
preferred label: Identidad de género fluido @es
alternative label: Genderfluidity
comment: A gender identity in which an individual's gender varies over time and across circumstances; some genderfluid people may identify as a mixture of more than one gender simultaneously.
comment: Una identidad de género en la que el género de una persona varía con el tiempo y según las circunstancias; algunas personas de género fluido pueden identificarse como una mezcla de más de un género simultáneamente. @es
broader: Gender identity
related: Bigender identity
related: Genderfluid people
has top concept: Gender
replaces: genderfluid
issued: 2019-05-14
modified: 2025-02-23
type: Concept
in scheme: v3
change note: Version 4.1.0

Genderfluid people
preferred label: Personas de género fluido @es
comment: People who identify as different genders at different times, including multiple genders at once or none at all. Only use to describe people who self-identify as genderfluid.
comment: Personas que se identifican con diferentes géneros en diferentes momentos, incluidos varios géneros a la vez o ninguno en absoluto. Utilícese únicamente para describir a personas que se autoidentifiquen como de género fluido. @es
broader: Transgender people
broader: Gender minorities
related: Bigender people
related: Genderfluid identity
related: Gender identity
has top concept: LGBTQ+ people
replaces: genderfluidPeople
issued: 2019-05-14
modified: 2025-02-23
type: Concept
in scheme: v3
change note: Version 4.1.0

Gender identity
preferred label: Identidad de género @es
alternative label: Gender-variant identity
alternative label: Identidad de género variable @es
comment: A person’s experience of having a particular gender, which may or may not correspond with the gender or sex they were assigned at birth. Not to be used to describe solely women’s experiences or women’s studies.
comment: La experiencia de una persona de tener un género particular, que puede o no corresponder al género o sexo asignado al nacer. @es
broader: Gender
narrower: Assigned gender
narrower: Bigender identity
narrower: Non-Euro-American gender and sexual identities
narrower: Genderfluid identity
narrower: Males
narrower: Pangender identity
narrower: Transgender identity
narrower: Trigender identity
narrower: Females
narrower: Xenogender identity
narrower: Gender creative
narrower: Transgenderqueer identity
narrower: Non-binary identity
narrower: Genderqueer identity
narrower: Gender non-conforming identity
narrower: Demigender identity
narrower: Cisgender identity
narrower: Agender identity
related: Agender people
related: Cisgender people
related: Demigender people
related: Gender binaries
related: Genderism
related: Gender diversity
related: Gender dysphoria
related: Gender expression
related: Genderfluid people
related: Gender roles
related: Gendercide
related: Misgendering
related: Non-binary people
related: Sexual identity
related: Transgender people
related: Transgenderism
related: Transitioning (Gender)
related: Trans
related: Xenogender people
related: Gender minorities
related: Gender euphoria
related: Gender dysphoria in children
related: Gender dysphoria in youth
has top concept: Gender
replaces: genderIdentity
issued: 2019-05-14
modified: 2025-02-23
type: Concept
in scheme: v3
change note: Version 4.1.0

Gender identity disorder
preferred label: Trastorno de identidad de género @es
comment: An obsolete psychological diagnosis that medicalizes trans identities and practices; only use in historical contexts.
comment: Un diagnóstico psicológico obsoleto que medicaliza las identidades y prácticas trans; utilícese únicamente en contextos históricos. @es
broader: Medicalization
related: Gender dysphoria
related: Transgender people
related: Transsexual people
has top concept: Medical care
replaces: genderIdentityDisorder
issued: 2019-05-14
modified: 2025-02-23
type: Concept
in scheme: v3
change note: Version 4.1.0

Gender markers
preferred label: Indicadores de género @es
comment: Markers used to designate an individual's gender on official documentation, including passports, birth certificates, driver’s licenses, etc. Different jurisdictions vary significantly in the number and types of gender markers they allow on official documentation.
comment: Marcadores utilizados para designar el género de una persona en la documentación oficial, incluidos pasaportes, certificados de nacimiento, licencias de conducir, etc. Diferentes jurisdicciones varían significativamente en la cantidad y los tipos de marcadores de género que permiten en la documentación oficial. @es
broader: Birth certificates
broader: Driver's licenses
broader: Passports
narrower: X gender markers
related: Gender assigned at birth
related: Court orders
related: Medical practitioners' statements
related: Social security cards
related: Transgender people
related: Transitioning (Gender)
related: Gender marker change bans
has top concept: Legal status
replaces: genderMarkers
issued: 2019-05-14
modified: 2025-02-23
type: Concept
in scheme: v3
change note: Version 4.1.0

Gender non-conforming people
preferred label: Personas de género no conformistas @es
alternative label: Personas de género no conforme @es
comment: People who identify outside, transgress, or do not conform to a given culture's gender roles or expectations. Only use in reference to people who self-identity as gender non-conforming. Do not use to describe cisgender people whose dress or behaviors do not conform to gender roles or expectations.
comment: Personas que se autoidentifican fuera de, transgreden o no se conforman con los roles o expectativas de género de una determinada cultura. Utilícese únicamente en referencia a personas que se autoidentifiquen como no conformes con su género. No se debe utilizar para describir a personas cisgénero cuya vestimenta o comportamiento no se conforma a los roles o expectativas de género. @es
broader: Gender minorities
related: Transgender people
related: Gender creative
related: Gender non-conforming identity
has top concept: Gender minorities
replaces: genderNonConformingPeople
issued: 2019-05-14
modified: 2025-02-23
type: Concept
in scheme: v3
change note: Version 4.1.0

Gender relations
preferred label: Relaciones de género @es
comment: The culturally specific rights, responsibilities, and connections afforded to individuals or communities of one gender by individuals or communities of another gender.
comment: Los derechos, responsabilidades y las conexiones culturalmente específicas otorgados a personas o comunidades de un género por personas o comunidades de otro género. @es
broader: LGBTQ+ social processes
narrower: Lesbian-gay relations
related: Gender
related: Gender roles
related: Gender segregation
related: Lesbian separatism
related: Gender role stereotypes
has top concept: LGBTQ+ social processes
replaces: genderRelations
issued: 2019-05-14
modified: 2025-02-23
type: Concept
in scheme: v3
change note: Version 4.1.0

Gender swapping
preferred label: Intercambio de género @es
alternative label: Gender roleplay
alternative label: Juego de roles de género @es
comment: A media trope (commonly used in fanfiction and fanart) in which one or more characters switch binary sexes (e.g., a cisgender man transforms into a cisgender woman), often temporarily.
comment: Un tropo mediático (comúnmente utilizado en fanfiction y fanart) en el que uno o más personajes cambian de sexo binario (por ejemplo, un hombre cisgénero se transforma en una mujer cisgénero), a menudo de forma temporal. @es
broader: Gender expression
broader: Roleplay
related: Gender roles
related: Fanfiction tropes and genres
related: Femslash
related: Gender in fandom
related: Mpreg
related: Transfic
has top concept: Gender
replaces: genderSwapping
issued: 2019-05-14
modified: 2025-02-23
type: Concept
in scheme: v3
change note: Version 4.1.0

Gender roles
preferred label: Roles de género @es
alternative label: Papeles de género @es
comment: Socially-determined rules or standards for gendered behaviors. Some LGBTQ+ people identify with gender roles that exist outside of the gender binary (e.g., butches, femmes, twinks, bears). Use the term "Gender role stereotypes" to describe widely held but oversimplified or offensive ideas regarding gender roles.
comment: Reglas o estándares socialmente determinados para los comportamientos de género. Algunas personas LGBTQ+ se identifican con roles de género que existen fuera del binario de género (por ejemplo, marimachas, femmes, twinks, osos). Utilícese el término "Estereotipos de roles de género" para describir ideas generalizadas pero demasiado simplificadas u ofensivas sobre los roles de género. @es
broader: Role behavior
narrower: Bears (Gay culture)
narrower: Butches
narrower: Cubs (Gay culture)
narrower: Dandies
narrower: Femmes
narrower: Machismo
narrower: Otters (Gay culture)
narrower: Sissies
narrower: Tomboys
narrower: Twinks (Gay culture)
narrower: Wolves (Gay culture)
narrower: Gender role stereotypes
narrower: Ky-ky (Gender role)
related: Androgyny
related: Femininities
related: Gender bending
related: Gender binaries
related: Gender expression
related: Gender identity
related: Gender relations
related: Gender swapping
related: Masculinities
related: Gender creative
related: Gender transgression
related: Gender minorities
related: Gender ambiguity
has top concept: Role behavior
replaces: genderRoles
issued: 2019-05-14
modified: 2025-03-20
type: Concept
in scheme: v3
change note: Version 4.1.0

Gender segregation
preferred label: Segregación por género @es
comment: Physical, legal, cultural, or rhetorical separation of people according to their gender.
comment: Separación física, jurídica, cultural o retórica de las personas según su género. @es
related: Gender
related: Gender binaries
related: Gender relations
replaces: genderSegregation
issued: 2019-05-14
modified: 2025-02-23
type: Concept
in scheme: v3
change note: Version 4.1.0

Gender studies
preferred label: Estudios de género @es
comment: Interdisciplinary academic field devoted to the study and analysis of gender in a given culture, as well as representations of gender in media and popular culture.
comment: Campo académico interdisciplinario dedicado al estudio y el análisis del género en una cultura determinada, así como de las representaciones de género en los medios y la cultura popular. @es
narrower: Bisexual studies
narrower: Gay studies
narrower: Lesbian studies
narrower: Transgender studies
narrower: Feminist film criticism
related: Gender
related: Queer (Verb)
related: Queer studies
related: Queer theory
related: Sexuality
related: Feminist theory
related: Two-Spirit studies
related: Intersex studies
replaces: genderStudies
issued: 2019-05-14
modified: 2026-02-24
type: Concept
in scheme: v3
change note: Version 4.1.0

Gendercide
preferred label: Generocidio @es
comment: The systematic killing of members of a specific gender for their gender.
comment: El asesinato sistemático de miembros de un género específico debido a su género. @es
related: Gender
related: Gender identity
related: LGBTQ+ persecutions
replaces: gendercide
issued: 2019-05-14
modified: 2025-02-23
type: Concept
in scheme: v3
change note: Version 4.1.0

Genderfuck
comment: A form of gender expression that seeks to subvert the gender binary or gender roles by mixing and messing with (or "fucking with") traditionally masculine and feminine components. Typically used to describe gender practices and presentation, though some people identify as "genderfuck" or as "genderfuckers." Only use to describe people and the practices of people who self-identify with genderfuck.
comment: Una forma de expresión de género que busca subvertir el binario de género o los roles de género mezclando y jugando (o "jodiendo") con componentes tradicionalmente masculinos y femeninos. Normalmente se utiliza para describir prácticas y presentaciones de género, aunque algunas personas se identifican como "genderfuck" o "genderfuckers". Utilícese únicamente para describir a las personas y las prácticas de las personas que se autoidentifiquen con genderfuck. @es
related: Gender expression
related: Gender transgression
related: Gender minorities
replaces: genderfuck
issued: 2019-05-14
modified: 2025-02-23
type: Concept
in scheme: v3
change note: Version 4.1.0

Genderqueer people
preferred label: Personas genderqueer @es
comment: Individuals who self-identify as genderqueer, an umbrella term for queer or non-normative gender identities and gender expressions.
comment: Personas que se autoidentifican como genderqueer, un término general para identidades y expresiones de género queer o no normativas. @es
broader: Queer people
broader: Gender minorities
narrower: Transgenderqueer people
related: Transgender people
related: Genderqueer identity
has top concept: LGBTQ+ people
replaces: genderqueerPeople
issued: 2019-05-14
modified: 2025-02-23
type: Concept
in scheme: v3
change note: Version 4.1.0

Genetic parenthood
preferred label: Maternidad y paternidad genética @es
alternative label: Paternidad genética @es
alternative label: Maternidad genetica @es
comment: The experience of parenthood as felt by parents who passed on genetic material to their child or children.
comment: La experiencia de la maternidad y paternidad tal como la sienten los padres que transmitieron material genético a su hijo o hijos. @es
broader: Biological parenthood
broader: LGBTQ+ biological parents
related: Donors
related: Egg donors
related: Gestational parenthood
related: LGBTQ+ parenthood
related: Donor siblings
related: Half-siblings
has top concept: LGBTQ+ families
replaces: geneticParenthood
issued: 2019-05-14
modified: 2025-02-23
type: Concept
in scheme: v3
change note: Version 4.1.0

Bottom surgery
preferred label: Reconstrucción genital @es
alternative label: Genital reconstruction surgery
alternative label: Cirugía de reconstrucción genital @es
comment: Colloquial term for gender-affirming surgical alterations of the genitalia and/or reproductive organs.
comment: Término coloquial para las alteraciones quirúrgicas de los genitales y/o los órganos reproductivos que afirman el género. @es
broader: Gender-affirming surgery
narrower: Hysterectomy
narrower: Orchiectomy
narrower: Penectomy
narrower: Clitoroplasty
narrower: Labiaplasty
narrower: Metoidioplasty
narrower: Scrotoplasty
narrower: Vaginectomy
narrower: Phalloplasty
narrower: Vaginoplasty
narrower: Gonadectomy
related: Transitioning (Gender)
related: Top surgery
related: Intersex surgery
has top concept: Medical care
replaces: genitalReconstructionSurgery
issued: 2019-05-14
modified: 2025-02-23
type: Concept
in scheme: v3
change note: Version 4.1.0

Genitals
preferred label: Genitales @es
alternative label: Genitalia
comment: General term for erogenous and/or reproductive organs (e.g., vagina, clitoris, penis).
comment: Término general para órganos erógenos y/o reproductivos (p. ej., vagina, clítoris, pene). @es
broader: Sex (Body)
narrower: Clitoris
narrower: Penis
narrower: Testicle
narrower: Vagina
narrower: Vulva
related: Erogenous body parts
related: Sex assigned at birth
related: Genital torture
has top concept: Sex (Body)
replaces: genitals
issued: 2019-05-14
modified: 2025-02-23
type: Concept
in scheme: v3
change note: Version 4.1.0

Gestational parenthood
preferred label: Maternidad y paternidad gestacional @es
alternative label: Maternidad gestacional @es
alternative label: Paternidad gestacional @es
comment: The experience of parenthood as felt by a person whose uterus was utilized to nurture and develop an embryo into a baby.
comment: La experiencia de la paternidad y/o maternidad tal como la siente una persona cuyo útero fue utilizado para nutrir y desarrollar un embrión hasta convertirlo en un bebé. @es
broader: Biological parenthood
broader: LGBTQ+ biological parents
narrower: Birth parents
narrower: Surrogacy
related: Genetic parenthood
related: Gestational surrogacy
related: Surro babies
has top concept: LGBTQ+ families
replaces: gestationalParenthood
issued: 2019-05-14
modified: 2025-02-23
type: Concept
in scheme: v3
change note: Version 4.1.0

Getting laid
preferred label: Acostarse (con alguien) @es
alternative label: Echar un polvo @es
alternative label: follar @es
alternative label: chingar @es
alternative label: chichar @es
alternative label: coger @es
alternative label: singar @es
alternative label: cachar @es
comment: Slang term for the act of having sex, typically with another person.
comment: Término de la jerga para referirse al acto de tener relaciones sexuales, normalmente con otra persona. @es
broader: Sex (Act)
broader: Sexual practices
related: Fucking
related: Sexual intercourse
has top concept: Sex (Act)
replaces: gettingLaid
issued: 2019-05-14
modified: 2025-02-23
type: Concept
in scheme: v3
change note: Version 4.1.0

Getting off
preferred label: Venirse @es
alternative label: Pajearse @es
alternative label: Correrse|| @es
comment: Slang term for the act of experiencing erotic or sexual pleasure, typically referring to an orgasm.
comment: Término de la jerga para el acto de experimentar placer erótico o sexual, que generalmente se refiere a un orgasmo. @es
related: Cum
related: Happy endings
related: Jizz
related: Masturbation
related: Sexual excitement
related: Sexual climax
replaces: gettingOff
issued: 2019-05-14
modified: 2025-03-20
type: Concept
in scheme: v3
change note: Version 4.1.0

Girls
preferred label: Niñas @es
comment: Children or youth, typically younger than 18 years old, who identify as girls.
comment: Infancias o jóvenes, generalmente menores de 18 años, que se autoidentifican como niñas. @es
broader: Children
narrower: Bisexual girls
narrower: Heterosexual girls
narrower: Lesbian girls
narrower: Tomboys
narrower: Cisgender girls
related: Gender binaries
related: Girls' friendships
has top concept: Family members
replaces: girls
issued: 2019-05-14
modified: 2025-02-23
type: Concept
in scheme: v3
change note: Version 4.1.0

Girls' friendships
preferred label: Amistades entre niñas @es
comment: Connections based on affection and trust between two or more girls.
comment: Conexiones basadas en el afecto y la confianza entre dos o más niñas. @es
broader: Friendships
broader: Homosociality
related: Girls
has top concept: Relationship satisfaction
replaces: girlsFriendships
issued: 2019-05-14
modified: 2025-02-23
type: Concept
in scheme: v3
change note: Version 4.1.0

Given names
preferred label: Nombre de pila @es
alternative label: Birth names
alternative label: First names
alternative label: Nombre de nacimiento @es
alternative label: Primer nombre @es
comment: Personal names ascribed to individuals at birth, typically by their parents. Sometimes referred to as "birth names" or, in cultures where the given name precedes the family name, "first names."
comment: Nombres personales adscritos a las personas al nacer, normalmente por sus padres. A veces se les denomina "nombres de nacimiento" o, en culturas donde el nombre de pila precede al apellido, "primer nombre" @es
replaces: givenName
issued: 2019-05-14
modified: 2025-03-20
type: Concept
in scheme: v3
change note: Version 4.1.0

Oral sex
preferred label: Sexo oral @es
alternative label: Giving head
alternative label: Going down
alternative label: Mamar @es
alternative label: Mamada @es
comment: Sexual activities performed using the mouth.
comment: Actividades sexuales realizadas utilizando la boca. @es
broader: Sex (Act)
broader: Sexual practices
narrower: Fellatio
narrower: Cunnilingus
narrower: Kissing
narrower: Licking
narrower: 69ing
related: Rimming
has top concept: Sex (Act)
replaces: oralSex
issued: 2019-05-14
modified: 2025-03-20
type: Concept
in scheme: v3
change note: Version 4.1.0

LGBT
alternative label: GLBT
comment: Acronym used to describe lesbians, gay men, bisexual people, and transgender people as a group.
comment: Acrónimo utilizado para describir a lesbianas, hombres gay, personas bisexuales y personas transgénero como grupo. @es
broader: LGBTI
broader: LGBTQ
narrower: LBT
narrower: LGB
related: Bisexual community
related: Gay community
related: Lesbian community
related: Transgender community
has top concept: LGBTI
replaces: LGBT
issued: 2019-05-14
modified: 2025-02-23
type: Concept
in scheme: v3
change note: Version 4.1.0

Glory holes
preferred label: Agujeros gloriosos @es
alternative label: Gloriosos agujeros @es
comment: Holes through walls or partitions, such as public bathroom stalls, that allow people to perform or observe sex acts, typically anonymously. Often associated with gay male culture due to the historical and ongoing use of glory holes by closeted gay men to facilitate oral or anal sex without the risk of identification or arrest.
comment: Agujeros en paredes o tabiques, como en puestos de baños públicos, que permiten a las personas realizar u observar actos sexuales, generalmente de forma anónima. A menudo se asocian con la cultura masculina gay debido al uso histórico y continuo de agujeros gloriosos por parte de hombres gay en el clóset para facilitar el sexo oral o anal sin riesgo de identificación o arresto. @es
broader: Cottages (Gay culture)
broader: Gay saunas
broader: Public bathrooms
broader: Tearooms (Gay culture)
related: Sexual practices
has top concept: Sex locations
replaces: gloryHoles
issued: 2019-05-14
modified: 2025-02-23
type: Concept
in scheme: v3
change note: Version 4.1.0

Goddess movement
preferred label: Movimiento Goddess @es
alternative label: Goddess movement (Lesbians)
alternative label: Goddess religion
comment: A spiritual movement that emerged in North America, Western Europe, Australia, and New Zealand in 1970s in response to male-dominated organized religion; involves worshiping the Goddess (or several goddesses), as well as a focus on women, femininity, and feminism; often associated with lesbian communities.
comment: Un movimiento espiritual que surgió en Norteamérica, Europa Occidental, Australia y Nueva Zelanda en la década de 1970 en respuesta a la religión organizada dominada por los hombres; implica adorar a la Diosa (o varias diosas), así como la centralidad de las mujeres, la feminidad y el feminismo; a menudo asociado con comunidades lésbicas. @es
related: LGBTQ+ Pagans
related: LGBTQ+ witches
related: Lesbian witches
related: Gay witches
related: Bisexual witches
related: Transgender witches
related: Queer witches
related: Intersex witches
replaces: goddessMovementLesbian
issued: 2019-05-14
modified: 2025-02-23
type: Concept
in scheme: v3
change note: Version 4.1.0

Urine play
preferred label: Juego de orina @es
alternative label: Golden showers
alternative label: Pissing sex
alternative label: Undinism
alternative label: Urolagnia
alternative label: Clothes wetting
alternative label: Omorashi
alternative label: Piss play
alternative label: Urophilia
alternative label: Water sports
alternative label: Watersports
alternative label: Juego con orina @es
comment: Use of urine and urination for sexual or erotic pleasure.
comment: Uso de la orina y la micción para placer sexual o erótico. @es
broader: BDSM
broader: Sex (Act)
broader: Sexual practices
related: Scat play
related: Body fluids
related: Diapers (Erotic)
has top concept: Eroticism
replaces: waterSports
issued: 2019-05-14
modified: 2025-02-23
type: Concept
in scheme: v3
change note: Version 4.1.0

Goldilocks (Gay culture)
preferred label: Ricitos de oro (cultura gay) @es
alternative label: Goldilocks
alternative label: Mariliendres @es
comment: US slang term for heterosexual women who are friends with gay men in the bear community and socialize in bear spaces.
comment: Término de la jerga estadounidense para mujeres heterosexuales que son amigas de hombres gay en la comunidad de osos y socializan en espacios para osos. @es
broader: Heterosexual women
related: Bears (Gay culture)
related: Dutch boys
related: Fag hags
related: Friendships
related: Social privilege
related: Beards (Gay culture)
has top concept: Heterosexuals
replaces: goldilocks
issued: 2019-05-14
modified: 2025-02-23
type: Concept
in scheme: v3
change note: Version 4.1.0

Gonadal dysgenesis
preferred label: Disgenesia gonadal @es
alternative label: Síndrome de Swyer @es
comment: A term that refers to a group of different variations that affect the development of the gonads before birth.
comment: Término que hace referencia a un grupo de diferentes variaciones que afectan el desarrollo de las gónadas antes del nacimiento. @es
broader: Intersex variations
narrower: Mixed gonadal dysgenesis
has top concept: Sex (Body)
replaces: gonadalDysgenesis
issued: 2019-05-14
modified: 2025-02-23
type: Concept
in scheme: v3
change note: Version 4.1.0

Gonads
preferred label: Gónadas @es
comment: A general term used to describe testes, ovaries, or ovotestes.
comment: Término general utilizado para describir los testículos, los ovarios o los ovotestículos. @es
broader: Sex (Body)
narrower: Testicle
narrower: Streak gonads
related: Sex assigned at birth
has top concept: Sex (Body)
replaces: gonads
issued: 2019-05-14
modified: 2025-02-23
type: Concept
in scheme: v3
change note: Version 4.1.0

Grandchildren
preferred label: Nietos @es
comment: The children of an individual's children.
comment: Los hijos de los hijos de una persona. @es
broader: Family members
narrower: LGBTQ+ grandchildren
narrower: Grandchildren of LGBTQ+ people
has top concept: Family members
replaces: grandchildren
issued: 2019-05-14
modified: 2025-02-23
type: Concept
in scheme: v3
change note: Version 4.1.0

Grandparents
preferred label: Abuelos @es
comment: The parents of an individual's parents.
comment: Los padres de los padres de una persona. @es
broader: Family members
narrower: LGBTQ+ grandparents
narrower: Grandparents of LGBTQ+ people
has top concept: Family members
replaces: grandparents
issued: 2019-05-14
modified: 2025-02-23
type: Concept
in scheme: v3
change note: Version 4.1.0

Group sex
preferred label: Sexo en grupo @es
alternative label: Orgies
alternative label: Orgías @es
comment: Sexual activities involving multiple people, usually understood to be more than three people.
comment: Actividades sexuales en las que participan múltiples personas, dándose a entender que usualmente son más de tres personas. @es
broader: Sexual practices
narrower: Bukkake
related: Casual sex
related: Polyamory
related: Polygamy
related: Sex parties
related: Sexuality
has top concept: Sexual practices
replaces: groupSex
issued: 2019-05-14
modified: 2025-02-23
type: Concept
in scheme: v3
change note: Version 4.1.0

Güevedoce
alternative label: Guevedoche @es
comment: In the Dominican Republic, this term refers to people who have undifferentiated genitalia and who are generally raised as female until puberty; may be considered a third gender.
comment: En la República Dominicana, este término se refiere a las personas que tienen genitales indiferenciados y que generalmente son criadas como mujeres hasta la pubertad; puede considerarse un tercer género. @es
broader: Non-Euro-American gender and sexual identities
has top concept: Gender
replaces: guevedoche
issued: 2019-05-14
modified: 2025-02-23
type: Concept
in scheme: v3
change note: Version 4.1.0

Hair
preferred label: Pelo @es
alternative label: Cabello @es
alternative label: Vello @es
comment: Threadlike strands of keratin growing out of the skin on the body. Use in reference to hair as a secondary sex characteristic or as a form of self expression.
comment: Hilos de queratina que crecen de la piel en el cuerpo. Utilícese en referencia al cabello como característica sexual secundaria o como forma de autoexpresión. @es
broader: Secondary sex characteristics
narrower: Mustaches
has top concept: Sex (Body)
replaces: hair
issued: 2019-05-14
modified: 2025-02-23
type: Concept
in scheme: v3
change note: Version 4.1.0

Hair removal
preferred label: Depilación @es
alternative label: Shaving
alternative label: Waxing
alternative label: Eliminación del vello @es
alternative label: Afeitarse @es
comment: The process of removing hair from the body through shaving, waxing, depilatories, laser hair removal, etc. May have a social component related to gender identity and/or have an erotic component.
comment: El proceso de eliminación del vello del cuerpo mediante afeitado, depilación, productos depilatorios, depilación láser, etc. Puede tener un componente social relacionado con la identidad de género y/o tener un componente erótico. @es
broader: Gender expression
related: Transitioning (Gender)
related: Wax play
has top concept: Gender
replaces: hairRemoval
issued: 2019-05-14
modified: 2025-02-23
type: Concept
in scheme: v3
change note: Version 4.1.0

Halloween (LGBTQ+ culture)
preferred label: Halloween (Cultura LGBTQ+) @es
alternative label: Gay Christmas
alternative label: Gay Halloween
alternative label: Navidad gay @es
alternative label: Halloween gay @es
comment: The celebration of Halloween, often called Gay Christmas, by LGBTQ+ people. Typically involves dressing in drag or elaborate costumes as a form of gender play and attending large parties in LGBTQ+ neighborhoods or establishments.
comment: La celebración de Halloween, a menudo llamada Navidad Gay, por personas LGBTQ+. Por lo general, implica vestirse en drag o disfraces elaborados como forma de jugar con el género y asistir a grandes fiestas en vecindarios o establecimientos LGBTQ+. @es
broader: Europride
related: Costumes
has top concept: Europride
replaces: halloween
issued: 2019-05-14
modified: 2025-02-23
type: Concept
in scheme: v3
change note: Version 4.1.0

Handcuffs
preferred label: Esposas @es
alternative label: Handcuff restraints
comment: A restraint device designed to secure an individual’s wrists.
broader: Cuffs
has top concept: Sex accessories
replaces: handcuffs
issued: 2019-05-14
modified: 2025-02-23
type: Concept
in scheme: v3
change note: Version 4.1.0

Handkerchief codes
preferred label: Códigos de pañuelos @es
alternative label: Hanky codes
alternative label: Hanky code @es
comment: A color-coded system to indicate preferred sexual fetishes and identify whether a person is a top/dominant or bottom/submissive.
comment: Un sistema codificado por colores para indicar fetiches sexuales preferidos e identificar si una persona es activa/dominante o pasiva/sumisa. @es
broader: LGBTQ+ symbols
related: BDSM
related: Sex (Act)
related: Sexual practices
related: Sexual roles
related: Queer coding
has top concept: LGBTQ+ symbols
replaces: handkerchiefCodes
issued: 2019-05-14
modified: 2025-02-23
type: Concept
in scheme: v3
change note: Version 4.1.0

Happy endings
preferred label: Finales felices @es
comment: Term used in the context of sex work to describe a massage that ends with the masseuse giving the client an orgasm.
comment: Término utilizado en el contexto del trabajo sexual para describir un masaje que termina con el o la masajista dándole al cliente un orgasmo. @es
related: Cum
related: Erotic massage
related: Getting off
related: Jizz
related: Sexual excitement
related: Sexual climax
replaces: happyEndings
issued: 2019-05-14
modified: 2025-03-20
type: Concept
in scheme: v3
change note: Version 4.1.0

Harassment
preferred label: Acoso @es
comment: Covers a wide range of behaviors that are intended to disturb or upset. Harassment is often repetitive or occurs across an extended period of time.
comment: Cubre una amplia gama de comportamientos que tienen como objetivo perturbar o alterar. El acoso suele ser repetitivo u ocurrir durante un período prolongado. @es
narrower: Police harassment
narrower: Sexual harassment
related: Bullying
related: LGBTQ+ discrimination
related: Slurs
replaces: harassment
issued: 2019-05-14
modified: 2025-02-23
type: Concept
in scheme: v3
change note: Version 4.1.0

Harnesses
preferred label: Arneses @es
comment: Wearable accessories, typically consisting of leather straps and metal rings or points of attachment. May be worn as a fashion statement, to signal one's belonging to the leather or BDSM communities, or during sex to restrict movement, increase pleasure, and/or to permit the attachment of a sex accessory, such as a dildo.
broader: Sex accessories
broader: Kink accessories
narrower: Chest harnesses
narrower: Dildo harnesses
narrower: Thigh harnesses
has top concept: Sex accessories
replaces: harnesses
issued: 2019-05-14
modified: 2025-02-23
type: Concept
in scheme: v3
change note: Version 4.1.0

LGBTQ+ victims of hate crimes
preferred label: Víctimas LGBTQ+ de crímenes de odio @es
alternative label: Hate crime victims (LGBTQ)
alternative label: Victims of hate crimes (LGBTQ)
comment: LGBTQ+ people who have experienced hate crimes and may or may not have survived; follow the individual's preference for "victims" or "survivors" whenever possible.
comment: Personas LGBTQ+ que han sufrido crímenes de odio y pueden o no haber sobrevivido; siga la preferencia de la persona sobre el uso de "víctimas" o "sobrevivientes" siempre que sea posible. @es
broader: LGBTQ+ victims of crime
narrower: Bisexual victims of hate crimes
narrower: Gay victims of hate crimes
narrower: Lesbian victims of hate crimes
narrower: Queer victims of hate crimes
narrower: LGBTQ+ survivors of hate crimes
narrower: Transgender victims of hate crimes
narrower: Asexual victims of hate crimes
narrower: Intersex victims of hate crimes
related: Anti-LGBTQ+ violence
related: Hate crimes
related: Two-Spirit victims of hate crimes
has top concept: LGBTQ+ people
replaces: victimsOfHateCrimesLGBTQ
issued: 2019-05-14
modified: 2025-02-23
type: Concept
in scheme: v3
change note: Version 4.1.0

Health care for LGBTQ+ people
preferred label: Asistencia médica para las personas LGBTQ+ @es
alternative label: Medical care for LGBTQ people
alternative label: Health care for LGBTQ people
alternative label: Asistencia médica para las personas (LGBTQ) ||Cuidado de la salud para las personas LGBTQ @es
alternative label: Cuidado medico para personas LGBTQ @es
alternative label: Atención medica para las personas LGBTQ+ @es
comment: Organized measures taken for the maintenance or improvement of health via the prevention, diagnosis, treatment, and/or cure of disease, illness, injury, or other conditions; use in reference to health care addressing the particular needs of LGBTQ+ individuals or communities.
comment: Medidas organizadas tomadas para el mantenimiento o la mejora de la salud a través de la prevención, el diagnóstico, el tratamiento y/o la cura de enfermedades, dolencias, lesiones u otras condiciones; utilícese en referencia a la atención médica que aborda las necesidades particulares de personas o comunidades LGBTQ+. @es
narrower: LGBTQ+ peer support
narrower: Mental health care for LGBTQ+ people
narrower: Physical health care for LGBTQ+ people
narrower: Terminal care (AIDS)
narrower: Reproductive health care for LGBTQ+ people
narrower: Health care for transgender children and youth
narrower: Gender-affirming care
related: AIDS organizations
related: LGBTQ+ health care centers
related: Transgender health care bans
related: Impact of COVID-19 pandemic on LGBTQ+ people
related: Lesbians with breast cancer
replaces: healthCareForLGBTQPeople
issued: 2019-05-14
modified: 2026-03-05
type: Concept
in scheme: v3
change note: Version 4.1.0

Hemaneh
comment: Cheyenne term for a half-man, half-woman persona.
comment: Término cheyenne para una persona mitad hombre, mitad mujer. @es
broader: Non-Euro-American gender and sexual identities
has top concept: Gender
replaces: hemaneh
issued: 2019-05-14
modified: 2025-02-23
type: Concept
in scheme: v3
change note: Version 4.1.0

Herbal treatments
preferred label: Tratamientos de hierbas @es
alternative label: Tratamientos herbales @es
alternative label: Tratamientos con hierbas @es
comment: The use of plants to improve health, prevent disease, and/or treat illness.
comment: El uso de plantas para mejorar la salud, prevenir enfermedades y/o tratar enfermedades. @es
broader: Therapies
related: No hormone identity
related: Non-operative
has top concept: Medical care
replaces: herbalTreatments
issued: 2019-05-14
modified: 2025-02-23
type: Concept
in scheme: v3
change note: Version 4.1.0

Intersex people
preferred label: Personas intersex @es
alternative label: Hermaphrodites
alternative label: Intersexuals
alternative label: Hermaphroditic people
alternative label: Intersex-identified people
alternative label: Intersexual people
alternative label: Hermafroditas @es
alternative label: Personas hermafroditas @es
alternative label: Intersexuales @es
alternative label: Personas intersexuales @es
comment: Individuals born with variations in their genitalia, hormones, internal anatomy, and/or chromosomes that do not fully or exclusively conform to medical or social expectations for males or females. Only use to describe people who describe themselves as intersex.
comment: Personas que nacen con variaciones en sus genitales, hormonas, anatomía interna y/o cromosomas que no se conforman total o exclusivamente a las expectativas médicas o sociales para hombres o mujeres. Utilícese únicamente para describir a personas que se describen como intersex. @es
broader: LGBTQ+ people
narrower: Intersex children
narrower: Intersex youth
narrower: Chimeras
narrower: Intersex college students
narrower: Pregnant intersex people
related: Androgynos
related: Intersex
related: Intersex variations
related: Intersex genital mutilation
related: Intersex identity
related: Intersex movement
related: Intersex rights
related: Intersex families
related: Intersex parents
related: Children of intersex people
related: Hermaphrodites
related: Persecution of intersex people
has top concept: LGBTQ+ people
replaces: intersexPeople
issued: 2019-05-14
modified: 2025-02-23
type: Concept
in scheme: v3
change note: Version 4.1.0

Heterosexism
preferred label: Heterosexismo @es
alternative label: Heterocentrism
alternative label: Heterocentrismo @es
comment: Discrimination, prejudice, or bias against non-heterosexual people based on the assumption or belief that heterosexuality is the only normal or natural expression of sexual identity.
comment: Discriminación, prejuicio o bias en contra de personas no heterosexuales basado en la suposición o creencia de que la heterosexualidad es la única expresión normal o natural de la identidad sexual. @es
related: Biphobia
related: Ex-gay movement
related: Heteronormativity
related: Heterosexuality
related: Homophobia
related: Intersexphobia
related: Lesbophobia
related: Queerphobia
related: Sexism
related: Transphobia
related: Compulsory heterosexuality
replaces: heterosexism
issued: 2019-05-14
modified: 2025-04-23
type: Concept
in scheme: v3
change note: Version 4.1.0

Heteronormativity
preferred label: Heteronormatividad @es
alternative label: Heterosexual norms
alternative label: Normas heteronormativas @es
comment: The notion or belief that heterosexuality is the normal or preferred sexual orientation.
comment: La noción o creencia de que la heterosexualidad es la orientación sexual normal o preferida. @es
broader: Social norms
related: Normalization
related: Heterosexism
related: Homonormativity
related: Bicuriosity
related: Compulsory heterosexuality
has top concept: Social norms
replaces: heteronormativity
issued: 2019-05-14
modified: 2025-04-23
type: Concept
in scheme: v3
change note: Version 4.1.0

Heterosexual boys
preferred label: Niños heterosexuales @es
alternative label: Straight boys
comment: Boys (typically children or youth younger than 18) who are heterosexual.
comment: Niños (normalmente menores de 18 años) que son heterosexuales. @es
broader: Boys
broader: Heterosexual youth
broader: Heterosexual children
has top concept: Family members
replaces: heterosexualBoys
issued: 2019-05-14
modified: 2025-02-23
type: Concept
in scheme: v3
change note: Version 4.1.0

Heterosexual feminism
preferred label: Feminismo heterosexual @es
comment: A form of feminism that prioritizes the experiences of heterosexual women and focuses on securing equitable economic, political, and social rights for heterosexual women. Often discussed in juxtaposition to political lesbianism.
comment: Una forma de feminismo que prioriza las experiencias de las mujeres heterosexuales y se centra en garantizar derechos económicos, políticos y sociales equitativos para las mujeres heterosexuales. A menudo se discute en yuxtaposición al lesbianismo político. @es
broader: Feminism
related: Lesbian feminism
related: Social privilege
has top concept: Feminism
replaces: heterosexualFeminism
issued: 2019-05-14
modified: 2025-02-23
type: Concept
in scheme: v3
change note: Version 4.1.0

Heterosexual girls
preferred label: Niñas heterosexuales @es
alternative label: Straight girls
comment: Girls (typically children or youth younger than 18) who are heterosexual.
comment: Niñas (normalmente menores de 18 años) que son heterosexuales. @es
broader: Girls
broader: Heterosexual youth
broader: Heterosexual children
has top concept: Family members
replaces: heterosexualGirls
issued: 2019-05-14
modified: 2025-02-23
type: Concept
in scheme: v3
change note: Version 4.1.0

Heterosexual identity
preferred label: Identidad heterosexual @es
comment: Term used to describe the sexual identity of individuals who are romantically and/or sexually attracted to people assigned the “opposite” sex at birth.
comment: Término utilizado para describir la identidad sexual de las personas que se sienten atraídas romántica y/o sexualmente por personas asignadas al sexo “opuesto” al nacer. @es
broader: Sexual identity
related: Heterosexuals
has top concept: Sexual identity
replaces: heterosexualIdentity
issued: 2019-05-14
modified: 2025-02-23
type: Concept
in scheme: v3
change note: Version 4.1.0

Heterosexual marriage
preferred label: Matrimonio heterosexual @es
comment: The legally and formally recognized union of a heterosexual man and woman as partners in a personal relationship.
comment: La unión legal y formalmente reconocida de un hombre y una mujer heterosexuales como pareja en una relación personal. @es
broader: Marriage
has top concept: Living arrangements
replaces: heterosexualMarriage
issued: 2019-05-14
modified: 2025-02-23
type: Concept
in scheme: v3
change note: Version 4.1.0

Heterosexual men
preferred label: Hombres heterosexuales @es
alternative label: Straight men
alternative label: Hombres hétero @es
comment: Men who identify as heterosexual, or straight.
comment: Hombres que se autoidentifican como heterosexuales. @es
broader: Heterosexuals
broader: Males
narrower: Dutch boys
narrower: Fag stags
has top concept: Heterosexuals
replaces: heterosexualMen
issued: 2019-05-14
modified: 2025-02-23
type: Concept
in scheme: v3
change note: Version 4.1.0

Heterosexuals
preferred label: Heterosexuales @es
alternative label: Heterosexual people
alternative label: Straight people
alternative label: Personas heterosexuales @es
alternative label: Personas hétero @es
comment: Individuals who are romantically and sexually attracted to members of the opposite sex or gender.
comment: Personas que se sienten atraídas romántica y sexualmente por miembros del sexo o género opuesto. @es
narrower: Allies
narrower: Heterosexual men
narrower: Heterosexual women
narrower: Heterosexual youth
narrower: Heterosexual children
related: Heterosexual identity
related: Heterosexuality
related: Allosexuality
related: Monosexual people
replaces: heterosexuals
issued: 2019-05-14
modified: 2025-02-23
type: Concept
in scheme: v3
change note: Version 4.1.0

Heterosociality
preferred label: Heterosocialidad @es
alternative label: Heterosexual social relationships
alternative label: Heterosocial bonds
alternative label: Relaciones sociales heterosexuales @es
alternative label: Vínculos heterosociales @es
comment: In sociology, this term is used to describe social relations and bonds between members of the opposite sex or gender in a given culture. Typically excludes romantic and sexual relationships.
comment: En la sociología, este término se utiliza para describir las relaciones sociales y los vínculos entre miembros del sexo o género opuesto en una cultura determinada. Normalmente excluye las relaciones románticas y sexuales. @es
broader: Relationship satisfaction
related: Homosociality
has top concept: Relationship satisfaction
replaces: heterosociality
issued: 2019-05-14
modified: 2025-02-23
type: Concept
in scheme: v3
change note: Version 4.1.0

Heterosexual women
preferred label: Mujeres heterosexuales @es
alternative label: Straight women
alternative label: Mujeres hétero @es
comment: Women who identify as heterosexual, or straight.
comment: Mujeres que se autoidentifican como heterosexuales. @es
broader: Heterosexuals
broader: Females
narrower: Fag hags
narrower: Goldilocks (Gay culture)
has top concept: Heterosexuals
replaces: heterosexualWomen
issued: 2019-05-14
modified: 2025-02-23
type: Concept
in scheme: v3
change note: Version 4.1.0

Heterosexual youth
preferred label: Juventud heterosexual @es
alternative label: Straight youth
alternative label: Heterosexual adolescents
alternative label: Heterosexual teenagers
alternative label: Heterosexual teens
alternative label: Straight adolescents
alternative label: Straight teenagers
alternative label: Straight teens
alternative label: Adolescentes heterosexuales @es
alternative label: Jóvenes heterosexuales @es
alternative label: Juventud hétero @es
alternative label: Adolescentes hétero @es
comment: Heterosexual people between the ages of childhood and adulthood.
comment: Personas heterosexuales entre las edades de la infancia y la edad adulta. @es
broader: Heterosexuals
broader: Youth
narrower: Heterosexual boys
narrower: Heterosexual girls
narrower: Heterosexual children
related: LGBTQ+ youth
has top concept: Heterosexuals
replaces: heterosexualYouth
issued: 2019-05-14
modified: 2025-02-23
type: Concept
in scheme: v3
change note: Version 4.1.0

Heterosexuality
preferred label: Heterosexualidad @es
comment: Romantic and sexual attraction to members of the opposite sex or gender, typically in a culture that understands sex and gender through the binary opposition of male/female or man/woman.
comment: Atracción romántica y sexual hacia miembros del sexo o género opuesto, típicamente en una cultura que entiende el sexo y el género a través de la oposición binaria de masculino/femenino u hombre/mujer. @es
broader: Sexual orientation
broader: Monosexuality
related: Heterosexism
related: Heterosexuals
related: Homosexuality
related: Bicuriosity
has top concept: Sexual orientation
replaces: heterosexuality
issued: 2019-05-14
modified: 2025-02-23
type: Concept
in scheme: v3
change note: Version 4.1.0

Hijras
alternative label: Jagappa
comment: Hindi word used in South Asia to refer to people assigned male at birth who identify as women or “not-men.”
comment: Palabra hindi utilizada en el sur de Asia para referirse a personas asignadas al sexo masculino al nacer que se autoidentifican como mujeres o "no hombres". @es
broader: Non-Euro-American gender and sexual identities
related: Aravani
related: Eunuchs
related: Chakka
related: Jogappa
related: Khusra
related: Kinnar
related: Kothis
has top concept: Gender
replaces: hijra
issued: 2019-05-14
modified: 2025-10-28
type: Concept
in scheme: v3
change note: Version 4.1.0

LGBTQ+ Hindus
preferred label: Hindúes LGBTQ+ @es
alternative label: Hindus (LGBTQ)
alternative label: LGBTQ Hindus
comment: LGBTQ+ people who are Hindu.
comment: Personas LGBTQ+ que son hindúes. @es
broader: LGBTQ+ African religions
has top concept: LGBTQ+ African religions
replaces: LGBTQHindus
issued: 2019-05-14
modified: 2025-02-23
type: Concept
in scheme: v3
change note: Version 4.1.0

HIV tests
preferred label: Pruebas de VIH @es
alternative label: Exámenes de VIH @es
comment: Medical tests used to determine the presence of HIV antibodies or antigens in an individual's blood, saliva, or urine.
comment: Pruebas médicas utilizadas para determinar la presencia de anticuerpos o antígenos del VIH en la sangre, la saliva o la orina de una persona. @es
related: HIV/AIDS
replaces: HIVTests
issued: 2019-05-14
modified: 2025-02-23
type: Concept
in scheme: v3
change note: Version 4.1.0

HIV-negative people
preferred label: Personas negativas al VIH @es
alternative label: HIV-seronegative people
alternative label: Personas seronegativas @es
comment: Individuals who have not contracted HIV.
comment: Personas que no han contraído el VIH. @es
related: HIV/AIDS
related: HIV-positive people
related: Serodiscordant couples
related: Serostatus
related: HIV-undetectable people
replaces: HIV-negativePeople
issued: 2019-05-14
modified: 2025-02-23
type: Concept
in scheme: v3
change note: Version 4.1.0

HIV-positive people
preferred label: Personas positivas al VIH @es
alternative label: HIV-seropositive people
comment: People who have contracted HIV.
comment: Personas que han contraído el VIH. @es
narrower: HIV-undetectable people
related: HIV/AIDS
related: LGBTQ+ peer support
related: HIV-negative people
related: Serodiscordant couples
related: Serostatus
replaces: HIV-positivePeople
issued: 2019-05-14
modified: 2025-02-23
type: Concept
in scheme: v3
change note: Version 4.1.0

Seroconversion
preferred label: Seroconversión @es
alternative label: HIV-seroconversion
alternative label: Seroconversión-VIH @es
comment: Term used to describe the period of time between exposure to a virus and when antibodies for the virus are detectable; often used in reference to HIV testing when a test changes from HIV negative to HIV positive.
comment: Término utilizado para describir el período de tiempo entre la exposición a un virus y el momento en que los anticuerpos contra el virus son detectables; a menudo se utiliza en referencia a la prueba del VIH cuando una prueba cambia de VIH negativa a VIH positiva. @es
related: HIV/AIDS
replaces: seroconversion
issued: 2019-05-14
modified: 2025-02-23
type: Concept
in scheme: v3
change note: Version 4.1.0

Serodiscordant couples
preferred label: Parejas serodiscordantes @es
alternative label: HIV-serodiscordant couples
alternative label: Parejas serodiscordantes-VIH @es
comment: Partnerships in which one person has HIV and the other does not.
comment: Parejas en las que una persona tiene VIH y la otra no. @es
related: HIV-negative people
related: HIV-positive people
replaces: serodiscordantCouples
issued: 2019-05-14
modified: 2025-02-23
type: Concept
in scheme: v3
change note: Version 4.1.0

Serostatus
preferred label: Seroestatus @es
alternative label: HIV-serostatus
alternative label: Serostatus-VIH @es
comment: The presence (seropositivity) or absence (seronegativity) of antibodies in blood serum; commonly used in in reference to HIV testing.
comment: La presencia (seropositividad) o ausencia (seronegatividad) de anticuerpos en el suero sanguíneo; comúnmente utilizado en referencia a las pruebas de VIH. @es
related: HIV/AIDS
related: HIV-negative people
related: HIV-positive people
related: HIV-undetectable people
replaces: serostatus
issued: 2019-05-14
modified: 2025-02-23
type: Concept
in scheme: v3
change note: Version 4.1.0

HIV-undetectable people
preferred label: Personas con VIH indetectable @es
comment: People who have contracted HIV and received treatment to reduce their HIV antibodies to an amount that can no longer be detected by standard HIV tests.
comment: Personas que contrajeron el VIH y recibieron tratamiento para reducir sus anticuerpos contra el VIH a una cantidad que no se puede detectar mediante pruebas estándar de VIH. @es
broader: HIV-positive people
related: HIV/AIDS
related: HIV-negative people
related: Serostatus
has top concept: HIV-positive people
replaces: HIVUndetectablePeople
issued: 2019-05-14
modified: 2025-02-23
type: Concept
in scheme: v3
change note: Version 4.1.0

Murders of LGBTQ+ people
preferred label: Asesinatos de personas LGBTQ+ @es
alternative label: Homicides of LGBTQ people
alternative label: Murders of LGBTQ people
alternative label: Homicidios de personas LGBTQ+ @es
comment: Intentional killing of LGBTQ+ people due to their gender and/or sexual identities.
comment: Asesinato intencional de personas LGBTQ+ debido a su género y/o identidad sexual. @es
broader: Anti-LGBTQ+ violence
related: Hate crimes
has top concept: Anti-LGBTQ+ violence
replaces: murdersOfLGBTQPeople
issued: 2019-05-14
modified: 2025-02-23
type: Concept
in scheme: v3
change note: Version 4.1.0

LGBTQ+ monuments
preferred label: Monumentos LGBTQ+ @es
alternative label: Homomonuments
alternative label: Monuments (LGBTQ)
alternative label: Homomonumentos @es
alternative label: Monumentos (LGBTQ) @es
comment: Public monuments designed to commemorate LGBTQ+ people who have been persecuted because of their gender and/or sexual identities.
comment: Monumentos públicos diseñados para conmemorar a las personas LGBTQ+ que han sido perseguidas por su identidad de género y/o sexual. @es
is replaced by: homoit0000901
replaces: homomonuments
issued: 2019-05-14
modified: 2025-02-23
type: Concept
in scheme: v3
change note: Version 4.1.0

Homonationalism
preferred label: Homonacionalismo @es
comment: Favorable association between a nationalist ideology and LGBTQ+ people or their rights.
comment: Asociación favorable entre una ideología nacionalista y las personas LGBTQ+ o sus derechos. @es
related: Intolerance towards LGBTQ+ people
related: Pinkwashing
related: Social norms
replaces: homonationalism
issued: 2019-05-14
modified: 2025-02-23
type: Concept
in scheme: v3
change note: Version 4.1.0

Homonormativity
preferred label: Homonormatividad @es
alternative label: Homosexual norms
alternative label: Normas homosexuales @es
comment: The projection of heteronormative ideals and constructs onto LGBTQ+ cultures and identities, predicated on the assumption that LGBTQ+ people (particularly cisgender gay men and lesbians) must conform to the norms and values of heterosexuality (e.g., the gender binary, marriage, procreation, and monogamy) in order to be viewed as "normal" and gain social acceptance.
comment: La proyección de ideales y construcciones homonormativas en culturas e identidades LGBTQ+, basada en el supuesto de que las personas LGBTQ+ (particularmente hombres gay y lesbianas cisgénero) deben ajustarse a las normas y valores de la heterosexualidad (por ejemplo, el binario de género, el matrimonio, la procreación y la monogamia) para ser vistos como "normales" y ganar aceptación social. @es
broader: Social norms
related: Normalization
related: Heteronormativity
has top concept: Social norms
replaces: homonormativity
issued: 2019-05-14
modified: 2025-02-23
type: Concept
in scheme: v3
change note: Version 4.1.0

Homophiles
preferred label: Homófilos @es
comment: Outdated term for lesbians and gay men. The use of the word began to disappear with the emergence of the gay liberation movement of the late 1960s and early 1970s.
comment: Término obsoleto para lesbianas y hombres gay. El uso de la palabra comenzó a desaparecer con el surgimiento del movimiento de liberación gay a finales de la década de los sesenta y principios de los setenta. @es
broader: LGBTQ+ historical terms
related: Sexual minorities
has top concept: LGBTQ+ historical terms
replaces: homophiles
issued: 2019-05-14
modified: 2026-02-24
type: Concept
in scheme: v3
change note: Version 4.1.0

Homophobia
preferred label: Homofobia @es
comment: Antagonism or disgust directed towards homosexuality as an identity or men who are perceived to be or are actually gay. Homophobia can include denial of the existence of homosexuality, stereotypes, verbal harassment, and physical violence. This term is often used colloquially to encompass all LGBTQ+ phobia.
comment: Antagonismo o disgusto dirigido hacia la homosexualidad como identidad o hacia los hombres que son percibidos como o que realmente son gay. La homofobia puede incluir la negación de la existencia de la homosexualidad, los estereotipos, el acoso verbal y la violencia física. Este término se utiliza a menudo de forma coloquial para abarcar toda la fobia LGBTQ+. @es
broader: LGBTQ+ phobia
narrower: Internalized homophobia
narrower: Homophobia in fandom
related: Anti-gay discrimination
related: Anti-gay violence
related: Gay men
related: Heterosexism
has top concept: LGBTQ+ phobia
replaces: homophobia
issued: 2019-05-14
modified: 2025-02-23
type: Concept
in scheme: v3
change note: Version 4.1.0

Homosexuality
preferred label: Homosexualidad @es
comment: Sexual orientation with sexual and/or romantic attraction to individuals of the same sex.
comment: Orientación sexual con atracción sexual y/o romántica hacia personas del mismo sexo. @es
broader: Sexual orientation
broader: Monosexuality
narrower: Ritual homosexuality
related: Bisexuality
related: Gay men
related: Lesbians
related: Heterosexuality
related: Lesbianism
has top concept: Sexual orientation
replaces: homosexuality
issued: 2019-05-14
modified: 2025-02-23
type: Concept
in scheme: v3
change note: Version 4.1.0

Homosexuals
preferred label: Homosexuales @es
comment: Outdated term for lesbians and gay men.
comment: Término obsoleto para lesbianas y hombres gay. @es
broader: LGBTQ+ historical terms
related: Sexual minorities
related: Allosexuality
related: Monosexual people
has top concept: LGBTQ+ historical terms
replaces: homosexuals
issued: 2019-05-14
modified: 2025-02-23
type: Concept
in scheme: v3
change note: Version 4.1.0

Homosociality
preferred label: Homosocialidad @es
alternative label: Homosocial bonds
alternative label: Lazos homosociales @es
alternative label: Vínculos homosociales @es
comment: A concept used to describe the social bonds that exist between members of the same sex or gender in a given culture.
comment: Concepto utilizado para describir los vínculos sociales que existen entre miembros del mismo sexo o género en una cultura determinada. @es
narrower: Boys' friendships
narrower: Women's friendships
narrower: Girls' friendships
narrower: Men's friendships
related: Friendships
related: Heterosociality
related: Male bonding
replaces: homosociality
issued: 2019-05-14
modified: 2025-02-23
type: Concept
in scheme: v3
change note: Version 4.1.0

Hormone blockers
preferred label: Bloqueadores hormonales @es
comment: Medications used to block the body from producing certain hormones in order to replace or supplement them with other types of hormones.
comment: Medicamentos utilizados para impedir que el cuerpo produzca ciertas hormonas con el fin de reemplazarlas o complementarlas con otros tipos de hormonas. @es
broader: Hormone therapy (Gender)
broader: Medication
narrower: Puberty blockers
has top concept: Medical care
replaces: hormoneBlockers
issued: 2019-05-14
modified: 2025-02-23
type: Concept
in scheme: v3
change note: Version 4.1.0

Hormones
preferred label: Hormonas @es
comment: Regulatory substances produced in organisms and transported throughout the body to stimulate specific cells or tissues into action. Though hormones regulate digestion, respiration, sleep, and many other bodily functions, the term is most commonly used by the general public to describe the "sex hormones," or the hormones involved in puberty and sexual development, reproduction, and sexual desire.
comment: Sustancias reguladoras producidas en organismos y transportadas por todo el cuerpo para estimular la acción de células o tejidos específicos. Aunque las hormonas regulan la digestión, la respiración, el sueño y muchas otras funciones corporales, el público en general utiliza el término con mayor frecuencia para describir las "hormonas sexuales", o las hormonas involucradas en la pubertad y el desarrollo sexual, la reproducción y el deseo sexual. @es
broader: Sex (Body)
narrower: Estrogen
narrower: Testosterone
narrower: Androgens
related: Steroidogenic factor 1 protein
has top concept: Sex (Body)
replaces: hormones
issued: 2019-05-14
modified: 2025-02-23
type: Concept
in scheme: v3
change note: Version 4.1.0

Human rights
preferred label: Derechos humanos @es
comment: Moral, social, and legal standards or principles for human behavior, commonly understood as fundamental to all human beings and subject to legal protection.
comment: Normas o principios morales, sociales y legales para el comportamiento humano, comúnmente entendidos como fundamentales para todo ser humano y sujetos a protección legal. @es
narrower: LGBTQ+ civil rights
narrower: Intersex rights
narrower: Gender equality
replaces: humanRights
issued: 2019-05-14
modified: 2025-02-23
type: Concept
in scheme: v3
change note: Version 4.1.0

Sexual sterilization
preferred label: Esterilización sexual @es
preferred label: Sexual sterilisation
comment: Refers to any type of medical treatment that intentionally leaves an individual sterile or unable to reproduce. This term encompasses both voluntary and involuntary sterilization.
comment: Se refiere a cualquier tipo de tratamiento médico que intencionalmente deja a una persona estéril o incapaz de reproducirse. Este término abarca tanto la esterilización voluntaria como la involuntaria. @es
related: Female genital mutilation
replaces: sexualSterilisation
issued: 2019-05-14
modified: 2025-02-23
type: Concept
in scheme: v3
change note: Version 4.1.0

Hwame
comment: In Native American Mohave tribes, hwame are people assigned female at birth who exhibit masculine traits and are socially male.
comment: En las tribus nativas americanas mohave, los hwame son personas asignadas al sexo femenino al nacer que exhiben rasgos masculinos y son socialmente masculinos. @es
broader: Non-Euro-American gender and sexual identities
related: Alyha
related: Two-Spirit people
has top concept: Gender
replaces: hwame
issued: 2019-05-14
modified: 2025-02-23
type: Concept
in scheme: v3
change note: Version 4.1.0

Machismo
comment: Term originating in the early 1930s and 40s to describe a man's responsibility and pride in providing for, protecting, and defending his family. It is unclear whether the term originates in Spain or Portugal. Though there are positive sides of machismo and it remains an important part of Iberian and Latin American cultures, the concept has also been criticized for its perceived role in perpetuating misogyny, harmful gender roles, and domestic and sexual violence.
comment: Término que se originó a principios de los años 1930 y 1940 para describir la responsabilidad y el orgullo de un hombre por mantener, proteger y defender a su familia. No está claro si el término se origina en España o Portugal. Aunque el machismo tiene aspectos positivos y sigue siendo una parte importante de las culturas ibéricas y latinoamericanas, el concepto también ha sido criticado por su papel percibido en la perpetuación de la misoginia, los roles de género dañinos y la violencia doméstica y sexual. @es
broader: Gender roles
related: Macho men
related: Masculinities
related: Toxic masculinity
has top concept: Role behavior
replaces: machismo
issued: 2019-05-14
modified: 2025-02-23
type: Concept
in scheme: v3
change note: Version 4.1.0

Hypersexuality
preferred label: Hipersexualidad @es
alternative label: Nymphomania
alternative label: Satyriasis
alternative label: Andromania
alternative label: Clitoromania
alternative label: Don Juan syndrome
alternative label: Don Juanism
alternative label: Estromania
alternative label: Excessive sex drive
alternative label: Furor amatorius
alternative label: Furor uterinus
alternative label: Hyper-sexuality
alternative label: Hyperactive sexual desire disorder
alternative label: Hyperaesthesia
alternative label: Hypereroticism
alternative label: Hyperlibido
alternative label: Hyperphilia
alternative label: Hypersensuality
alternative label: Hypersexual disorder
alternative label: Messalina syndrome
alternative label: Œstromania
alternative label: Oversexuality
alternative label: Satyrism
alternative label: Satyromania
alternative label: Sexual hyperesthesia
alternative label: Sexual hyperversion
comment: Term used to describe a level or frequency of sexual desire that is perceived as excessive within a given culture. Though the medical community has not reached a consensus as to whether hypersexuality should be included as a clinical diagnosis, doctors and psychologists have historically diagnosed LGBTQ+ people with hypersexuality (or other related labels) in order to wrongly treat their identities and desires as medical disorders. Should only be used in a historical context or if an individual self-identifies with the term.
comment: Término utilizado para describir un nivel o una frecuencia de deseo sexual que se percibe como excesiva dentro de una cultura determinada. Aunque la comunidad médica no ha llegado a un consenso sobre si la hipersexualidad debe incluirse como diagnóstico clínico, históricamente los médicos y psicólogos han diagnosticado a personas LGBTQ+ con hipersexualidad (u otras etiquetas relacionadas) para tratar erróneamente sus identidades y deseos como trastornos médicos. Utilícese únicamente en un contexto histórico o si una persona se identifica con el término. @es
narrower: Sexual excitement
related: LGBTQ+ people with sexual addictions
related: Sexuality
related: Erotomania
replaces: hypersexuality
issued: 2019-05-14
modified: 2025-02-23
type: Concept
in scheme: v3
change note: Version 4.1.0

Hypospadias
preferred label: Hipospadias @es
comment: People with hypospadias are born with their urinary opening located somewhere other than the tip of the penis. In "distal hypospadias," the urinary opening is elsewhere on the glans (head) of the penis, whereas in "proximal hypospadias," it is on the underside of the penis and sometimes further back near the scrotum. Hypospadias is one of the most common and visible genital variations. People with hypospadias often have additional variations like chordee (a bend in the penis) or cryptorchidism (undescended testicles).
comment: Las personas con hipospadias nacen con la apertura urinaria ubicada en algún lugar distinto a la punta del pene. En el "hipospadias distal", la apertura urinaria está en otra parte del glande (cabeza) del pene, mientras que en el "hipospadias proximal", está en la parte inferior del pene y, a veces, más atrás, cerca del escroto. El hipospadias es una de las variaciones genitales más comunes y visibles. Las personas con hipospadias suelen tener variaciones adicionales como cordee (una curvatura en el pene) o criptorquidia (testículos no descendidos). @es
broader: Intersex variations
has top concept: Sex (Body)
replaces: hypospadias
issued: 2019-05-14
modified: 2025-02-23
type: Concept
in scheme: v3
change note: Version 4.1.0

Hysterectomy
preferred label: Histerectomía @es
comment: Surgical procedure to remove the uterus.
comment: Procedimiento quirúrgico para extirpar el útero. @es
broader: Bottom surgery
has top concept: Medical care
replaces: hysterectomy
issued: 2019-05-14
modified: 2025-02-23
type: Concept
in scheme: v3
change note: Version 4.1.0

In vitro fertilization
preferred label: Fertilización in vitro @es
preferred label: In vitro fertilisation
alternative label: IVF
alternative label: IVF || @es
comment: Medical practice of achieving fertilization by combining sperm and eggs in laboratory settings to induce pregnancy.
comment: Práctica médica para lograr la fertilización mediante la combinación de espermatozoides y óvulos en entornos de laboratorio para inducir el embarazo. @es
broader: Conception by LGBTQ+ people
broader: Assisted reproduction
narrower: Reciprocal in vitro fertilization
related: Test tube babies
has top concept: LGBTQ+ family planning
replaces: inVitroFertilisation
issued: 2019-05-14
modified: 2025-02-23
type: Concept
in scheme: v3
change note: Version 4.1.0

LGBTQ+ information centers
preferred label: Centros de información LGBTQ+ @es
preferred label: LGBTQ+ information centres
comment: An institution that locates and compiles information for the LGBTQ+ community into a central database that can be accessed by the public.
comment: Una institución que localiza y compila información para la comunidad LGBTQ+ en una base de datos central a la que el público puede acceder. @es
broader: LGBTQ+ centers
narrower: AIDS information centers
narrower: Bisexual information centers
narrower: Gay information centers
narrower: Lesbian information centers
narrower: Queer information centers
narrower: Transgender information centers
narrower: Intersex information centers
narrower: Asexual information centers
related: Information provision
related: Two-Spirit information centers
has top concept: LGBTQ+ centers
replaces: informationCentresLGBTQ
issued: 2019-05-14
modified: 2025-02-23
type: Concept
in scheme: v3
change note: Version 4.1.0

Information provision
preferred label: Suministro de información @es
comment: Process by which information is provided to individuals or communities.
comment: Proceso mediante el cual se proporciona información a personas o comunidades. @es
narrower: AIDS education
narrower: LGBTQ+ health education
narrower: Sex education
related: LGBTQ+ information centers
related: LGBTQ+ information professionals
replaces: informationProvision
issued: 2019-05-14
modified: 2025-02-23
type: Concept
in scheme: v3
change note: Version 4.1.0

Sexual intercourse
preferred label: Relaciones sexuales @es
alternative label: Coito @es
comment: Term used to describe sexual activity between two or more people, typically involving penetration.
comment: Término utilizado para describir la actividad sexual entre dos o más personas, que normalmente implica penetración. @es
broader: Sex (Act)
broader: Sexual practices
related: Fucking
related: Getting laid
related: Strap-on sex
has top concept: Sex (Act)
replaces: sexualIntercourse
issued: 2019-05-14
modified: 2025-02-23
type: Concept
in scheme: v3
change note: Version 4.1.0

Intergenerational relationships
preferred label: Relaciones intergeneracionales @es
comment: Ongoing connections (romantic, sexual, play, or platonic) between two or more people of different age groups or from different generations.
comment: Conexiones continuas (románticas, sexuales, lúdicas o platónicas) entre dos o más personas de diferentes grupos de edad o de diferentes generaciones. @es
broader: Relationship satisfaction
related: Age of consent
related: Sexual identity
related: Relationship orientation
has top concept: Relationship satisfaction
replaces: intergenerationalRelationships
issued: 2019-05-14
modified: 2025-02-23
type: Concept
in scheme: v3
change note: Version 4.1.0

LGBTQ+ online dating
preferred label: Citas online @es
alternative label: Online dating (LGBTQ)
alternative label: LGBTQ+ internet dating
alternative label: Internet dating (LGBTQ)
alternative label: Ligar por internet @es
alternative label: Salir en citas online @es
alternative label: Salir en citas por interner @es
alternative label: Citas en línea @es
alternative label: Citas por internet @es
alternative label: Salir por interent @es
comment: Term used to describe the practice of LGBTQ+ people utilizing online websites, applications, or forums to meet romantic or sexual partners.
comment: Utilizar sitios web, aplicaciones o foros en línea para conocer parejas románticas o sexuales. @es
broader: LGBTQ+ dating
related: Dating applications
related: LGBTQ+ dating websites
has top concept: Relationship satisfaction
replaces: onlineDating
issued: 2019-05-14
modified: 2025-04-01
type: Concept
in scheme: v3
change note: Version 4.1.0

Internet forums
preferred label: Foros de internet @es
preferred label: LGBTQ+ Internet forums
preferred label: Foros de internet LGBTQ+ @es
comment: Websites designed to facilitate discussion amongst users through posted messages.
comment: Sitios web diseñados para facilitar el debate entre los usuarios a través de mensajes publicados. @es
comment: Websites that facilitate online conversations between LGBTQ+ people, often about LGBQ+ issues.
comment: Sitios web que facilitan conversaciones en línea entre personas LGBTQ+, a menudo sobre temas LGBTQ+. @es
broader: Social media
broader: LGBTQ+ social media
has top concept: Social media
has top concept: LGBTQ+ social media
replaces: internetForums
replaces: LGBTQInternetForums
issued: 2019-05-14
modified: 2025-07-16
modified: 2025-03-20
type: Concept
in scheme: v3
change note: Version 4.1.0
alternative label: LGBTQ Internet forums
related: LGBTQ+ websites

Intersexphobia
preferred label: Intersexfobia @es
alternative label: Interphobia
alternative label: Interfobia @es
comment: Antagonism or disgust directed toward intersex people or intersex variations. Intersexphobia can include the denial of the existence of intersex people, insistence that intersex variations should be forcibly "corrected," stereotypes, verbal harassment, and physical violence.
comment: Antagonismo o disgusto dirigido hacia personas intersex o variaciones intersex. La intersexfobia puede incluir la negación de la existencia de personas intersex, la insistencia en que las variaciones intersex deben "corregirse" a la fuerza, estereotipos, acoso verbal y violencia física. @es
broader: LGBTQ+ phobia
narrower: Internalized intersexphobia
related: Intersex
related: Heterosexism
related: Intersex genital mutilation
related: Anti-intersex violence
related: Anti-intersex discrimination
has top concept: LGBTQ+ phobia
replaces: intersexphobia
issued: 2019-05-14
modified: 2025-02-23
type: Concept
in scheme: v3
change note: Version 4.1.0

Intersectionality
preferred label: Interseccionalidad @es
comment: A theoretical framework first conceptualized by Kimberlé Crenshaw to describe how different facets of social identity (such as gender, race, ethnicity, disability, socioeconomic class, religion, and sexual identity) overlap and intersect, often compounding the individual's experiences with inequality and discrimination.
comment: Un marco teórico conceptualizado y acuñado por Kimberlé Crenshaw para describir cómo las diferentes facetas de la identidad social (como el género, la raza, el origen étnico, la discapacidad, la clase socioeconómica, la religión y la identidad sexual) se superponen y entrecruzan, a menudo agravando las experiencias de la persona con la desigualdad y la discriminación. @es
related: Diversity
related: LGBTQ+ people of shared ethnic or national identities
related: Social privilege
related: Black feminism
related: White feminism
related: Womanism
related: Transfeminism
replaces: intersectionality
issued: 2019-05-14
modified: 2025-02-23
type: Concept
in scheme: v3
change note: Version 4.1.0

Intersex children
preferred label: Niños intersex @es
comment: Children younger than 18 years who describe themselves as intersex.
comment: Niños menores de 18 años que se autoidentifican como intersex. @es
broader: LGBTQ+ children
broader: Intersex people
broader: Intersex youth
related: Sex assigned at birth
has top concept: Family members
replaces: intersexChildren
issued: 2019-05-14
modified: 2025-02-23
type: Concept
in scheme: v3
change note: Version 4.1.0

Intersex variations
preferred label: Variaciones intersex @es
alternative label: Intersex conditions
alternative label: Condiciones intersex @es
comment: Term used to refer to a wide range of variations in sex characteristics. The term "intersex conditions" is a pathologizing term used to mean people born with variations in their physical sex characteristics also known as intersex traits.
comment: Término utilizado para referirse a una amplia gama de variaciones en las características sexuales. El término "condiciones intersex" es un término patologizante que se utiliza para referirse a personas que nacen con variaciones en sus características sexuales físicas, también conocidas como rasgos intersex. @es
broader: Intersex
broader: Medicalization
narrower: 5-alpha reductase deficiency
narrower: Androgen insensitivity syndrome
narrower: Aphallia
narrower: Clitoromegaly
narrower: Congenital adrenal hyperplasia
narrower: Gonadal dysgenesis
narrower: Hypospadias
narrower: Klinefelter syndrome
narrower: Micropenis
narrower: Mosaicism involving "sex" chromosomes
narrower: Ovo-testes
narrower: Partial androgen insensitivity syndrome
narrower: Progestin induced virilization
narrower: Swyer syndrome
narrower: Turner syndrome
narrower: 17-beta hydroxysteroid dehydrogenase 3 deficiency
narrower: Ambiguous genitalia
narrower: Anorchia
narrower: Aromatase deficiency
narrower: Aromatase excess syndrome
narrower: Bladder exstrophy
narrower: Chimerism
narrower: Cloacal exstrophy
narrower: Complete androgen insensitivity syndrome
narrower: Congenital chordee
narrower: Cryptorchidism
narrower: De la Chapelle syndrome
narrower: Epispadias
narrower: Estrogen insensitivity syndrome
narrower: Follicle-stimulating hormone insensitivity
narrower: Fraser syndrome
narrower: Hyperandrogenism
narrower: Hypogonadism
narrower: Isolated 17,20-lyase deficiency
narrower: Jacobs syndrome
narrower: Kallmann syndrome
narrower: Leydig cell hypoplasia
narrower: Luteinizing hormone insensitivity
narrower: Mayer-Rokitansky-Küster-Hauser syndrome
narrower: Penoscrotal transposition
narrower: Persistent Müllerian duct syndrome
narrower: Polycystic ovary syndrome
narrower: Pseudohermaphroditism
narrower: Sex reversal syndrome
narrower: Trisomy X
narrower: Vaginal atresia
narrower: XXYY syndrome
related: Intersex people
related: Sex assigned at birth
related: Assigned X at birth
has top concept: Sex (Body)
replaces: intersexConditions
issued: 2019-05-14
modified: 2025-02-23
type: Concept
in scheme: v3
change note: Version 4.1.0

Intersex genital mutilation
preferred label: Mutilación genital intersex @es
alternative label: IGM
alternative label: Mutilación genital a personas intersex @es
comment: Surgeries or other medical treatments performed, typically on newborn babies or children, to "normalize" the patient's reproductive or sexual anatomy and force their body to conform to medical or social expectations for what is male or female. IGM practices can be performed for cultural, social, or religious reasons. Though they are typically justified through a medical lens, IGM practices are medically unnecessary and non-consensual.
comment: Cirugías u otros tratamientos médicos realizados, generalmente en recién nacidos y niños, para "normalizar" la anatomía sexual o reproductiva del paciente y obligar a su cuerpo a acomodarse a las expectativas médicas o sociales de lo que es masculino o femenino. Las prácticas de MGI se pueden realizar por razones culturales, sociales o religiosas. Aunque normalmente se justifican desde una perspectiva médica, las prácticas de MGI son médicamente innecesarias y no consensuadas. @es
narrower: Clitoridectomy
narrower: Intersex surgery
related: Intersex
related: Intersex people
related: Intersexphobia
related: Intersex rights
related: Sex assigned at birth
replaces: intersexGenitalMutilation
issued: 2019-05-14
modified: 2025-02-23
type: Concept
in scheme: v3
change note: Version 4.1.0

Intersex identity
preferred label: Identidad intersex @es
comment: Used to describe the experience of selfhood of intersex people. Intersex identity is not gender identity, sexual identity, nor sexual orientation. For the subject of intersex variations, use "intersex variations" or "intersex". For the subject of intersex people, use "intersex people". Do not use in place of gender-identity-related terms such as non-binary identity or genderfluid identity.
comment: Se utiliza para describir la experiencia de identidad de las personas intersex. La identidad intersex no es una identidad de género, identidad sexual ni orientación sexual. Para el tema de las variaciones intersex, utilice "variaciones intersex" o "intersex". Para el tema de las personas intersex, utilice "personas intersex". No lo utilice en lugar de términos relacionados con la identidad de género, como identidad no binaria o identidad de género fluido. @es
related: Intersex
related: Intersex people
replaces: intersexIdentity
issued: 2019-05-14
modified: 2025-02-23
type: Concept
in scheme: v3
change note: Version 4.1.0

Intersex movement
preferred label: Movimiento intersex @es
comment: Umbrella term for activism focused on the rights of intersex people and issues faced by intersex communities.
comment: Término general para el activismo centrado en los derechos de las personas intersex y los problemas que enfrentan las comunidades intersex. @es
broader: LGBTQ+ movement
related: Intersex
related: Intersex people
related: LGBTI
related: LGBTQ+
related: LGBTQIA
related: Social movements
related: Intersex demonstrations
has top concept: Social movements
replaces: intersexMovement
issued: 2019-05-14
modified: 2025-04-23
type: Concept
in scheme: v3
change note: Version 4.1.0

Intersex rights
preferred label: Derechos intersex @es
comment: Legal, social, or ethical principles of freedom or entitlement held by intersex people. Often used to refer to intersex people's right to bodily autonomy and, specifically, their right to delay or decline unnecessary medical interventions.
comment: Principios legales, sociales o éticos de libertad o derechos que tienen las personas intersex. A menudo, se utiliza para referirse al derecho de las personas intersex a la autonomía corporal y, específicamente, a su derecho a retrasar o rechazar intervenciones médicas innecesarias. @es
broader: Human rights
related: LGBTQ+ civil rights
related: Intersex people
related: Intersex genital mutilation
has top concept: Human rights
replaces: intersexRights
issued: 2019-05-14
modified: 2025-02-23
type: Concept
in scheme: v3
change note: Version 4.1.0

Intersex youth
preferred label: Juventud intersex @es
alternative label: Intersex adolescents
alternative label: Intersex teenagers
alternative label: Intersex teens
alternative label: Adolescentes intersex @es
alternative label: Jóvenes intersex @es
comment: Intersex people between the age of childhood and adulthood.
comment: Personas intersex entre la edad de la niñez y la edad adulta. @es
broader: Intersex people
broader: Youth
narrower: Intersex children
related: LGBTQ+ youth
has top concept: LGBTQ+ people
replaces: intersexYouth
issued: 2019-05-14
modified: 2025-02-23
type: Concept
in scheme: v3
change note: Version 4.1.0

Intimate partner violence
preferred label: Violencia doméstica @es
alternative label: Intimate partner abuse
alternative label: Violencia de pareja @es
comment: Acts of violence or abuse directed against an individual by their current or former partner in a romantic, sexual, or play relationship.
comment: Actos de violencia o abuso dirigidos contra una persona por su pareja actual o anterior en una relación romántica, sexual o de juego. @es
broader: LGBTQ+ domestic violence
related: LGBTQ+ personal and family law
related: Social privilege
related: Sexual harassment
related: Significant others
has top concept: Anti-LGBTQ+ violence
replaces: intimatePartnerViolence
issued: 2019-05-14
modified: 2025-02-23
type: Concept
in scheme: v3
change note: Version 4.1.0

Inuit LGBTQ+ people
preferred label: Personas LGBTQ+ inuit @es
alternative label: Inuit (LGBTQ)
alternative label: Inuit people (LGBTQ)
alternative label: LGBTQ+ Inuit
alternative label: LGBTQ+ Inuit people
alternative label: Personas inuit (LGBTQ) @es
alternative label: Personas inuit LGBTQ+ @es
comment: LGBTQ+ people who are Inuit, or part of several Indigenous peoples inhabiting the Inuit homeland in the Arctic and subarctic regions of Greenland, Canada, and Alaska. Only use for people who identify as Inuit.
comment: Personas LGBTQ+ que son inuit o que son parte de varios pueblos indígenas que habitan los territorios ancestrales inuit en las regiones árticas o subárticas de Groenlandia, Canadá y Alaska. Utilícese únicamente para personas que se identifiquen como inuit. @es
broader: Indigenous LGBTQ+ people
narrower: Inuit lesbians
narrower: Inuit gay men
narrower: Inuit bisexual people
narrower: Inuit transgender people
narrower: Inuit queer people
narrower: Inuit intersex people
narrower: Inuit asexual people
narrower: Inuit non-binary people
related: Indigiqueer people
related: Indigiqueer
has top concept: LGBTQ+ people
replaces: LGBTQInuit
issued: 2019-05-14
modified: 2025-02-23
type: Concept
in scheme: v3
change note: Version 4.1.0

Inverts
preferred label: Invertidos @es
alternative label: Sexual inverts
alternative label: Invertida @es
alternative label: Invertido sexual @es
comment: Outdated, historical term used for LGBTQ+ people.
comment: Término anticuado e histórico utilizado para las personas LGBTQ+. @es
broader: LGBTQ+ historical terms
related: Sexual inversion
related: Sexual minorities
related: Uranism
has top concept: LGBTQ+ historical terms
replaces: inverts
issued: 2019-05-14
modified: 2025-02-23
type: Concept
in scheme: v3
change note: Version 4.1.0

Jankha
comment: In India, this term is used to describe people assigned male at birth who take on female dress and characteristics but who do not elect to receive castration.
comment: En la India, este término se utiliza para describir a las personas asignadas al sexo masculino al nacer que adoptan vestimenta y características femeninas pero que no eligen la castración. @es
broader: Non-Euro-American gender and sexual identities
has top concept: Gender
replaces: jankha
issued: 2019-05-14
modified: 2025-02-23
type: Concept
in scheme: v3
change note: Version 4.1.0

Jealousy
preferred label: Cheating
preferred label: Non-consensual non-monogamy
preferred label: No monogamia no consensual @es
related: LGBTQ+ emotions
related: Relationship satisfaction
related: Compersion
has top concept: Relationship orientation
is replaced by: homoit0001658
replaces: jealousy
replaces: cheating
replaces: nonConsensualNonMonogamy
issued: 2019-05-14
issued: 2021-06-30
modified: 2022-10-13
modified: 2025-02-23
type: Concept
in scheme: v3
change note: Version 4.1.0
alternative label: Straying
alternative label: Adultery
alternative label: Infidelity
alternative label: Affairs
alternative label: Stepping out
comment: A violation of a couple's assumed or stated contract regarding emotional and/or sexual exclusivity. Should not be used to refer to non-monogamy in general, as cheating is possible in both monogamous and non-monogamous relationships.
comment: Practice of engaging in romantic or sexual relationships with more than one person simultaneously without each partner's consent.
comment: Práctica de entablar relaciones románticas o sexuales con más de una persona simultáneamente sin el consentimiento de cada pareja. @es
broader: Non-monogamy

LGBTQ+ Jehovah's Witnesses
preferred label: Testigos de Jehová LGBTQ+ @es
alternative label: LGBTQ Jehova's Witnesses
alternative label: Jehova's Witnesses (LGBTQ)
alternative label: LGBTQ Jehovah's Witnesses
alternative label: Testigos de Jehová (LGBTQ) @es
comment: LGBTQ+ people who are Jehovah’s Witnesses.
comment: Personas LGBTQ+ que son testigos de Jehová. @es
broader: LGBTQ+ Christians
has top concept: LGBTQ+ African religions
replaces: LGBTQJehovahsWitnesses
issued: 2019-05-14
modified: 2025-02-23
type: Concept
in scheme: v3
change note: Version 4.1.0

Jerking off
preferred label: Pajearse @es
alternative label: Jacking off
alternative label: Jerking it
alternative label: Echar una paja @es
alternative label: Hacerse una puñeta @es
alternative label: Correrse @es
comment: Slang term for masturbation; typically refers to manual stimulation of the penis.
comment: Término de la jerga para la masturbación; usualmente se refiere a la estimulación manual del pene. @es
broader: Masturbation
has top concept: Sex (Act)
replaces: jerkingOff
issued: 2019-05-14
modified: 2025-02-23
type: Concept
in scheme: v3
change note: Version 4.1.0

Jewish LGBTQ+ people
preferred label: Personas LGBTQ+ judías @es
preferred label: LGBTQ+ Judaism
alternative label: Jews (LGBTQ)
alternative label: LGBTQ+ Jews
alternative label: Judíos (LGBTQ) @es
alternative label: Judíos (LGBTQ+) @es
alternative label: LGBTQ Judaism
comment: LGBTQ+ people who are Jewish.
comment: Personas LGBTQ + que son judías. @es
comment: Jewish religion and culture as practiced by LGBTQ+ people
broader: LGBTQ+ people of shared ethnic or national identities
broader: LGBTQ+ African religions
narrower: Jewish bisexual people
narrower: Jewish gay men
narrower: Jewish lesbians
narrower: Jewish queer people
narrower: Jewish transgender people
narrower: Jewish intersex people
narrower: Jewish asexual people
narrower: Jewish non-binary people
narrower: Androgynos
has top concept: LGBTQ+ people
has top concept: LGBTQ+ African religions
replaces: jewsLGBTQ
replaces: LGBTQJudaism
issued: 2019-05-14
modified: 2025-02-23
modified: 2022-10-04
type: Concept
in scheme: v3
change note: Version 4.1.0
is replaced by: homoit0000682

Jizz
comment: Slang term for semen; primarily used in the United States.
broader: Body fluids
related: Cum
related: Getting off
related: Happy endings
related: Sexual excitement
related: Sexual climax
related: Bukkake
has top concept: Body fluids
replaces: jizz
issued: 2019-05-14
modified: 2025-03-20
type: Concept
in scheme: v3
change note: Version 4.1.0

Jogappa
comment: In India, this term is used to describe people assigned male at birth who become genderfluid in a spiritual conversion.
comment: En India, este término se utiliza para describir a las personas asignadas al sexo masculino al nacer y que asumen un género fluido a través de una conversión espiritual. @es
broader: Non-Euro-American gender and sexual identities
related: Hijras
has top concept: Gender
replaces: jogappa
issued: 2019-05-14
modified: 2025-02-23
type: Concept
in scheme: v3
change note: Version 4.1.0

Kabuki
comment: A form of theatre in Japan that often features crossdressing actors. Historically, female performers played both male and female roles, but women were later banned from performing and were replaced with male performers who played both male and female roles.
comment: Un tipo de teatro en Japón donde a menudo figuran actores transformistas. Históricamente, actrices asumían los roles masculinos y femeninos, pero eventualmente se le prohibió a las mujeres presentarse en el escenario y fueron reemplazadas por actores que asumían los roles masculinos y femeninos. @es
broader: LGBTQ+ theater
related: Crossdressing
has top concept: LGBTQ+ theater
replaces: kabuki
issued: 2019-05-14
modified: 2025-02-23
type: Concept
in scheme: v3
change note: Version 4.1.0

Kaposi's sarcoma
preferred label: Sarcoma de Kaposi @es
comment: A type of cancer that causes lesions to grow in the skin, lymph nodes, internal organs, and mucous membranes; often affects people with immune deficiencies, such as AIDS.
comment: Tipo de cáncer que provoca lesiones en la piel, los ganglios linfáticos, los órganos internos y las mucosas; suele afectar a personas con deficiencias inmunitarias, como el SIDA. @es
related: HIV/AIDS
related: ARC (AIDS-Related Complex)
related: GRID (Gay-Related Immune Deficiency)
replaces: kaposisSarcoma
issued: 2019-05-14
modified: 2025-02-23
type: Concept
in scheme: v3
change note: Version 4.1.0

Katoey
alternative label: Ladyboy
alternative label: Kathoey @tha
comment: In Thailand, this term refers to a range of people of non-normative gender expressions, including intersex people, transgender women, and effeminate gay men. Some regard this term as outdated and offensive, while others self-identify with it. Only use to describe people who self-identify as katoey.
comment: En Tailandia, este término se refiere a un espectro de personas con expresiones de género no normativas, incluyendo a personas intersex, mujeres transgénero y hombres gay afeminados. Algunas personas consideran este término como anticuado y ofensivo, mientras que otras se autoidentifican con él. Utilícese únicamente para describir a las personas que se autoidentifiquen como katoey. @es
broader: Non-Euro-American gender and sexual identities
broader: Sexual minorities
related: Dee
related: Tom
has top concept: Gender
replaces: katoey
issued: 2019-05-14
modified: 2025-02-23
type: Concept
in scheme: v3
change note: Version 4.1.0

Khusra
comment: A term used in Pakistan and Northern India to describe third-gender people, typically people assigned male at birth who identify as female.
comment: Término utilizado en Pakistán y el norte de la India para describir a personas del tercer género, normalmente personas asignadas al sexo masculino al nacer y que se autoidentifican como mujeres. @es
broader: Non-Euro-American gender and sexual identities
related: Hijras
has top concept: Gender
replaces: khusra
issued: 2019-05-14
modified: 2025-02-23
type: Concept
in scheme: v3
change note: Version 4.1.0

Khwaja sira
preferred label: Khawaja sara
alternative label: Khwaja sara
alternative label: Khawaja sira
comment: An umbrella term used in Pakistan and South Asia to describe people assigned male at birth who identify as women, intersex, or third gender.
comment: Término del urdu utilizado en el sudeste de Asia para describir a personas transgénero. @es
broader: Non-Euro-American gender and sexual identities
has top concept: Gender
replaces: khawajaSara
issued: 2019-05-14
modified: 2025-02-23
type: Concept
in scheme: v3
change note: Version 4.1.0

Kinnar
comment: A variant term for hijra used in northern India.
comment: Variante del término "hijra" utilizado en el norte de India. @es
broader: Non-Euro-American gender and sexual identities
related: Hijras
has top concept: Gender
replaces: kinnar
issued: 2019-05-14
modified: 2025-02-23
type: Concept
in scheme: v3
change note: Version 4.1.0

Kissing
preferred label: Besar @es
alternative label: Besarse @es
comment: Touching or pressing one's lips to another person or an object to communicate a greeting, affection, reverence, love, or sexual desire.
comment: Tocar o presionar los labios contra otra persona o un objeto para comunicar un saludo, afecto, reverencia, amor o deseo sexual. @es
broader: Oral sex
broader: Physical affection
broader: Sex (Act)
broader: Sexual practices
has top concept: Sex (Act)
replaces: kissing
issued: 2019-05-14
modified: 2025-02-23
type: Concept
in scheme: v3
change note: Version 4.1.0

Klinefelter syndrome
preferred label: Síndrome de Klinefelter @es
alternative label: 47XXY
comment: People with Klinefelter syndrome develop with an extra copy of the X chromosome, resulting in a 47XXY pattern (instead of the typical 46XY). These individuals might have smaller-than-typical testes that produce lower amounts of testosterone and/or sperm, and they may start puberty later than typical (or may not go through puberty without hormone therapy). They may grow taller than usual, may develop breast tissue, and often experience infertility. This variation often does not cause obvious physical differences, and many people do not realize they have it.
comment: Las personas con síndrome de Klinefelter se desarrollan con una copia adicional del cromosoma X, lo que da como resultado un patrón 47XXY (en lugar del típico 46XY). Estas personas pueden tener testículos más pequeños de lo típico que producen menores cantidades de testosterona y/o esperma, y ​​pueden comenzar la pubertad más tarde de lo normal (o pueden no atravesar la pubertad sin terapia hormonal). Pueden crecer más de lo habitual, desarrollar tejido mamario y, a menudo, experimentar infertilidad. Esta variación a menudo no causa diferencias físicas obvias y muchas personas no se dan cuenta de que la tienen. @es
broader: Intersex variations
has top concept: Sex (Body)
replaces: klinefelterSyndrome
issued: 2019-05-14
modified: 2025-02-23
type: Concept
in scheme: v3
change note: Version 4.1.0

Köçek
comment: Turkish term for male dancers who crossdress in feminine attire for entertainment purposes.
comment: Término turco para los bailarines que se visten con atuendos femeninos con fines de entretenimiento. @es
broader: Non-Euro-American gender and sexual identities
has top concept: Gender
replaces: köçek
issued: 2019-05-14
modified: 2025-02-23
type: Concept
in scheme: v3
change note: Version 4.1.0

Kothis
comment: In South Asia, this term is used to describe people who are assigned male at birth who exhibit feminine characteristics. Please note that not all kothis identify as hijra or transgender.
comment: En el sur de Asia, este término se utiliza para describir a las personas asignadas al sexo masculino al nacer que presentan características femeninas. No todas las kothis se autoidentifican como hijra o transgénero. @es
broader: Non-Euro-American gender and sexual identities
related: Hijras
has top concept: Gender
replaces: kothi
issued: 2019-05-14
modified: 2025-02-23
type: Concept
in scheme: v3
change note: Version 4.1.0

Khteuy
alternative label: Kteuy @km
comment: Khmer term for third sex people. Can be considered outdated and offensive.
comment: Término del khmer para personas del tercer sexo. Puede ser considerado anticuado y ofensivo. @es
broader: Non-Euro-American gender and sexual identities
broader: Slurs
related: Sak veng
related: Srey sros
has top concept: Gender
replaces: kteuy
issued: 2019-05-14
modified: 2025-02-23
type: Concept
in scheme: v3
change note: Version 4.1.0

Labrys
comment: Symbol used to represent lesbianism and feminism.
comment: Símbolo utilizado para representar el lesbianismo y el feminismo. @es
broader: LGBTQ+ symbols
has top concept: LGBTQ+ symbols
replaces: labrys
issued: 2019-05-14
modified: 2025-02-23
type: Concept
in scheme: v3
change note: Version 4.1.0

Lakin-on
comment: Cebuano term for women who are attracted to women and take on male personas and cultural work.
comment: Término cebuano para mujeres que se sienten atraídas por mujeres, y asumen el personaje y el trabajo cultural masculinos. @es
broader: Non-Euro-American gender and sexual identities
has top concept: Gender
replaces: lakinOn
issued: 2019-05-14
modified: 2025-02-23
type: Concept
in scheme: v3
change note: Version 4.1.0

Lambda
comment: Symbol for lesbian and gay rights.
comment: Símbolo de los derechos de lesbianas y hombres gay. @es
broader: LGBTQ+ symbols
has top concept: LGBTQ+ symbols
replaces: lambda
issued: 2019-05-14
modified: 2025-02-23
type: Concept
in scheme: v3
change note: Version 4.1.0

Latent homosexuality
preferred label: Homosexualidad latente @es
comment: Term coined by Sigmund Freud to describe erotic attraction towards members of the same sex or gender that is not (and may never be) consciously experienced or expressed openly.
comment: Término acuñado por Sigmund Freud para describir la atracción erótica hacia miembros del mismo sexo o género que no se experimenta (y puede que nunca se experimente) conscientemente ni se expresa abiertamente. @es
related: Denial of sexual orientation
related: Internalized homophobia
replaces: latentHomosexuality
issued: 2019-05-14
modified: 2025-02-23
type: Concept
in scheme: v3
change note: Version 4.1.0

Latex gloves
preferred label: Guantes de latex @es
comment: Protective coverings for the hands made from latex, a thin-plastic like material; often used as a barrier to protect against STIs while engaging in safer sex practices.
comment: Cubiertas protectoras de látex, un material fino parecido al plástico, para las manos; a menudo se utilizan como barrera para protegerse de las ITS mientras se practican relaciones sexuales seguras. @es
broader: Sex accessories
broader: Gloves (Erotic)
related: Safer sex
has top concept: Sex accessories
replaces: latexGloves
issued: 2019-05-14
modified: 2025-02-23
type: Concept
in scheme: v3
change note: Version 4.1.0

Lavender Scare
preferred label: Terror lila @es
alternative label: Lavender scare @es
alternative label: Terror lavanda @es
comment: Term used to describe the mid-20th century purge of lesbians and gay men in the U.S. government as a result of moral panic incited by Joseph McCarthy and others.
comment: Término utilizado para describir la purga de lesbianas y hombres gay en el gobierno estadounidense a mediados del siglo XX como resultado del pánico moral incitado por Joseph McCarthy y otras personas. @es
related: LGBTQ+ discrimination
related: LGBTQ+ persecutions
replaces: lavenderScare
issued: 2019-05-14
modified: 2025-02-23
type: Concept
in scheme: v3
change note: Version 4.1.0

Law
preferred label: Derecho @es
alternative label: Legislation
alternative label: Legislación @es
alternative label: Ley @es
alternative label: Leyes @es
comment: System of rules or conduct recognized and legally enforced within a country or community.
comment: Sistema de reglas o conductas reconocidas y legalmente aplicadas dentro de un país o una comunidad. @es
narrower: Anti-discrimination law
narrower: Court orders
narrower: Criminal law
narrower: LGBTQ+ personal and family law
narrower: Bathroom bans
narrower: LGBTQ+ victims' rights
narrower: Anti-transgender legislation
narrower: Sex work legislation
related: Legal status
related: LGBTQ+ lobbying
related: Undocumented LGBTQ+ residents
replaces: law
issued: 2019-05-14
modified: 2026-02-24
type: Concept
in scheme: v3
change note: Version 4.1.0

LBT
comment: Acronym used to describe lesbians, bisexuals, and transgender people as a group.
comment: Acrónimo utilizado para describir a lesbianas, personas bisexuales y personas transgénero como grupo. @es
broader: LGBT
has top concept: LGBTI
replaces: LBT
issued: 2019-05-14
modified: 2025-02-23
type: Concept
in scheme: v3
change note: Version 4.1.0

Leashes
preferred label: Correas @es
comment: A length of rope or similar material used to control an individual, often to increase sexual arousal.
comment: Un trozo de cuerda o material similar utilizado para controlar a una persona, a menudo para aumentar la excitación sexual. @es
broader: Sex accessories
related: Restraints
has top concept: Sex accessories
replaces: leashes
issued: 2019-05-14
modified: 2025-02-23
type: Concept
in scheme: v3
change note: Version 4.1.0

Leather community
preferred label: Comunidad leather @es
alternative label: Leather scene
alternative label: Leather lifestyle
alternative label: Leather
comment: An LGBTQ+ subculture that celebrates sexual freedom, kinks and fetishes with its own fashions (especially leather garments), clubs, and events.
comment: Subcultura LGBTQ+ que celebra la libertad sexual, los kinks y los fetiches con su propia moda (especialmente prendas de cuero), clubes y eventos. @es
broader: LGBTQ+ communities
broader: Subcultures
narrower: Bootblacking
narrower: Leather daddies
narrower: Leather families
narrower: Leather mommies
narrower: Leathermen
narrower: Leatherwomen
narrower: Pups (Roleplay)
narrower: Pup play
narrower: Leather people
narrower: Leatherboys
narrower: Leathergirls
related: Kink community
related: LGBTQ+ dominatrices
related: BDSM
related: LGBTQ+ motorcycle clubs
related: LGBTQ+ dominants
related: Rubber and latex community
related: LGBTQ+ submissives
related: Leather bars
related: Power exchange
related: Kink accessories
related: Leather fetish
related: Leather and kink conventions
related: Kinky people
related: Leather and kink clubs
related: Title contests
related: Anti-kink discrimination
has top concept: LGBTQ+ communities
replaces: leatherCommunity
issued: 2019-05-14
modified: 2025-02-23
type: Concept
in scheme: v3
change note: Version 4.1.0

Leather daddies
preferred label: Papis leather @es
comment: People who participate in leather communities and identify as leather daddies.
comment: Personas que participan en comunidades leather y se autoidentifican como papis leather. @es
broader: Leather community
broader: Leather people
related: Leather families
related: Leather mommies
related: Leathermen
related: Leatherwomen
related: Leatherboys
related: Leathergirls
has top concept: LGBTQ+ communities
replaces: leatherDaddies
issued: 2019-05-14
modified: 2025-02-23
type: Concept
in scheme: v3
change note: Version 4.1.0

Leather families
preferred label: Familias leather @es
alternative label: Leather household
comment: Multiple people who participate in leather communities and identify as a leather family.
comment: Múltiples personas que participan en comunidades de cuero y se autoidentifican como una familia leather. @es
broader: Leather community
broader: Leather people
related: Leather daddies
related: Leather mommies
related: Leathermen
related: Leatherwomen
related: Leatherboys
related: Leathergirls
has top concept: LGBTQ+ communities
replaces: leatherFamilies
issued: 2019-05-14
modified: 2025-02-23
type: Concept
in scheme: v3
change note: Version 4.1.0

Leather mommies
preferred label: Mamis leather @es
comment: People who participate in leather communities and identify as leather mommies.
comment: Mujeres mayores, a menudo lesbianas, que forman parte de la comunidad de cuero; típicamente utilizado para describir a las dominatrices. @es
broader: Leather community
broader: Leather people
related: Leather daddies
related: Leather families
related: Leathermen
related: Leatherwomen
related: Leatherboys
related: Leathergirls
has top concept: LGBTQ+ communities
replaces: leatherMommies
issued: 2019-05-14
modified: 2025-02-23
type: Concept
in scheme: v3
change note: Version 4.1.0

Leathermen
preferred label: Hombres leather @es
comment: People who participate in leather communities and identify as leathermen.
comment: Hombres que tienen fetiches o participan en actividades fetichistas relacionadas con el cuero y pertenecen a la comunidad de cuero; frecuentemente asociados a las subculturas LGBTQ+. @es
broader: Leather community
broader: Leather people
related: Leather daddies
related: Leather families
related: Leather mommies
related: Leatherwomen
related: Leatherboys
related: Leathergirls
has top concept: LGBTQ+ communities
replaces: leathermen
issued: 2019-05-14
modified: 2025-02-23
type: Concept
in scheme: v3
change note: Version 4.1.0

Leatherwomen
preferred label: Mujeres leather @es
alternative label: Leatherdykes
comment: People who participate in leather communities and identify as leatherwomen.
comment: Mujeres que tienen fetiches o participan en actividades fetichistas relacionadas con el cuero y pertenecen a la comunidad de cuero; frecuentemente asociadas a subculturas LGBTQ+. @es
broader: Leather community
broader: Leather people
related: Leather daddies
related: Leather families
related: Leather mommies
related: Leathermen
related: Leatherboys
related: Leathergirls
has top concept: LGBTQ+ communities
replaces: leatherwomen
issued: 2019-05-14
modified: 2025-02-23
type: Concept
in scheme: v3
change note: Version 4.1.0

Legal name
preferred label: Nombre legal @es
comment: Use in reference to laws and regulations concerning the name assigned to an individual at birth.
comment: Utilícese en referencia a las leyes y regulaciones relativas al nombre asignado a una persona al nacer. @es
broader: LGBTQ+ personal and family law
related: Birth certificates
related: Legal name change
related: Driver's licenses
related: Official documentation
related: Passports
related: Gender marker change bans
has top concept: Law
replaces: legalName
issued: 2019-05-14
modified: 2025-02-23
type: Concept
in scheme: v3
change note: Version 4.1.0

Legal status
preferred label: Estatus legal @es
alternative label: Status legal @es
comment: The status or standing of an individual or thing within a certain legal jurisdiction, including the individual's or thing's legal rights and privileges; typically used in reference to citizenship or marriage.
comment: El estatus o la posición de una persona o cosa dentro de una determinada jurisdicción legal, incluidos los derechos y privilegios legales de la persona o cosa; normalmente se utiliza en referencia a la ciudadanía o al matrimonio. @es
narrower: LGBTQ+ immigration rights
narrower: Official documentation
narrower: Parental rights
narrower: Partner rights
narrower: LGBTQ+ people in the military
related: Civil unions
related: Detention of LGBTQ+ people
related: Law
related: LGBTQ+ refugees
related: Marital status
related: Undocumented LGBTQ+ residents
replaces: legalStatus
issued: 2019-05-14
modified: 2025-02-23
type: Concept
in scheme: v3
change note: Version 4.1.0

Lesbian activism
preferred label: Activismo lésbico @es
comment: Direct action and organizing to achieve political or social change and acceptance for lesbians.
comment: Acción directa y organización para lograr cambio político o social y la aceptación de las lesbianas. @es
broader: LGBTQ+ activism
related: Lesbian political activists
has top concept: LGBTQ+ activism
replaces: lesbianActivism
issued: 2019-05-14
modified: 2025-02-23
type: Concept
in scheme: v3
change note: Version 4.1.0

African American lesbians
preferred label: Lesbianas afroamericanas @es
alternative label: Lesbian African Americans
alternative label: Afroamericanas lesbianas @es
comment: Lesbians of African descent born in the United States or lesbians born in African countries who live in or have a strong connection to the United States. Use for individuals who self-identity as African American. Follow the individual’s preference for African American or Black whenever possible.
comment: Lesbianas de ascendencia africana nacidas en los Estados Unidos o nacidas en países africanos que viven o tienen una fuerte conexión con los Estados Unidos. Utilícese para personas que se autoidentifiquen como afroamericanas. @es
broader: African American LGBTQ+ people
has top concept: LGBTQ+ people
replaces: lesbianAfricanAmericans
issued: 2019-05-14
modified: 2025-02-23
type: Concept
in scheme: v3
change note: Version 4.1.0

Afro-Canadian lesbians
preferred label: Lesbianas afrocanadienses @es
alternative label: Lesbian Afro-Canadians
alternative label: Afrocanadienses lesbianas @es
comment: Lesbians of African descent born in Canada or lesbians born in African countries who live in or have a strong connection to Canada. Use for individuals who self-identify as Afro-Canadian.
comment: Lesbianas de ascendencia africana nacidas en Canadá o lesbianas nacidas en países africanos que viven o tienen una conexión fuerte con Canadá. Utilícese para personas que se identifiquen como afrocanadienses. @es
broader: Afro-Canadian LGBTQ+ people
has top concept: LGBTQ+ people
replaces: lesbianAfroCanadians
issued: 2019-05-14
modified: 2025-02-23
type: Concept
in scheme: v3
change note: Version 4.1.0

Afro-Caribbean lesbians
preferred label: Lesbianas afrocaribeñas @es
alternative label: Lesbian Afro-Caribbeans
alternative label: Afrocaribeñas lesbianas @es
comment: Lesbians of African descent born in the Caribbean or lesbians born in African countries who live in or have a strong connection to the Caribbean. Only use for individuals who self-identify as Afro-Caribbean.
comment: Lesbianas afrodescendientes nacidas en el Caribe o lesbianas nacidas en países africanos que viven o tienen una conexión fuerte con el Caribe. Utilícese únicamente para personas que se identifiquen como afrocaribeñas. @es
broader: Afro-Caribbean LGBTQ+ people
has top concept: LGBTQ+ people
replaces: lesbianAfroCaribbeans
issued: 2019-05-14
modified: 2025-02-23
type: Concept
in scheme: v3
change note: Version 4.1.0

Afro-European lesbians
preferred label: Lesbianas afroeuropeas @es
alternative label: Lesbian Afro-Europeans
alternative label: Afroeuropeas lesbianas @es
comment: Lesbians of African descent born in European countries or lesbians born in African countries who live in or have a strong connection to Europe. Only use for individuals who self-identify as Afro-European.
comment: Lesbianas de ascendencia africana nacidas en países europeos o lesbianas nacidas en países africanos que viven o tienen una conexión fuerte con Europa. Utilícese únicamente para personas que se identifiquen como afroeuropeas. @es
broader: Afro-European LGBTQ+ people
has top concept: LGBTQ+ people
replaces: lesbianAfroEuropeans
issued: 2019-05-14
modified: 2025-02-23
type: Concept
in scheme: v3
change note: Version 4.1.0

Afro-Latin American lesbians
preferred label: Lesbianas afrolatinoamericanas @es
alternative label: Lesbian Afro-Latin Americans
alternative label: Afrolatinoamericanas lesbianas @es
comment: Lesbians of African descent born in Latin American countries or lesbians born in African countries who live in or have a strong connection to Latin America. Only use for individuals who self-identify as Afro-Latin American.
comment: Lesbianas afrodescendientes nacidas en países latinoamericanos o lesbianas nacidas en países africanos que viven o tienen una conexión fuerte con América Latina. Utilícese únicamente para personas que se identifiquen como afrolatinoamericanas. @es
broader: Afro-Latin American LGBTQ+ people
has top concept: LGBTQ+ people
replaces: lesbianAfroLatinAmericans
issued: 2019-05-14
modified: 2025-02-23
type: Concept
in scheme: v3
change note: Version 4.1.0

Lesbian archives
preferred label: Archivos lésbicos @es
comment: Collections of records and materials relating to lesbians or lesbian communities; can include a variety of organizations and institutions from community to government archives.
comment: Colecciones de registros y materiales relacionados con lesbianas o comunidades de lesbianas; pueden incluir una variedad de organizaciones e instituciones, desde archivos comunitarios hasta gubernamentales. @es
broader: LGBTQ+ archives
has top concept: LGBTQ+ cultural heritage institutions
replaces: lesbianArchives
issued: 2019-05-14
modified: 2025-02-23
type: Concept
in scheme: v3
change note: Version 4.1.0

Lesbian artists
preferred label: Artistas lesbianas @es
comment: Lesbians who practice any of various creative arts.
comment: Artistas conocidas como lesbianas. @es
broader: LGBTQ+ artists
has top concept: LGBTQ+ people
replaces: lesbianArtists
issued: 2019-05-14
modified: 2025-02-23
type: Concept
in scheme: v3
change note: Version 4.1.0

Asian American lesbians
preferred label: Lesbianas asiático-americanas @es
alternative label: Lesbian Asian Americans
alternative label: Asiático-americanas lesbianas @es
comment: Lesbians of Asian heritage or descent born in the United States or born in Asian countries who live in or have a strong connection to the United States. Only use for individuals who self-identify as Asian American.
comment: Lesbianas de herencia o ascendencia asiática nacidas en Estados Unidos o lesbianas nacidas en países asiáticos que viven en o tienen una conexión fuerte con los Estados Unidos. Utilícese para personas que se autoidentifiquen como asiático-americanas. @es
broader: Asian American LGBTQ+ people
broader: Asian lesbians
has top concept: LGBTQ+ people
replaces: lesbianAsianAmericans
issued: 2019-05-14
modified: 2025-02-23
type: Concept
in scheme: v3
change note: Version 4.1.0

Asian lesbians
preferred label: Lesbianas asiáticas @es
alternative label: Lesbian Asians
alternative label: Asiáticas lesbianas @es
comment: Lesbians of Asian heritage or descent, living in Asia or part of the Asian diaspora. Only use for people who self-identify as Asian.
comment: Lesbianas de herencia o ascendencia asiática, que viven en Asia o forman parte de la diáspora asiática. Utilícese únicamente para personas que se autoidentifiquen como asiáticas." @es
broader: Asian LGBTQ+ people
narrower: Asian American lesbians
has top concept: LGBTQ+ people
replaces: lesbianAsians
issued: 2019-05-14
modified: 2025-02-23
type: Concept
in scheme: v3
change note: Version 4.1.0

Lesbian atheists
preferred label: Ateas lesbianas @es
comment: Lesbians who are atheists.
comment: Lesbianas que son ateas. @es
broader: LGBTQ+ atheists
has top concept: LGBTQ+ people
replaces: lesbianAtheists
issued: 2019-05-14
modified: 2025-02-23
type: Concept
in scheme: v3
change note: Version 4.1.0

Lesbian bars
preferred label: Bares lésbicos @es
comment: Drinking establishments that primarily cater to lesbians.
comment: Establecimientos de bebidas que atienden principalmente a lesbianas. @es
broader: LGBTQ+ bars
narrower: Dyke bars
related: Lesbian community
related: LGBTQ+ pubs
has top concept: LGBTQ+ meeting places
replaces: lesbianBars
issued: 2019-05-14
modified: 2025-02-23
type: Concept
in scheme: v3
change note: Version 4.1.0

Lesbian beaches
preferred label: Playas lésbicas @es
comment: Beaches set aside for use by lesbians or beaches known to be frequented by lesbians.
comment: Playas reservadas para el uso de lesbianas o playas conocidas por ser frecuentadas por lesbianas. @es
broader: LGBTQ+ beaches
has top concept: LGBTQ+ meeting places
replaces: lesbianBeaches
issued: 2019-05-14
modified: 2025-02-23
type: Concept
in scheme: v3
change note: Version 4.1.0

Black lesbians
preferred label: Lesbianas negras @es
comment: Black people who are lesbians. Use only for individuals who self-identity as Black. Follow the individual’s preference for African American or Black whenever possible.
comment: Personas negras que son lesbianas. Utilícese únicamente para personas que seautoidentificancomo negras. Siga la preferencia del individuo para el uso de afroamericanos o negros siempre que sea posible. @es
broader: Black LGBTQ+ people
has top concept: LGBTQ+ people
replaces: lesbianBlackPeople
issued: 2019-05-14
modified: 2025-02-23
type: Concept
in scheme: v3
change note: Version 4.1.0

Lesbian bookshops
preferred label: Librerías lésbicas @es
comment: Bookshops that sell materials intended for use by lesbians or addressing topics related to lesbian communities.
comment: Librerías que venden materiales destinados a ser usado por lesbianas o que abordan temas relacionados con las comunidades lésbicas. @es
broader: LGBTQ+ bookshops
related: Women's bookshops
has top concept: LGBTQ+ bookshops
replaces: lesbianBookshops
issued: 2019-05-14
modified: 2025-02-23
type: Concept
in scheme: v3
change note: Version 4.1.0

Lesbian Buddhists
preferred label: Budistas lesbianas @es
alternative label: Lesbianas budistas @es
comment: Lesbians who are Buddhist.
comment: Lesbianas que son budistas. @es
broader: LGBTQ+ Buddhists
has top concept: LGBTQ+ African religions
replaces: lesbianBuddhists
issued: 2019-05-14
modified: 2025-02-23
type: Concept
in scheme: v3
change note: Version 4.1.0

Lesbian characters
preferred label: Personajes lesbianas @es
comment: Characters in creative works who are lesbians.
comment: Personajes de obras creativas que son lesbianas. @es
broader: LGBTQ+ characters
related: Lesbians
related: Lesbian youth
has top concept: LGBTQ+ characters
replaces: lesbianCharacters
issued: 2019-05-14
modified: 2025-02-23
type: Concept
in scheme: v3
change note: Version 4.1.0

Lesbian choruses
preferred label: Coros lésbicos @es
alternative label: Lesbian choirs
comment: Organized groups of lesbians who sing together.
comment: Grupos organizados de lesbianas que cantan juntas. @es
broader: Lesbian culture
broader: LGBTQ+ choruses
related: Gay choruses
has top concept: Subcultures
replaces: lesbianChoruses
issued: 2019-05-14
modified: 2025-02-23
type: Concept
in scheme: v3
change note: Version 4.1.0

Lesbian Christians
preferred label: Cristianas lesbianas @es
comment: Lesbians who are Christian.
comment: Lesbianas que son cristianas. @es
broader: LGBTQ+ Christians
has top concept: LGBTQ+ African religions
replaces: lesbianChristians
issued: 2019-05-14
modified: 2025-02-23
type: Concept
in scheme: v3
change note: Version 4.1.0

Lesbian clergy
preferred label: Clero lésbico @es
alternative label: Lesbian pastors
alternative label: Pastoras lesbianas @es
comment: Lesbians who are ordained for religious duties, particularly in the Christian Church.
comment: Lesbianas que son ordenadas para deberes religiosos, particularmente en la Iglesia cristiana. @es
broader: LGBTQ+ clergy
related: Bisexual clergy
related: Celibacy
related: Gay clergy
related: Queer clergy
related: Transgender clergy
has top concept: LGBTQ+ clergy
replaces: lesbianClergy
issued: 2019-05-14
modified: 2025-02-23
type: Concept
in scheme: v3
change note: Version 4.1.0

Lesbian community
preferred label: Comunidad lésbica @es
alternative label: Comunidad lesbiana @es
comment: Groups of people who share the experience of being lesbians.
comment: Grupos de personas que comparten la experiencia de ser lesbianas. @es
broader: LGBTQ+ communities
related: LGBT
related: Lesbian bars
related: Lesbian community centers
related: LGB
related: LGBTI
related: LGBTQ
related: LGBTQ+
related: LGBTQIA
related: 2SLGBTQ+
has top concept: LGBTQ+ communities
replaces: lesbianCommunity
issued: 2019-05-14
modified: 2025-02-23
type: Concept
in scheme: v3
change note: Version 4.1.0

Lesbian community centers
preferred label: Centros comunitarios lésbicos @es
preferred label: Lesbian community centres
comment: Spaces in which people from lesbian communities meet for social, education, recreational, or organizing activities.
comment: Espacios en los que personas de comunidades lésbicas se reúnen para realizar actividades sociales, educativas, recreativas u organizativas. @es
broader: LGBTQ+ community centers
related: Lesbian community
related: Lesbian movement
has top concept: LGBTQ+ centers
replaces: lesbianCommunityCentres
issued: 2019-05-14
modified: 2025-02-23
type: Concept
in scheme: v3
change note: Version 4.1.0

Lesbian couples
preferred label: Parejas lésbicas @es
alternative label: Parejas de lesbianas @es
comment: Partnerships in which both people are lesbians.
comment: Parejas en las que ambas personas son lesbianas. @es
broader: LGBTQ+ couples
related: Boston marriages
has top concept: Relationship satisfaction
replaces: lesbianCouples
issued: 2019-05-14
modified: 2025-02-23
type: Concept
in scheme: v3
change note: Version 4.1.0

Lesbian daughters
preferred label: Hijas lesbianas @es
comment: Daughters who identify as lesbians.
comment: Hijas que se identifican como lesbianas. @es
broader: LGBTQ+ daughters
has top concept: LGBTQ+ people
replaces: lesbianDaughters
issued: 2019-05-14
modified: 2025-02-23
type: Concept
in scheme: v3
change note: Version 4.1.0

Lesbian information centers
preferred label: Centros de información para lesbianas @es
preferred label: Lesbian information centres
comment: Institutions providing education, support, and information about lesbian identity and lesbian communities to lesbians.
comment: Instituciones que brindan educación, apoyo e información sobre la identidad lésbica y las comunidades lésbicas a las lesbianas. @es
broader: LGBTQ+ information centers
related: Lesbian movement
has top concept: LGBTQ+ centers
replaces: lesbianInformationCentres
issued: 2019-05-14
modified: 2025-02-23
type: Concept
in scheme: v3
change note: Version 4.1.0

Lesbian dominatrices
preferred label: Dominatrices lesbianas @es
comment: Women who take a dominant role in BDSM activities; use for dominatrices who identify as lesbians.
comment: Mujeres que desempeñan un papel dominante en las actividades de BDSM; utilícese para dominatrices que se autoidentifiquen como lesbianas. @es
broader: LGBTQ+ dominatrices
related: Bisexual dominatrices
related: Queer dominatrices
related: Transgender dominatrices
has top concept: Relationship minorities
replaces: lesbianDominatrices
issued: 2019-05-14
modified: 2025-02-23
type: Concept
in scheme: v3
change note: Version 4.1.0

Lesbian drama
preferred label: Drama lésbico @es
comment: Works of fiction written to be performed; use in reference to dramatic works focusing on lesbian characters or themes.
comment: Obras de ficción escritas para ser puestas en escena; utilícese en referencia a obras dramáticas que se centran en personajes o temas lésbicos. @es
broader: LGBTQ+ drama
related: Lesbian authors
has top concept: Subcultures
replaces: lesbianDrama
issued: 2019-05-14
modified: 2025-02-23
type: Concept
in scheme: v3
change note: Version 4.1.0

Lesbian families
preferred label: Familias lésbicas @es
alternative label: Familias lesbianas @es
comment: Families, whether biological, adoptive, or chosen, in which one or more individuals identify as lesbian.
comment: Familias, ya sean biológicas, adoptivas o elegidas, en las que una o más personas se autoidentifican como lesbianas. @es
broader: LGBTQ+ families
related: Children of lesbians
has top concept: LGBTQ+ families
replaces: lesbianFamilies
issued: 2019-05-14
modified: 2025-02-23
type: Concept
in scheme: v3
change note: Version 4.1.0

Lesbian feminism
preferred label: Feminismo lésbico @es
comment: A cultural movement and critical perspective that arose in the 1970s and 1980s primarily in North America and Western Europe as a result of dissatisfaction with the women's liberation movement and the gay liberation movement. Lesbian feminism encourages women to focus their efforts, activities, and relationships toward other women rather than men, often advocating for lesbianism as the logical result of feminism.
comment: Un movimiento cultural y una perspectiva crítica que surgió en las décadas de 1970 y 1980, principalmente en Norteamérica y Europa Occidental, como resultado de la insatisfacción con el movimiento de liberación de la mujer y el movimiento de liberación gay. El feminismo lésbico anima a las mujeres a centrar sus esfuerzos, actividades y relaciones en otras mujeres en lugar de en los hombres, a menudo, defendiendo el lesbianismo como el resultado lógico del feminismo. @es
broader: Feminism
related: Heterosexual feminism
related: Lesbian movement
related: Lesbian feminists
has top concept: Feminism
replaces: lesbianFeminism
issued: 2019-05-14
modified: 2025-02-23
type: Concept
in scheme: v3
change note: Version 4.1.0

Lesbian fiction
preferred label: Ficción lésbica @es
comment: Written works describing imagined events or people; use in reference to fictional works focusing on lesbian characters or themes.
comment: Obras escritas que describen eventos o personas imaginadas; utilícese en referencia a obras de ficción que se centran en personajes o temas lésbicos. @es
broader: LGBTQ+ fiction
broader: Femslash
related: Lesbian authors
related: Intersex fiction
related: Aromantic fiction
related: Asexual fiction
related: Lesbians in fandom
related: Yuri
related: Girls’ Love (Genre)
related: Baihe
has top concept: Subcultures
replaces: lesbianFiction
issued: 2019-05-14
modified: 2026-02-23
type: Concept
in scheme: v3
change note: Version 4.1.0

Lesbian girls
preferred label: Niñas lesbianas @es
comment: Girls (typically children younger than 18) who are lesbians.
comment: Niñas (normalmente menores de 18 años) que son lesbianas. @es
broader: Girls
broader: Lesbian youth
related: Lesbian children
has top concept: Family members
replaces: lesbianGirls
issued: 2019-05-14
modified: 2025-02-23
type: Concept
in scheme: v3
change note: Version 4.1.0

Lesbian identity
preferred label: Identidad lesbiana @es
alternative label: Identidad lésbica @es
comment: Term used to describe the sexual identity of women and femmes who are romantically and/or sexually attracted to other women and femmes. However, not all lesbians are women, and gender non-conforming people who belong to lesbian communities have often identified as lesbian.
comment: Término utilizado para describir la identidad sexual de mujeres y femmes que se sienten atraídas romántica y/o sexualmente por otras mujeres y femmes. Sin embargo, no todas las lesbianas son mujeres, y las personas disidentes de género que pertenecen a comunidades lésbicas a menudo se han identificado como lesbianas. @es
broader: Sexual identity
related: Lesbians
related: Lesbian youth
has top concept: Sexual identity
replaces: lesbianIdentity
issued: 2019-05-14
modified: 2025-02-23
type: Concept
in scheme: v3
change note: Version 4.1.0

Jewish lesbians
preferred label: Lesbianas judías @es
alternative label: Lesbian Jews
comment: Lesbians who are Jewish.
comment: Lesbianas que son judías. @es
broader: Jewish LGBTQ+ people
has top concept: LGBTQ+ people
replaces: lesbianJews
issued: 2019-05-14
modified: 2025-02-23
type: Concept
in scheme: v3
change note: Version 4.1.0

Lesbian land
preferred label: Tierra lesbiana @es
comment: Rural communities populated only by lesbians.
comment: Comunidades rurales habitadas únicamente por lesbianas. @es
broader: Lesbian separatism
related: Lesbian movement
has top concept: Lesbian separatism
replaces: lesbianLand
issued: 2019-05-14
modified: 2025-02-23
type: Concept
in scheme: v3
change note: Version 4.1.0

Latino/a/x lesbians
preferred label: Lesbianas Latinx @es
alternative label: Latina lesbians
alternative label: Latine lesbians
alternative label: Latino lesbians
alternative label: Latinx lesbians
alternative label: Lesbian Latinas
alternative label: Lesbian Latine
alternative label: Lesbian Latinos
comment: Latin American people who are lesbians; only use to describe individuals who self-identify as Latino, Latina, or Latinx. Do not conflate with Chicano/a/x or Hispanic.
comment: Personas latinoamericanas que son lesbianas; utilícese únicamente para describir a personas que se autoidentifican como latinos, latinas o latinxs. No debe confundirse con chicano/a/x o hispano/a/x. @es
broader: Latino/a/x LGBTQ+ people
has top concept: LGBTQ+ people
replaces: lesbianLatinas
issued: 2019-05-14
modified: 2025-02-23
type: Concept
in scheme: v3
change note: Version 4.1.0

Lesbian liberation
preferred label: Liberación lesbiana @es
alternative label: Liberación lésbica @es
comment: Liberation movement that began in the 1970s to direct more attention to lesbian and feminist issues within the larger gay liberation movement and in national discourse.
comment: Movimiento de liberación que comenzó en la década de 1970 para dirigir más atención hacia las cuestiones lésbicas y feministas dentro del movimiento de liberación gay más amplio y en el discurso nacional. @es
broader: LGBTQ+ social processes
related: Gay liberation
has top concept: LGBTQ+ social processes
replaces: lesbianLiberation
issued: 2019-05-14
modified: 2025-02-23
type: Concept
in scheme: v3
change note: Version 4.1.0

Lesbian libraries
preferred label: Bibliotecas lesbianas @es
alternative label: Bibliotecas lésbicas @es
comment: Libraries that hold materials primarily pertaining to lesbians or intended for use by lesbians.
comment: Bibliotecas que contienen materiales relacionados principalmente con lesbianas o destinados a ser utilizados por lesbianas. @es
broader: LGBTQ+ libraries
broader: Women's libraries
has top concept: LGBTQ+ cultural heritage institutions
replaces: lesbianLibraries
issued: 2019-05-14
modified: 2025-02-23
type: Concept
in scheme: v3
change note: Version 4.1.0

Lesbian literature
preferred label: Literatura lésbica @es
alternative label: Literatura lesbiana @es
comment: Written literary works about lesbian characters or themes.
comment: Obras literarias escritas sobre personajes o temas lésbicos. @es
broader: LGBTQ+ literature
related: Lesbian authors
related: Lesbians in literature
has top concept: Subcultures
replaces: lesbianLiterature
issued: 2019-05-14
modified: 2025-04-23
type: Concept
in scheme: v3
change note: Version 4.1.0

Lesbian mistresses
preferred label: Amas lesbianas @es
alternative label: Lesbianas amas @es
comment: Lesbians who are part of the BDSM scene and assume the mistress role in sexual relationships with a mistress/submissive dynamic.
comment: Lesbianas que forman parte de la escena BDSM y asumen el rol de ama en las relaciones sexuales con una dinámica ama/esclava. @es
broader: LGBTQ+ mistresses (BDSM culture)
related: Bisexual mistresses
related: Queer mistresses
related: Transgender mistresses
has top concept: Sexual identity
replaces: lesbianMistresses
issued: 2019-05-14
modified: 2026-02-24
type: Concept
in scheme: v3
change note: Version 4.1.0

Lesbian parents
preferred label: Padres lesbianos @es
comment: Lesbians who are parents.
comment: Lesbianas que son padres. @es
broader: LGBTQ+ parents
related: Children of lesbians
related: Mothers
related: LGBTQ+ children of LGBTQ+ parents
has top concept: LGBTQ+ families
replaces: lesbianParents
issued: 2019-05-14
modified: 2025-02-23
type: Concept
in scheme: v3
change note: Version 4.1.0

Lesbian movement
preferred label: Movimiento lésbico @es
alternative label: Lesbian organisations
alternative label: Lesbian organizations
alternative label: Organizaciones lesbianas @es
alternative label: Organizaciones lésbicas|| @es
comment: Umbrella term for activism focused on the rights of lesbians and issues faced by lesbian communities.
comment: Término general para el activismo centrado en los derechos de las lesbianas y los problemas que enfrentan las comunidades de lesbianas. @es
broader: LGBTQ+ movement
narrower: Lesbian trade union groups
related: Women's movement
related: Gay liberation
related: Lesbian community centers
related: Lesbian information centers
related: Lesbian feminism
related: Lesbian land
related: Lesbian nation
related: Lesbian press
related: Lesbian radio
related: Lesbian television
related: Lesbian feminists
related: Lesbian demonstrations
has top concept: Social movements
replaces: lesbianMovement
issued: 2019-05-14
modified: 2025-04-17
type: Concept
in scheme: v3
change note: Version 4.1.0

Lesbian museums
preferred label: Museos de lesbianas @es
alternative label: Museos lésbicos @es
comment: Institutions dedicated to the storage, exhibition, conservation, and preservation of materials relating to lesbians and lesbian history.
comment: Instituciones dedicadas al almacenamiento, la exhibición, la conservación y la preservación de materiales relacionados con las lesbianas y la historia lésbica. @es
broader: LGBTQ+ museums
has top concept: LGBTQ+ cultural heritage institutions
replaces: lesbianMuseums
issued: 2019-05-14
modified: 2025-02-23
type: Concept
in scheme: v3
change note: Version 4.1.0

Women's music
preferred label: Música para mujeres @es
alternative label: Lesbian music
alternative label: Wimmin's music
alternative label: Women-identified music
alternative label: Womyn's music
alternative label: Música lesbica @es
alternative label: Música de mujeres || @es
comment: Genre of music by women, for women, and about women that emerged in the 1960s and 1970s as a form of musical expression of the second-wave feminist movement.
comment: Género de música hecha por mujeres, para mujeres y sobre mujeres que surgió en las décadas de 1960 y 1970 como forma de expresión musical del movimiento feminista de la segunda ola. @es
broader: Lesbian culture
related: Women's music festivals
related: Lesbian operas
has top concept: Subcultures
replaces: womensMusic
issued: 2019-05-14
modified: 2025-02-23
type: Concept
in scheme: v3
change note: Version 4.1.0

Lesbian Muslims
preferred label: Musulmanas lesbianas @es
comment: Lesbians who are Muslim.
comment: Lesbianas que son musulmanas. @es
broader: LGBTQ+ Muslims
has top concept: LGBTQ+ African religions
replaces: lesbianMuslims
issued: 2019-05-14
modified: 2025-02-23
type: Concept
in scheme: v3
change note: Version 4.1.0

Lesbian nation
preferred label: Nación lésbica @es
alternative label: Nación lesbiana @es
comment: An imagined autonomous, international lesbian community that is set apart from men.
comment: Una comunidad imaginada lésbica, internacional y autónoma, separada de los hombres. @es
broader: Lesbian separatism
related: Lesbian movement
has top concept: Lesbian separatism
replaces: lesbianNation
issued: 2019-05-14
modified: 2025-02-23
type: Concept
in scheme: v3
change note: Version 4.1.0

Native American lesbians
preferred label: Lesbianas nativoamericanas @es
alternative label: American Indian lesbians
alternative label: Lesbian Native Americans
comment: People who are part of the Native peoples of the continental United States and Canada (excluding Inuit people) and self-identity as lesbians. Use more specific terms when available.
comment: Lesbianas que son nativoamericanas o parte de los pueblos indígenas de Norteamérica; utilícese únicamente para personas que se autoidentifiquen como nativoamericanas y lesbianas. @es
broader: Native American LGBTQ+ people
has top concept: LGBTQ+ people
replaces: lesbianNativeAmericans
issued: 2019-05-14
modified: 2025-02-23
type: Concept
in scheme: v3
change note: Version 4.1.0

Lesbian newsletters
preferred label: Boletines lésbicos @es
comment: Serialized print or digital periodicals created by or for lesbians, often with the purpose of sharing news and information related to lesbian communities and lesbian issues.
comment: Publicaciones impresas o digitales serializadas sobre lesbianas o temas lésbicos (y generalmente producidas por lesbianas u organizaciones de lesbianas) que contienen noticias, artículos, columnas, correspondencia y anuncios. @es
broader: Lesbian press
broader: LGBTQ+ newsletters
related: Lesbian newspapers
has top concept: LGBTQ+ press
replaces: lesbianNewsletters
issued: 2019-05-14
modified: 2025-02-23
type: Concept
in scheme: v3
change note: Version 4.1.0

Lesbian newspapers
preferred label: Periódicos lésbicos @es
alternative label: Periódicos de lesbianas @es
alternative label: Diarios lésbicos @es
comment: Serialized print or digital publications about lesbians or lesbian issues (and typically produced by lesbians or lesbian organizations) that contain news, articles, columns, correspondence, and advertisements.
comment: Publicaciones periódicas impresas o digitales serializadas creadas por o para lesbianas, a menudo con el propósito de compartir noticias e información relacionadas con cuestiones y comunidades lésbicas. @es
broader: Lesbian press
broader: LGBTQ+ newspapers
related: Lesbian newsletters
has top concept: LGBTQ+ press
replaces: lesbianNewspapers
issued: 2019-05-14
modified: 2025-02-23
type: Concept
in scheme: v3
change note: Version 4.1.0

Lesbian Pagans
preferred label: Paganas lesbianas @es
alternative label: Lesbianas paganas @es
comment: Lesbians who are members of polytheistic religions or other religions outside of the dominant culture that typically incorporate nature worship and/or the sacred feminine, such as Wicca, Druidry, Heathenry, etc. Use to describe lesbians who self-identify as Pagan.
comment: Lesbianas que son miembros de religiones politeístas u otras religiones fuera de la cultura dominante que típicamente incorporan el culto a la naturaleza y/o lo sagrado femenino, como la Wicca, el druidismo, el paganismo, etc. Utilícese para describir a lesbianas que se autoidentifiquen como paganas. @es
broader: LGBTQ+ Pagans
related: Lesbian witches
has top concept: LGBTQ+ African religions
replaces: lesbianPagans
issued: 2019-05-14
modified: 2025-02-23
type: Concept
in scheme: v3
change note: Version 4.1.0

Lesbian poetry
preferred label: Poesía lésbica @es
alternative label: Poesía lesbiana @es
comment: Literary work, typically written in verse, that focuses on lesbian characters, lesbian themes, or lesbian identity.
comment: Obras literarias, normalmente escritas en verso, que se centran en personajes lésbicos, temas lésbicos o identidad lésbica. @es
broader: LGBTQ+ poetry
related: Lesbian authors
has top concept: Subcultures
replaces: lesbianPoetry
issued: 2019-05-14
modified: 2025-02-23
type: Concept
in scheme: v3
change note: Version 4.1.0

Lesbian political activists
preferred label: Activistas políticas lesbianas @es
alternative label: Activistas politicas lésbicas @es
comment: Lesbians working to bring about political or social change through public organizing.
comment: Lesbianas que trabajan para lograr cambios políticos o sociales a través de la organización pública. @es
broader: LGBTQ+ political activists
related: Lesbian activism
has top concept: LGBTQ+ people
replaces: lesbianPoliticalActivists
issued: 2019-05-14
modified: 2025-02-23
type: Concept
in scheme: v3
change note: Version 4.1.0

Lesbian political groups
preferred label: Grupos politicos lésbicos @es
comment: Organized groups centered on political change and action for lesbian rights; may include advocating for lesbianism as a political and feminist choice against sexism.
comment: Grupos organizados centrados en el cambio político y la acción por los derechos de las lesbianas; puede incluir la defensa del lesbianismo como una opción política y feminista contra el sexismo. @es
broader: LGBTQ+ political groups
has top concept: LGBTQ+ political groups
replaces: lesbianPoliticalGroups
issued: 2019-05-14
modified: 2025-02-23
type: Concept
in scheme: v3
change note: Version 4.1.0

Lesbian porn films
preferred label: Películas porno lésbicas @es
alternative label: Películas pornografícas lésbicas @es
comment: Erotic or sexually explicit films featuring lesbians.
comment: Películas eróticas o sexualmente explícitas protagonizadas por lesbianas. @es
broader: LGBTQ+ porn films
broader: Lesbian films
broader: Lesbian erotic art
related: Lesbian erotic films
has top concept: Subcultures
replaces: lesbianPornFilms
issued: 2019-05-14
modified: 2025-02-23
type: Concept
in scheme: v3
change note: Version 4.1.0

Lesbian press
preferred label: Prensa lésbica @es
comment: Newspapers, magazines, or other publishing outlets aimed at lesbian audiences and/or operated by lesbians.
comment: Periódicos, revistas u otros medios editoriales dirigidos a audiencias lésbicas y/o operados por lesbianas. @es
broader: LGBTQ+ press
narrower: Lesbian newsletters
narrower: Lesbian newspapers
narrower: Lesbian zines
related: Lesbian movement
related: LGBTQ+ magazines
has top concept: LGBTQ+ press
replaces: lesbianPress
issued: 2019-05-14
modified: 2026-02-24
type: Concept
in scheme: v3
change note: Version 4.1.0

Lesbian pride
preferred label: Orgullo lésbico @es
comment: The recognition and celebration of lesbians and lesbian culture, thereby affirming the visibility, dignity, and diversity of lesbian communities.
comment: La celebración y el reconocimiento de la identidad lésbica, afirmando la visibilidad, dignidad y diversidad de las comunidades lésbicas. @es
broader: LGBTQ+ pride
has top concept: LGBTQ+ pride
replaces: lesbianPride
issued: 2019-05-14
modified: 2025-02-23
type: Concept
in scheme: v3
change note: Version 4.1.0

Lesbian sex workers
preferred label: Trabajadoras sexuales lesbianas @es
alternative label: Lesbian prostitutes
alternative label: Lesbian prostitution
alternative label: Lesbian sex work
comment: Lesbians who receive money or goods in exchange for sexual services, performances, or companionship. Use to describe lesbians working across the broad spectrum of sex work.
broader: LGBTQ+ sex workers
has top concept: Sex workers
replaces: lesbianProstitutes
issued: 2019-05-14
modified: 2025-02-23
type: Concept
in scheme: v3
change note: Version 4.1.0

Lesbian prostitution
preferred label: Prostitución lesbiana @es
broader: Prostitution
has top concept: Sex industry
is replaced by: homoit0000768
replaces: lesbianProstitution
issued: 2019-05-14
modified: 2025-01-28
type: Concept
in scheme: v3
change note: Version 4.1.0

Lesbian Protestants
preferred label: Protestantes lesbianas @es
comment: Lesbians who are members of the Protestant Church.
comment: Lesbianas que son miembros de la Iglesia protestante. @es
broader: LGBTQ+ Protestants
has top concept: LGBTQ+ African religions
replaces: lesbianProtestants
issued: 2019-05-14
modified: 2025-02-23
type: Concept
in scheme: v3
change note: Version 4.1.0

Lesbian publishers
preferred label: Editoriales lésbicas @es
comment: Companies and organizations that publish materials for lesbian communities or addressing lesbian issues.
comment: Empresas y organizaciones que publican materiales para comunidades lésbicas o que abordan asuntos lésbicos. @es
broader: LGBTQ+ publishers
has top concept: LGBTQ+ publishers
replaces: lesbianPublishers
issued: 2019-05-14
modified: 2025-02-23
type: Concept
in scheme: v3
change note: Version 4.1.0

Lesbian radio
preferred label: Radio lésbica @es
alternative label: Radio lesbiana @es
comment: Auditory content broadcast on the radio (analog or digital) about lesbians and lesbian issues.
comment: Contenido auditivo emitido en radio (analógica o digital) sobre lesbianas y asuntos lésbicos. @es
broader: LGBTQ+ radio
related: Lesbian movement
has top concept: LGBTQ+ radio
replaces: lesbianRadio
issued: 2019-05-14
modified: 2026-02-23
type: Concept
in scheme: v3
change note: Version 4.1.0

Lesbian relationships
preferred label: Relaciones lésbicas @es
comment: Ongoing connections (romantic, sexual, or platonic) between two or more lesbians.
comment: Conexiones continuas (románticas, sexuales o platónicas) entre dos o más lesbianas. @es
broader: Relationship satisfaction
related: Bisexual relationships
related: Queer relationships
related: Transgender relationships
has top concept: Relationship satisfaction
replaces: lesbianRelationships
issued: 2019-05-14
modified: 2025-02-23
type: Concept
in scheme: v3
change note: Version 4.1.0

Lesbian rights
preferred label: Derechos lésbicos @es
comment: Legal, social, or ethical principles of freedom or entitlement held by lesbians.
comment: Principios legales, sociales o éticos de libertad o derechos que tienen las lesbianas. @es
broader: LGBTQ+ civil rights
has top concept: Human rights
replaces: lesbianRights
issued: 2019-05-14
modified: 2025-02-23
type: Concept
in scheme: v3
change note: Version 4.1.0

Lesbian Roman Catholics
preferred label: Lesbianas católico romanas @es
comment: Lesbians who are members of the Roman Catholic Church.
comment: Lesbianas que son miembros de la Iglesia católica romana. @es
broader: LGBTQ+ Roman Catholics
has top concept: LGBTQ+ African religions
replaces: lesbianRomanCatholics
issued: 2019-05-14
modified: 2025-02-23
type: Concept
in scheme: v3
change note: Version 4.1.0

Lesbian sensibility
preferred label: Sensibilidad lésbica @es
comment: A way of reading and looking at cultural texts (books, movies, television, magazines, etc.) through a lesbian lens, often including the appropriation of texts otherwise thought of as heterosexual.
comment: Una forma de leer y mirar textos culturales (libros, películas, televisión, revistas, etc.) a través de un lente lésbico, lo cual a menudo incluye la apropiación de textos considerados heterosexuales. @es
related: Gay sensibility
replaces: lesbianSensibility
issued: 2019-05-14
modified: 2025-02-23
type: Concept
in scheme: v3
change note: Version 4.1.0

Lesbian separatism
preferred label: Separatismo lesbiana @es
comment: Ideological, social, cultural, and physical separation between men and women or between lesbians and heterosexual women.
comment: Separación ideológica, social, cultural y física entre hombres y mujeres o entre lesbianas y mujeres heterosexuales. @es
narrower: Lesbian land
narrower: Lesbian nation
related: Gender relations
replaces: lesbianSeparatism
issued: 2019-05-14
modified: 2025-02-23
type: Concept
in scheme: v3
change note: Version 4.1.0

Lesbian slang
preferred label: Jerga lésbica @es
comment: Colloquial or informal language related to lesbians or used by lesbians.
comment: Lenguaje coloquial o informal relacionado con lesbianas o utilizado por lesbianas. @es
broader: Lesbian culture
broader: LGBTQ+ slang
related: Bois
related: Cookie dusters
has top concept: Subcultures
replaces: lesbianSlang
issued: 2019-05-14
modified: 2025-02-23
type: Concept
in scheme: v3
change note: Version 4.1.0

Lesbian sports clubs
preferred label: Clubs deportivos lésbicos @es
alternative label: Clubs de deportes lésbicos @es
comment: Groups of lesbians formed for the purpose of playing sports; includes professional and amateur sports clubs.
comment: Grupos de lesbianas formados con el fin de practicar deportes; incluye clubes deportivos profesionales y amateurs. @es
broader: LGBTQ+ sports clubs
related: Lesbian athletes
has top concept: LGBTQ+ clubs and organizations
replaces: lesbianSportsClubs
issued: 2019-05-14
modified: 2025-02-23
type: Concept
in scheme: v3
change note: Version 4.1.0

Lesbian studies
preferred label: Estudios lésbicos @es
comment: Academic field of research and study about lesbian identity and lesbian communities.
comment: Campo académico de investigación y estudio sobre la identidad lésbica y comunidades lésbicas. @es
broader: Gender studies
related: Bisexual studies
related: Gay studies
related: Queer studies
related: Transgender studies
has top concept: Gender studies
replaces: lesbianStudies
issued: 2019-05-14
modified: 2026-02-24
type: Concept
in scheme: v3
change note: Version 4.1.0

Lesbian survivors of hate crimes
preferred label: Sobrevivientes lesbianas de crímenes de odio @es
alternative label: Lesbianas sobrevivientes de crímenes de odio @es
comment: Lesbians who have experienced and survived hate crimes; follow the individual's preference for "victims" or "survivors" whenever possible.
comment: Lesbianas que han sufrido y sobrevivido crímenes de odio; siga la preferencia de la persona sobre el uso de "víctimas" o "sobrevivientes" siempre que sea posible. @es
broader: Lesbian victims of hate crimes
broader: LGBTQ+ survivors of hate crimes
has top concept: LGBTQ+ people
replaces: lesbianSurvivorsOfHateCrimes
issued: 2019-05-14
modified: 2025-02-23
type: Concept
in scheme: v3
change note: Version 4.1.0

Lesbian survivors of rape
preferred label: Sobrevivientes lesbianas de violación @es
alternative label: Lesbianas sobrevivientes de violación @es
comment: Lesbians who have experienced and survived rape; follow the individual's preference for "victims" or "survivors" whenever possible.
comment: Lesbianas que han sufrido y sobrevivido una violación; siga la preferencia de la persona sobre el uso de "víctimas" o "sobrevivientes" siempre que sea posible. @es
broader: Lesbian victims of rape
broader: LGBTQ+ survivors of rape
related: Corrective rape
has top concept: LGBTQ+ people
replaces: lesbianSurvivorsOfRape
issued: 2019-05-14
modified: 2025-02-23
type: Concept
in scheme: v3
change note: Version 4.1.0

Lesbian survivors of sexual abuse
preferred label: Sobrevivientes lesbianas de abuso sexual @es
alternative label: Lesbianas sobrevivientes de abuso sexual @es
comment: Lesbians who have experienced and survived sexual abuse; follow the individual's preference for "victims" or "survivors" whenever possible.
comment: Lesbianas que han sufrido y sobrevivido abusos sexuales; siga la preferencia de la persona sobre el uso de "víctimas" o "sobrevivientes" siempre que sea posible. @es
broader: Lesbian victims of sexual abuse
broader: LGBTQ+ survivors of sexual abuse
has top concept: LGBTQ+ people
replaces: lesbianSurvivorsOfSexualAbuse
issued: 2019-05-14
modified: 2025-02-23
type: Concept
in scheme: v3
change note: Version 4.1.0

Lesbian survivors of war
preferred label: Sobrevivientes lesbianas de guerra @es
alternative label: Lesbianas sobrevivientes de guerra @es
comment: Lesbians who have experienced and survived war; follow the individual's preference for "victims" or "survivors" whenever possible.
comment: Lesbianas que han sufrido y sobrevivido la guerra; siga la preferencia de la persona sobre el uso de "víctimas" o "sobrevivientes" siempre que sea posible. @es
broader: Lesbian victims of war
broader: LGBTQ+ survivors of war
has top concept: LGBTQ+ people
replaces: lesbianSurvivorsOfWar
issued: 2019-05-14
modified: 2025-02-23
type: Concept
in scheme: v3
change note: Version 4.1.0

Lesbian youth
preferred label: Juventud lésbica @es
alternative label: Lesbian teenagers
alternative label: Lesbian adolescents
alternative label: Lesbian teens
comment: Lesbians who are between the ages of childhood and adulthood.
comment: Lesbianas que se encuentran entre las edades de la niñez y la edad adulta. @es
broader: Lesbians
broader: LGBTQ+ youth
narrower: Lesbian girls
related: Lesbian characters
related: Lesbian identity
related: Lesbian youth literature
has top concept: LGBTQ+ people
replaces: lesbianYouth
issued: 2019-05-14
modified: 2025-02-23
type: Concept
in scheme: v3
change note: Version 4.1.0

Lesbian television
preferred label: Televisión lésbica @es
comment: Television shows featuring lesbian characters or themes.
comment: Programas de televisión con personajes o temas lésbicos. @es
broader: LGBTQ+ television
related: Lesbian movement
has top concept: LGBTQ+ television
replaces: lesbianTelevision
issued: 2019-05-14
modified: 2025-02-23
type: Concept
in scheme: v3
change note: Version 4.1.0

Lesbian theater
preferred label: Teatro lésbico @es
preferred label: Lesbian theatre
comment: Works in the performance arts that focus on lesbian characters, lesbian communities, or lesbian issues.
comment: Obras en las artes escénicas que se centran en personajes lésbicos, comunidades lésbicas o cuestiones lésbicas. @es
broader: LGBTQ+ theater
related: Gay theater
related: Lesbian theater groups
related: LGBTQ+ plays
has top concept: LGBTQ+ theater
replaces: lesbianTheatre
issued: 2019-05-14
modified: 2025-02-23
type: Concept
in scheme: v3
change note: Version 4.1.0

Lesbian theater groups
preferred label: Grupos de teatro lésbicos @es
preferred label: Lesbian theatre groups
comment: Groups of theatrical performers comprised of lesbians; may focus on performing works by lesbians or about lesbian issues.
comment: Grupos de artistas teatrales compuestos por lesbianas; pueden centrarse en la interpretación de obras de lesbianas o sobre cuestiones lésbicas. @es
related: Gay theater groups
related: Lesbian theater
related: LGBTQ+ musicals
replaces: lesbianTheatreGroups
issued: 2019-05-14
modified: 2025-02-23
type: Concept
in scheme: v3
change note: Version 4.1.0

Lesbian theology
broader: LGBTQ+ theology
has top concept: LGBTQ+ theology
is replaced by: homoit0001218
replaces: lesbianTheology
issued: 2019-05-14
modified: 2022-08-22
type: Concept
in scheme: v3
change note: Version 4.1.0

Lesbian trade union groups
preferred label: Grupos sindicales lésbicos @es
comment: Organized groups of lesbian workers who are united to make decisions relating to the conditions affecting their labor.
comment: Grupos organizados de trabajadoras lesbianas que se unen para tomar decisiones relacionadas con las condiciones que afectan su trabajo. @es
broader: Lesbian movement
related: Gay trade union groups
has top concept: Social movements
replaces: lesbianTradeUnionGroups
issued: 2019-05-14
modified: 2025-02-23
type: Concept
in scheme: v3
change note: Version 4.1.0

Lesbian victims of hate crimes
preferred label: Víctimas lesbianas de crímenes de odio @es
alternative label: Víctimas lésbicas de crímenes de odio @es
comment: Lesbians who have experienced hate crimes and may or may not have survived; follow the individual's preference for "victims" or "survivors" whenever possible.
comment: Lesbianas que han sufrido crímenes de odio y que pueden o no haber sobrevivido; siga la preferencia de la persona sobre el uso de "víctimas" o "sobrevivientes" siempre que sea posible. @es
broader: LGBTQ+ victims of hate crimes
narrower: Lesbian survivors of hate crimes
has top concept: LGBTQ+ people
replaces: lesbianVictimsOfHateCrimes
issued: 2019-05-14
modified: 2025-02-23
type: Concept
in scheme: v3
change note: Version 4.1.0

Lesbian victims of rape
preferred label: Víctimas lesbianas de violación @es
alternative label: Víctimas lésbicas de violación @es
comment: Lesbians who have experienced rape and may or may not have survived; follow the individual's preference for "victims" or "survivors" whenever possible.
comment: Lesbianas que han sufrido una violación y que pueden o no haber sobrevivido; siga la preferencia de la persona sobre el uso de "víctimas" o "sobrevivientes" siempre que sea posible. @es
broader: LGBTQ+ victims of rape
narrower: Lesbian survivors of rape
related: Corrective rape
has top concept: LGBTQ+ people
replaces: lesbianVictimsOfRape
issued: 2019-05-14
modified: 2025-02-23
type: Concept
in scheme: v3
change note: Version 4.1.0

Lesbian victims of sexual abuse
preferred label: Víctimas lesbianas de acoso sexual @es
alternative label: Víctimas lésbicas de acoso sexual @es
comment: Lesbians who have experienced sexual abuse and may or may not have survived; follow the individual's preference for "victims" or "survivors" whenever possible.
comment: Lesbianas que han sufrido abuso sexual y que pueden o no haber sobrevivido; siga la preferencia de la persona sobre el uso de "víctimas" o "sobrevivientes" siempre que sea posible. @es
broader: LGBTQ+ victims of sexual abuse
narrower: Lesbian survivors of sexual abuse
has top concept: LGBTQ+ people
replaces: lesbianVictimsOfSexualAbuse
issued: 2019-05-14
modified: 2025-02-23
type: Concept
in scheme: v3
change note: Version 4.1.0

Lesbian victims of war
preferred label: Víctimas lesbianas de guerra @es
alternative label: Víctimas lésbicas de guerra @es
comment: Lesbians who have experienced war and may or may not have survived; follow the individual's preference for "victims" or "survivors" whenever possible.
comment: Lesbianas que han sufrido la guerra y que pueden o no haber sobrevivido; siga la preferencia de la persona sobre el uso de "víctimas" o "sobrevivientes" siempre que sea posible. @es
broader: LGBTQ+ victims of war
narrower: Lesbian survivors of war
has top concept: LGBTQ+ people
replaces: lesbianVictimsOfWar
issued: 2019-05-14
modified: 2025-02-23
type: Concept
in scheme: v3
change note: Version 4.1.0

Lesbian victims' rights
preferred label: Derechos de víctimas lesbianas @es
alternative label: Derechos de víctimas lésbicas @es
comment: Lesbians' legal rights to be informed, present, and heard within the criminal justice system after having been harmed or injured as the result of of a crime, accident, or other event.
comment: Los derechos legales de las lesbianas a estar informadas, estar presentes y ser escuchadas dentro del sistema de justicia penal después de haber sido perjudicadas o lesionadas como resultado de un delito, accidente u otro evento. @es
broader: LGBTQ+ victims' rights
has top concept: Law
replaces: lesbianVictimsRights
issued: 2019-05-14
modified: 2025-02-23
type: Concept
in scheme: v3
change note: Version 4.1.0

White lesbians
preferred label: Lesbianas blancas @es
alternative label: Caucasian lesbians
alternative label: Lesbianas caucásicas @es
comment: Lesbians who are white.
comment: Lesbianas que son blancas. @es
broader: White LGBTQ+ people
has top concept: White LGBTQ+ people
replaces: lesbianWhitePeople
issued: 2019-05-14
modified: 2025-02-23
type: Concept
in scheme: v3
change note: Version 4.1.0

Lesbian youth literature
preferred label: Literatura juvenil lésbica @es
comment: Written literary works for an audience of readers from 12-18 years of age, also known as young adult literature or YA; use in reference to youth literature focusing on lesbian characters or themes.
comment: Obras literarias escritas para una audiencia de lectores de 12 a 18 años de edad, también conocida como literatura para adultos jóvenes o YA (por sus siglas en inglés); utilícese en referencia a la literatura juvenil centrada en personajes o temas lésbicos. @es
broader: LGBTQ+ youth literature
related: Lesbian youth
has top concept: Subcultures
replaces: lesbianYouthLiterature
issued: 2019-05-14
modified: 2025-02-23
type: Concept
in scheme: v3
change note: Version 4.1.0

Lesbianism
preferred label: Lesbianismo @es
comment: Sexual orientation of women and femmes who are sexually and/or romantically attracted to other women and femmes. However, not all lesbians are women, and gender non-conforming people who belong to lesbian communities have often identified as lesbian.
comment: Orientación sexual de mujeres y femmes que se sienten atraídas sexual y/o románticamente por otras mujeres y femmes. Sin embargo, no todas las lesbianas son mujeres, y las personas disidentes de género que pertenecen a comunidades lésbicas a menudo se han identificado como lesbianas. @es
broader: Sexual orientation
related: Bisexuality
related: Lesbians
related: Homosexuality
related: Tribadism
has top concept: Sexual orientation
replaces: lesbianism
issued: 2019-05-14
modified: 2025-02-23
type: Concept
in scheme: v3
change note: Version 4.1.0

Lesbians in the military
preferred label: Lesbianas en el ejército @es
alternative label: Lesbianas en las fuerzas armadas @es
comment: Lesbians serving in state and national armed forces.
comment: Lesbianas que sirven en las fuerzas armadas estatales y nacionales. @es
broader: LGBTQ+ people in the military
has top concept: Legal status
replaces: lesbiansInTheMilitary
issued: 2019-05-14
modified: 2025-02-23
type: Concept
in scheme: v3
change note: Version 4.1.0

Lesbians of color
preferred label: Lesbianas de color @es
preferred label: Lesbians of colour
comment: Primarily used in the United States, this term refers to lesbians who are not white and who identify as people of color.
comment: Lesbianas que no son blancas y que se autoidentifican como personas de color. @es
broader: LGBTQ+ people of color
has top concept: LGBTQ+ people
replaces: lesbiansOfColour
issued: 2019-05-14
modified: 2025-02-23
type: Concept
in scheme: v3
change note: Version 4.1.0

Parents of lesbians
preferred label: Madres y padres de lesbianas @es
alternative label: Lesbians' parents
alternative label: Madres de lesbianas @es
alternative label: Padres de lesbianas @es
comment: People who act as parents to one or more lesbian. For parents who are themselves lesbians, use the term "Lesbian parents."
comment: Personas que actúan como padres de una o más lesbianas. Para padres que son lesbianas, utilice el término "madres y padres lesbianas". @es
broader: Parents of LGBTQ+ people
related: Lesbians
has top concept: Family members
replaces: parentsOfLesbians
issued: 2019-05-14
modified: 2025-02-23
type: Concept
in scheme: v3
change note: Version 4.1.0

Lesbophobia
preferred label: Lesbofobia @es
comment: Antagonism or disgust directed towards lesbianism as an identity or lesbians due to their sexuality, perceived or actual. Lesbophobia can include denial of the existence of lesbianism, stereotypes, verbal harassment, and physical violence.
comment: Antagonismo o repugnancia hacia el lesbianismo como identidad o hacia las lesbianas por su sexualidad, percibida o real. La lesbofobia puede incluir la negación de la existencia del lesbianismo, estereotipos, acoso verbal y violencia física. @es
broader: LGBTQ+ phobia
narrower: Internalized lesbophobia
related: Anti-lesbian discrimination
related: Anti-lesbian violence
related: Lesbians
related: Heterosexism
has top concept: LGBTQ+ phobia
replaces: lesbophobia
issued: 2019-05-14
modified: 2025-02-23
type: Concept
in scheme: v3
change note: Version 4.1.0

LGB
comment: Acronym used to describe lesbians, gay people, and bisexuals as a group. This acronym has often been used to exclude transgender people.
comment: Acrónimo utilizado para describir a lesbianas, hombres gay y personas bisexuales como grupo. Este acrónimo se ha utilizado a menudo para excluir a las personas transgénero. @es
broader: LGBT
broader: LGBTI
broader: LGBTQ
broader: LGBTQ+
broader: LGBTQIA
related: Bisexual community
related: Gay community
related: Lesbian community
related: Transgender community
has top concept: LGBTI
replaces: LGB
issued: 2019-05-14
modified: 2025-02-23
type: Concept
in scheme: v3
change note: Version 4.1.0

LGBTI
comment: Acronym used to describe lesbians, gay men, bisexual people, transgender people, and intersex people as a group.
comment: Acrónimo utilizado para describir a lesbianas, hombres gay, personas bisexuales, personas transgénero e intersexuales como grupo. @es
narrower: LGBT
narrower: LGB
related: Bisexual community
related: Gay community
related: Intersex movement
related: Lesbian community
related: Sexual minorities
related: Transgender community
related: Transgenderism
replaces: LGBTI
issued: 2019-05-14
modified: 2025-02-23
type: Concept
in scheme: v3
change note: Version 4.1.0

LGBTQ
comment: Acronym used to describe lesbians, gay men, bisexual people, transgender people, and queer people as a group.
comment: Acrónimo utilizado para describir a lesbianas, hombres gay, personas bisexuales, personas transgénero y personas queer como grupo. @es
broader: LGBTQ+
broader: LGBTQIA
narrower: LGBT
narrower: LGB
related: Bisexual community
related: Gay community
related: Lesbian community
related: Queer community
related: Transgender community
has top concept: 2SLGBTQ+
replaces: LGBTQ
issued: 2019-05-14
modified: 2025-02-23
type: Concept
in scheme: v3
change note: Version 4.1.0

LGBTQ+
comment: Acronym used to describe lesbians, gay men, bisexual people, transgender people, queer people, and any other sexual and gender minorities as a group.
comment: Acrónimo utilizado para describir a lesbianas, hombres gay, personas bisexuales, personas transgénero, personas queer y cualquier otra minoría sexual y de género como grupo. @es
broader: 2SLGBTQ+
narrower: LGB
narrower: LGBTQ
related: Asexuality
related: Bisexual community
related: Gay community
related: Intersex movement
related: Lesbian community
related: Queer community
related: Sexual diversity
related: Transgender community
has top concept: 2SLGBTQ+
replaces: LGBTQ+
issued: 2019-05-14
modified: 2025-02-23
type: Concept
in scheme: v3
change note: Version 4.1.0

LGBTQ+ action campaigns
preferred label: Campañas de acción LGBTQ+ @es
alternative label: LGBTQ action campaigns
alternative label: Campañas de acción LGBTQ @es
comment: A series of organized events or efforts centered around raising awareness or achieving a particular political, social, or cultural goal or action benefiting LGBTQ+ people and communities.
comment: Una serie de eventos o esfuerzos organizados centrados en crear conciencia o lograr un objetivo o acción política, social o cultural particular que beneficie a las personas y comunidades LGBTQ+. @es
broader: LGBTQ+ direct action
narrower: LGBTQ+ demonstrations
has top concept: LGBTQ+ activism
replaces: LGBTQActionCampaigns
issued: 2019-05-14
modified: 2025-02-23
type: Concept
in scheme: v3
change note: Version 4.1.0

LGBTQ+ adoption
preferred label: Adopción LGBTQ+ @es
alternative label: LGBTQ adoption
alternative label: Adopción (LGBTQ) @es
comment: Adoption of a child or children, either by legal or informal processes, by LGBTQ+ people.
comment: La adopción de un niño o niños, ya sea por procesos legales o informales, por personas LGBTQ+. @es
broader: LGBTQ+ family planning
narrower: Second parent adoption
narrower: LGBTQ+ adoptive parenthood
narrower: LGBTQ+ adoptive parents
narrower: LGBTQ+ birth parents
related: Adoptive parenthood
related: Adoptive parents
related: Birth parents
related: Child custody
related: Children of LGBTQ+ people
related: LGBTQ+ families
related: LGBTQ+ adoptive families
related: LGBTQ+ foster families
related: LGBTQ+ parenthood
related: LGBTQ+ personal and family law
related: LGBTQ+ parents
has top concept: LGBTQ+ family planning
replaces: LGBTQAdoption
issued: 2019-05-14
modified: 2025-02-23
type: Concept
in scheme: v3
change note: Version 4.1.0

LGBTQ+ adoptive families
preferred label: Familias adoptivas LGBTQ+ @es
alternative label: LGBTQ adoptive families
alternative label: Familias adoptivas (LGBTQ) @es
comment: Families including adopted children in which one or more individuals identify as LGBTQ+.
comment: Familias que incluyen niños adoptados en las que una o más personas se autoidentifican como LGBTQ+. @es
broader: LGBTQ+ families
narrower: LGBTQ+ adoptive parenthood
narrower: LGBTQ+ fatherhood
narrower: LGBTQ+ motherhood
related: LGBTQ+ adoption
related: LGBTQ+ adoptive parents
has top concept: LGBTQ+ families
replaces: LGBTQAdoptiveFamilies
issued: 2019-05-14
modified: 2025-02-23
type: Concept
in scheme: v3
change note: Version 4.1.0

LGBTQ+ adoptive parenthood
preferred label: Maternidad y paternidad adoptiva LGBTQ+ @es
alternative label: LGBTQ adoptive parenthood
alternative label: Maternidad y paternidad adoptiva LGBTQ @es
alternative label: Maternidad adoptiva LGBTQ+ @es
alternative label: Paternidad adoptiva LGBTQ+ @es
comment: The experiences involved in adoptive parenting, as experienced by LGBTQ+ people.
comment: Las experiencias involucradas en la crianza adoptiva, tal como las viven las personas LGBTQ+. @es
broader: LGBTQ+ adoption
broader: LGBTQ+ adoptive families
broader: LGBTQ+ parenthood
related: LGBTQ+ families
related: LGBTQ+ family planning
related: LGBTQ+ foster families
related: LGBTQ+ foster parenthood
related: LGBTQ+ personal and family law
related: LGBTQ+ social parenthood
related: Motherhood
related: LGBTQ+ parents
related: Fatherhood
has top concept: LGBTQ+ family planning
replaces: LGBTQAdoptiveParenthood
issued: 2019-05-14
modified: 2025-02-23
type: Concept
in scheme: v3
change note: Version 4.1.0

LGBTQ+ adoptive parents
preferred label: Madres y padres adoptivos LGBTQ+ @es
alternative label: LGBTQ adoptive parents
alternative label: Madres adoptivos LGBTQ+ @es
alternative label: Padres adoptivos LGBTQ+ @es
comment: Parents who adopt and who are LGBTQ+ people.
comment: Padres y/o madres que adoptan y que son personas LGBTQ+. @es
broader: LGBTQ+ families
broader: LGBTQ+ adoption
broader: LGBTQ+ parenthood
broader: LGBTQ+ parents
related: Adoptive parents
related: Birth parents
related: LGBTQ+ adoptive families
related: LGBTQ+ foster parents
has top concept: LGBTQ+ families
replaces: LGBTQAdoptiveParents
issued: 2019-05-14
modified: 2025-02-23
type: Concept
in scheme: v3
change note: Version 4.1.0

LGBTQ+ African religions
preferred label: LGBTQ+ Native American religions
preferred label: LGBTQ+ Asian religions
preferred label: LGBTQ+ religious people
preferred label: Personas religiosas LGBTQ+ @es
alternative label: LGBTQ African religions
alternative label: LGBTQ American Indian religions
alternative label: LGBTQ Native American religions
alternative label: LGBTQ Asian religions
alternative label: LGBTQ+ religions
alternative label: Religiones LGBTQ+ @es
is replaced by: homoit0000928
replaces: LGBTQAfricanReligions
replaces: LGBTQNativeAmericanReligions
replaces: LGBTQAsianReligions
replaces: LGBTQReligions
issued: 2019-05-14
modified: 2022-08-15
modified: 2022-11-17
modified: 2025-02-23
type: Concept
in scheme: v3
change note: Version 4.1.0
related: Native American LGBTQ+ people
related: LGBTQ+ atheists
related: LGBTQ+ spiritual people
related: Queer theology
related: LGBTQ+-affirming religious services
narrower: LGBTQ+ Buddhists
narrower: LGBTQ+ Confucianists
narrower: Gay Muslims
narrower: LGBTQ+ Hindus
narrower: LGBTQ+ Shintoists
narrower: LGBTQ+ Taoists
narrower: LGBTQ+ Muslims
narrower: LGBTQ+ Christians
narrower: Jewish LGBTQ+ people
narrower: LGBTQ+ shamans
narrower: LGBTQ+ Pagans
narrower: LGBTQ+ Unitarian Universalists
comment: LGBTQ+ people who belong to a religion or hold religious beliefs. For LGBTQ+ people who hold spiritual beliefs or engage in spiritual practices but do not belong to an organized religion, use the term "LGBTQ+ spiritual people."
comment: Personas LGBTQ+ que pertenecen a una religión o tienen creencias religiosas. Para las personas LGBTQ+ que tienen creencias espirituales o sostienen prácticas espirituales pero que no pertenecen a una religión organizada, utilícese el término "personas espirituales LGBTQ+". @es

LGBTQ+ art censorship
preferred label: Censura de arte LGBTQ+ @es
alternative label: LGBTQ art censorship
alternative label: Censura de arte LGBTQ @es
comment: Suppression or prohibition of art by LGBTQ+ artists or about LGBTQ+ issues; includes censorship on the basis of religious, moral, political, and/or social objections.
comment: Supresión o prohibición del arte por parte de artistas LGBTQ+ o sobre asuntos LGBTQ+; incluye la censura basada en objeciones religiosas, morales, políticas y/o sociales. @es
broader: LGBTQ+ censorship
related: LGBTQ+ arts
has top concept: Censorship
replaces: LGBTQArtCensorship
issued: 2019-05-14
modified: 2025-02-23
type: Concept
in scheme: v3
change note: Version 4.1.0

LGBTQ+ arts
preferred label: Artes LGBTQ+ @es
alternative label: LGBTQ arts
alternative label: Artes LGBTQ @es
comment: Umbrella term for different forms of creative activity, including visual, material, and performing arts, by LGBTQ+ artists or about LGBTQ+ topics and communities. Use a more specific term if possible.
comment: Término general para diferentes formas de actividad creativa, incluidas las artes visuales, materiales y escénicas, realizadas por artistas LGBTQ+ o sobre temas y comunidades LGBTQ+. Utilícese un término más específico de ser posible. @es
broader: LGBTQ+ culture
narrower: LGBTQ+ musicals
narrower: LGBTQ+ cinema
narrower: LGBTQ+ erotic art
narrower: Transgender art
narrower: Gay art
narrower: Lesbian art
narrower: Bisexual art
narrower: Queer art
narrower: Intersex art
narrower: Aromantic art
narrower: Asexual art
narrower: Demisexual art
narrower: LGBTQ+ operas
narrower: LGBTQ+ music
narrower: LGBTQ+ video games
related: LGBTQ+ actors
related: LGBTQ+ artists
related: Drag
related: Erotica
related: LGBTQ+ art censorship
related: LGBTQ+ choruses
related: LGBTQ+ films
related: LGBTQ+ musicians
related: LGBTQ+ plays
related: LGBTQ+ literature
related: Nude photographs
related: Nude art
related: LGBTQ+ theater
related: LGBTQ+ cultural heritage institutions
related: Slash art
related: Two-Spirit art
related: LGBTQ+ people in arts and media
has top concept: Subcultures
replaces: LGBTQArts
issued: 2019-05-14
modified: 2025-04-23
type: Concept
in scheme: v3
change note: Version 4.1.0

LGBTQ+ awards
preferred label: Premios LGBTQ+ @es
alternative label: LGBTQ awards
alternative label: Premios LGBTQ @es
comment: Prizes or forms of recognition given in honor of achievements by LBGTQ+ individuals or in support of LGBTQ+ issues or communities.
comment: Premios o formas de reconocimiento otorgados en honor a los logros de las personas LBGTQ+ o en apoyo a los asuntos o comunidades LGBTQ+. @es
narrower: LGBTQ+ literary awards
narrower: Title contests
replaces: LGBTQAwards
issued: 2019-05-14
modified: 2025-02-23
type: Concept
in scheme: v3
change note: Version 4.1.0

LGBTQ+ biological parents
alternative label: LGBTQ biological parents
comment: Biological or genetic parents who are LGBTQ+ people. For adoption contexts, use LGBTQ+ birth parents.
broader: LGBTQ+ families
broader: LGBTQ+ parents
narrower: Biological parenthood
narrower: Genetic parenthood
narrower: Gestational parenthood
related: Birth parents
related: LGBTQ+ family planning
related: LGBTQ+ parenthood
has top concept: LGBTQ+ families
replaces: LGBTQBiologicalParents
issued: 2019-05-14
modified: 2025-02-23
type: Concept
in scheme: v3
change note: Version 4.1.0

Biracial LGBTQ+ people
preferred label: Personas LGBTQ+ birraciales @es
alternative label: Bi-racial people (LGBTQ)
alternative label: Biracial people (LGBTQ)
alternative label: Bi-racial LGBTQ+ people
alternative label: LGBTQ+ bi-racial people
alternative label: LGBTQ+ biracial people
alternative label: Personas LGBTQ+ bi-raciales @es
alternative label: Personas birraciales (LGBTQ) @es
alternative label: Personas bi-raciales LGBTQ+ @es
alternative label: Personas birraciales LGBTQ+ @es
alternative label: Personas bi-raciales (LGBTQ)|| @es
comment: LGBTQ+ people who belong to two or more racial groups. Only use to describe people who self-identify as biracial.
comment: Personas LGBTQ+ que pertenecen a dos o más grupos raciales. Utilícese únicamente para personas que se autoidentifiquen como birraciales. @es
broader: LGBTQ+ people of color
narrower: Biracial lesbians
narrower: Biracial gay men
narrower: Biracial bisexual people
narrower: Biracial transgender people
narrower: Biracial queer people
narrower: Biracial asexual people
narrower: Biracial intersex people
narrower: Biracial non-binary people
has top concept: LGBTQ+ people
replaces: LGBTQBiracialPeople
issued: 2019-05-14
modified: 2025-02-23
type: Concept
in scheme: v3
change note: Version 4.1.0

LGBTQ+ birth parents
preferred label: Madres y padres biológicos LGBTQ+ @es
alternative label: LGBTQ birth parents
alternative label: Padres biológicos LGBTQ+ @es
alternative label: Madres biológicos LGBTQ+ @es
comment: In an adoption context, biological or genetic parents who are LGBTQ+ people.
comment: Padres y/o madres biológicos o genéticos de un niño o niños dados en adopción. @es
broader: Birth parents
broader: LGBTQ+ adoption
broader: LGBTQ+ parents
has top concept: LGBTQ+ families
replaces: LGBTQBirthParents
issued: 2019-05-14
modified: 2025-02-23
type: Concept
in scheme: v3
change note: Version 4.1.0

LGBTQ+ blind people
preferred label: Personas LGBTQ+ ciegas @es
alternative label: Blind people (LGBTQ)
alternative label: Blind LGBTQ+ people
alternative label: Personas ciegas LGBTQ+ @es
alternative label: Personas ciegas (LGBTQ) @es
comment: LGBTQ+ people with significant or total loss of vision.
comment: Personas LGBTQ+ con pérdida significativa o total de la visión. @es
broader: LGBTQ+ disabled people
narrower: Lesbian blind people
narrower: Gay blind men
narrower: Bisexual blind people
narrower: Transgender blind people
narrower: Queer blind people
narrower: Asexual blind people
narrower: Intersex blind people
related: Two-Spirit blind people
has top concept: LGBTQ+ people
replaces: LGBTQBlindPeople
issued: 2019-05-14
modified: 2025-02-23
type: Concept
in scheme: v3
change note: Version 4.1.0

LGBTQ+ blood donors
preferred label: Donantes de sangre LGBTQ+ @es
alternative label: LGBTQ blood donors
alternative label: Donantes de sangre LGBTQ @es
comment: LGBTQ+ people who give blood for transfusion and medical purposes.
comment: Personas LGBTQ+ que donan sangre para transfusiones y con fines médicos. @es
broader: Donors
has top concept: Donors
replaces: LGBTQBloodDonors
issued: 2019-05-14
modified: 2025-02-23
type: Concept
in scheme: v3
change note: Version 4.1.0

LGBTQ+ book censorship
preferred label: Censura de libros LGBTQ+ @es
alternative label: LGBTQ book censorship
alternative label: Censura de libros LGBTQ @es
comment: The suppression or prohibition of written texts by LGBTQ+ authors and/or about LGBTQ+ issues due to religious, moral, political, and/or social objections.
comment: La supresión o prohibición de textos escritos de autores LGBTQ+ y/o sobre temas LGBTQ+ por objeciones religiosas, morales, políticas y/o sociales. @es
broader: LGBTQ+ censorship
related: LGBTQ+ books
related: LGBTQ+ challenged books
related: LGBTQ+ information professionals
has top concept: Censorship
replaces: LGBTQBookCensorship
issued: 2019-05-14
modified: 2025-02-23
type: Concept
in scheme: v3
change note: Version 4.1.0

LGBTQ+ book clubs
preferred label: Clubes de lectura LGBTQ+ @es
alternative label: LGBTQ book clubs
alternative label: Clubes de lectura LGBTQ @es
comment: Groups of people gathering regularly to read and discuss written works; use in reference to book clubs with primarily LGBTQ+ membership or book clubs focused on books by LGBTQ+ authors or featuring LGBTQ+ characters and themes.
comment: Grupos de personas que se reúnen periódicamente para leer y discutir trabajos escritos; utilícese en referencia a clubes de lectura con membresía principalmente LGBTQ+ o clubes de lectura centrados en libros de autores LGBTQ+ o que presentan personajes y temas LGBTQ+. @es
broader: LGBTQ+ clubs and organizations
related: LGBTQ+ books
has top concept: LGBTQ+ clubs and organizations
replaces: LGBTQBookClubs
issued: 2019-05-14
modified: 2025-02-23
type: Concept
in scheme: v3
change note: Version 4.1.0

LGBTQ+ books
preferred label: Libros LGBTQ+ @es
alternative label: LGBTQ books
alternative label: Libros LGBTQ @es
comment: Written works featuring LGBTQ+ characters or themes, or works intended to be read by LGBTQ+ people.
comment: Obras escritas que presenten a personajes o temas LGBTQ+, u obras destinadas a ser leídas por personas LGBTQ+. @es
narrower: LGBTQ+ challenged books
related: LGBTQ+ bookshops
related: LGBTQ+ book censorship
related: LGBTQ+ book clubs
related: LGBTQ+ libraries
related: LGBTQ+ literature
related: LGBTQ+ press
related: LGBTQ+ authors
related: Intersex fiction
related: Aromantic fiction
related: Asexual fiction
replaces: LGBTQBooks
issued: 2019-05-14
modified: 2025-02-23
type: Concept
in scheme: v3
change note: Version 4.1.0

LGBTQ+ cartoons
preferred label: Caricaturas LGBTQ+ @es
alternative label: LGBTQ cartoons
alternative label: Caricaturas LGBTQ @es
comment: Satirical drawings created by LGBTQ+ cartoonists or that depict someone or something relating to LGBTQ+ culture.
comment: Dibujos satíricos creados por caricaturistas LGBTQ+ o que representan a alguien o algo relacionado con la cultura LGBTQ+. @es
broader: LGBTQ+ comics
related: Anime and manga fandom
related: Hentai
related: LGBTQ+ cartoonists
has top concept: Subcultures
replaces: LGBTQCartoons
issued: 2019-05-14
modified: 2025-03-13
type: Concept
in scheme: v3
change note: Version 4.1.0

LGBTQ+ censorship
preferred label: Censura LGBTQ+ @es
alternative label: LGBTQ censorship
alternative label: Censura LGBTQ @es
comment: Suppression or prohibition of the discussion, education, or circulation of information related to LGBTQ+ people and identities in media, schools, and/or in the general public.
comment: Supresión o prohibición de la discusión, la educación o la circulación de información relacionada con personas e identidades LGBTQ+ en los medios, escuelas y/o en el público en general. @es
broader: Censorship
narrower: LGBTQ+ art censorship
narrower: LGBTQ+ book censorship
narrower: LGBTQ+ film censorship
has top concept: Censorship
replaces: LGBTQCensorship
issued: 2019-05-14
modified: 2025-02-23
type: Concept
in scheme: v3
change note: Version 4.1.0

LGBTQ+ centers
preferred label: Centros LGBTQ+ @es
preferred label: LGBTQ+ centres
comment: Spaces dedicated for use by members of LGBTQ+ communities engaging in various activities, including education, health and wellness services, community support and outreach, etc. Use a more specific term if possible.
comment: Espacios dedicados para el uso de miembros de comunidades LGBTQ+ que participan de diversas actividades, incluidas la educación, los servicios de salud y el bienestar, el apoyo y el alcance comunitario, etc. Utilícese un término más específico de ser posible. @es
narrower: LGBTQ+ community centers
narrower: LGBTQ+ information centers
narrower: LGBTQ+ health care centers
narrower: LGBTQ+ youth centers
replaces: LGBTQCentres
issued: 2019-05-14
modified: 2025-02-23
type: Concept
in scheme: v3
change note: Version 4.1.0

LGBTQ+ challenged books
preferred label: Libros desafiados LGBTQ+ @es
alternative label: LGBTQ challenged books
alternative label: Libros desafiados LGBTQ @es
alternative label: Libros impugnados LGBTQ+ @es
comment: Books about LGBTQ+ people and issues or written by LGBTQ+ authors that individuals or organizations have attempted to restrict or remove from school curricula, library circulation, or sale.
comment: Libros sobre personas y temas LGBTQ+ o escritos por autores LGBTQ+ que personas u organizaciones han intentado restringir o eliminar de los planes de estudio escolares, la circulación en bibliotecas o la venta. @es
broader: LGBTQ+ books
related: LGBTQ+ book censorship
has top concept: LGBTQ+ books
replaces: LGBTQChallengedBooks
issued: 2019-05-14
modified: 2025-02-23
type: Concept
in scheme: v3
change note: Version 4.1.0

LGBTQ+ choruses
preferred label: Coros LGBTQ+ @es
alternative label: LGBTQ choirs
alternative label: LGBTQ choruses
alternative label: Coros LGBTQ @es
comment: Organized groups of LGBTQ+ people who sing together.
comment: Grupos organizados de personas LGBTQ+ que cantan juntas. @es
narrower: Gay choruses
narrower: Lesbian choruses
related: LGBTQ+ arts
related: LGBTQ+ clubs and organizations
related: LGBTQ+ musicians
replaces: LGBTQChoruses
issued: 2019-05-14
modified: 2025-02-23
type: Concept
in scheme: v3
change note: Version 4.1.0

LGBTQ+ chosen families
preferred label: Familias escogidas LGBTQ+ @es
alternative label: LGBTQ chosen families
alternative label: Familia de elección LGBTQ+ @es
alternative label: Familias elegidas LGBTQ+ @es
comment: Groups of LGBTQ+ people who have intentionally chosen to nurture, support, and love one another as family, whether or not they have biological or legal relationships.
comment: Grupos de personas LGBTQ+ que han elegido intencionalmente cuidarse, apoyarse y amarse unas a otras como familia, tengan o no relaciones biológicas o legales. @es
broader: LGBTQ+ families
narrower: Ballroom families
narrower: Drag families
has top concept: LGBTQ+ families
replaces: LGBTQChosenFamilies
issued: 2019-05-14
modified: 2025-02-23
type: Concept
in scheme: v3
change note: Version 4.1.0

LGBTQ+ civil disobedience
preferred label: Desobediencia civil LGBTQ+ @es
alternative label: LGBTQ civil disobedience
alternative label: Desobediencia civil (LGBTQ) @es
comment: The active, professed refusal of LGBTQ+ people to obey certain laws or governmental orders as a form of activism and resistance.
comment: La negación activa y declarada de personas LGBTQ+ a obedecer ciertas leyes u órdenes gubernamentales como forma de activismo y resistencia. @es
broader: LGBTQ+ direct action
related: Arrests of LGBTQ+ people
has top concept: LGBTQ+ activism
replaces: LGBTQCivilDisobedience
issued: 2019-05-14
modified: 2025-02-23
type: Concept
in scheme: v3
change note: Version 4.1.0

LGBTQ+ clubs and organizations
preferred label: Clubes LGBTQ+ @es
alternative label: LGBTQ+ clubs
alternative label: Clubs (LGBTQ)
alternative label: LGBTQ+ organizations
alternative label: Organizations (LGBTQ)
alternative label: Clubs and organizations (LGBTQ)
alternative label: Clubes LGBTQ @es
comment: Organized clubs and groups composed primarily of LGBTQ+ people.
comment: Grupos u organizaciones de personas LGBTQ+ dedicadas a un interés o una actividad particular. @es
narrower: LGBTQ+ book clubs
narrower: LGBTQ+ motorcycle clubs
narrower: LGBTQ+ sports clubs
narrower: LGBTQ+ student organizations
narrower: Leather and kink clubs
narrower: LGBTQ+ older people's organizations
narrower: Lesbian organizations
narrower: Gay organizations
narrower: Bisexual organizations
narrower: Transgender organizations
narrower: Queer organizations
narrower: Intersex organizations
narrower: Non-binary organizations
related: LGBTQ+ choruses
related: AIDS organizations
related: Organizations for sexual research and sexual reform
related: Two-Spirit organizations
replaces: LGBTQClubs
issued: 2019-05-14
modified: 2025-02-23
type: Concept
in scheme: v3
change note: Version 4.1.0

LGBTQ+ co-fathers
preferred label: Co-padres LGBTQ+ @es
alternative label: LGBTQ co-fathers
alternative label: Co-padres LGBTQ @es
alternative label: Co-papás LGBTQ+ @es
comment: Co-parenting fathers who are LGBTQ+ people. They may or may not be partners.
comment: Padres coparentales que son personas LGBTQ+. Pueden o no ser pareja. @es
broader: LGBTQ+ co-parents
has top concept: LGBTQ+ families
replaces: LGBTQCoFathers
issued: 2019-05-14
modified: 2025-02-23
type: Concept
in scheme: v3
change note: Version 4.1.0

LGBTQ+ co-mothers
preferred label: Co-madres LGBTQ+ @es
alternative label: LGBTQ co-mothers
alternative label: Co-madres LGBTQ @es
alternative label: Co-mamás LGBTQ @es
comment: Co-parenting mothers who are LGBTQ+ people. They may or may not be partners.
comment: Madres coparentales que son personas LGBTQ+. Pueden o no ser pareja. @es
broader: LGBTQ+ co-parents
broader: Mothers
has top concept: LGBTQ+ families
replaces: LGBTQCoMothers
issued: 2019-05-14
modified: 2025-02-23
type: Concept
in scheme: v3
change note: Version 4.1.0

LGBTQ+ co-parenthood
preferred label: Co-maternidad y co-paternidad LGBTQ+ @es
alternative label: LGBTQ co-parenthood
alternative label: Co-paternidad LGBTQ+ @es
alternative label: Co-maternidad LGBTQ+ @es
comment: The state, experience, and condition of being an LGBTQ+ parent who is parenting with one or more people.
comment: El estado, la experiencia y la condición de ser un padre LGBTQ+ que cría con una o más personas. @es
broader: LGBTQ+ parenthood
related: LGBTQ+ co-parents
has top concept: LGBTQ+ parenthood
replaces: LGBTQCoParenthood
issued: 2019-05-14
modified: 2025-02-23
type: Concept
in scheme: v3
change note: Version 4.1.0

LGBTQ+ co-parents
preferred label: Co-madres y co-padres LGBTQ+ @es
alternative label: LGBTQ co-parents
alternative label: Co-padres LGBTQ+ @es
alternative label: Co-madres LGBTQ+ @es
comment: Co-parenting people who are LGBTQ+ people. They may or may not be partners.
comment: La coparentalidad de personas que son personas LGBTQ+. Pueden o no ser pareja. @es
broader: LGBTQ+ parents
narrower: LGBTQ+ co-fathers
narrower: LGBTQ+ co-mothers
related: LGBTQ+ co-parenthood
has top concept: LGBTQ+ families
replaces: LGBTQCoParents
issued: 2019-05-14
modified: 2025-02-23
type: Concept
in scheme: v3
change note: Version 4.1.0

LGBTQ+ comics
preferred label: Cómics LGBTQ+ @es
alternative label: Comics (LGBTQ)
alternative label: Cómics (LGBTQ) @es
alternative label: Historietas LGBTQ+ @es
alternative label: Historietas LGBTQ @es
comment: Works consisting of sequential images often accompanied by text; use in reference to comics focusing on LGBTQ+ characters or themes.
comment: Obras que consisten en imágenes secuenciales, a menudo acompañadas de texto; utilícese en referencia a cómics centrados en personajes o temas LGBTQ+. @es
broader: LGBTQ+ fiction
narrower: LGBTQ+ cartoons
narrower: LGBTQ+ graphic novels
narrower: LGBTQ+ manga
narrower: Lesbian comics
narrower: Gay comics
narrower: Bisexual comics
narrower: Transgender comics
narrower: Queer comics
narrower: Aromantic comics
narrower: Intersex comics
narrower: Asexual comics
narrower: Demisexual comics
narrower: Megasexual comics
narrower: Greyromantic comics
narrower: Non-binary comics
related: Māhū comics
related: Two-Spirit comics
related: LGBTQ+ superheroes
related: LGBTQ+ supervillains
related: LGBTQ+ cartoonists
has top concept: Subcultures
replaces: comicsLGBTQ
issued: 2019-05-14
modified: 2025-03-13
type: Concept
in scheme: v3
change note: Version 4.1.0

LGBTQ+ communes
preferred label: Comunas LGBTQ+ @es
alternative label: LGBTQ communes
alternative label: Comunas LGBTQ @es
comment: Groups of LGBTQ+ people living in community and sharing possessions and responsibilities.
comment: Grupos de personas LGBTQ+ que viven en comunidad y comparten posesiones y responsabilidades. @es
broader: LGBTQ+ communities
has top concept: LGBTQ+ communities
replaces: LGBTQCommunes
issued: 2019-05-14
modified: 2025-02-23
type: Concept
in scheme: v3
change note: Version 4.1.0

Conception by LGBTQ+ people
preferred label: Concepción por personas LGBTQ+ @es
alternative label: Conception by LGBTQ people
alternative label: Concepción por parte de personas LGBTQ+ @es
comment: Umbrella term used to describe the processes by which LGBTQ+ people conceive children, including an LGBTQ+ person, their partner, or a third party becoming pregnant with a child that will be raised by an LGBTQ+ person, as well as LGBTQ+ people conceiving children that will be raised by other parents.
comment: Término general utilizado para describir los procesos mediante los cuales las personas LGBTQ+ conciben niños, incluyendo a una persona LGBTQ+, su pareja o una tercera persona que queda embarazada con un niño que será criado por una persona LGBTQ+, así como personas LGBTQ+ que conciben niños que serán criados por otros padres. @es
broader: LGBTQ+ family planning
narrower: Insemination
narrower: In vitro fertilization
narrower: Self-insemination
narrower: Surrogacy
related: Birth parents
related: Desire to have children
related: Donors
related: LGBTQ+ parents
has top concept: LGBTQ+ family planning
replaces: ConceptionByLGBTQPeople
issued: 2019-05-14
modified: 2025-02-23
type: Concept
in scheme: v3
change note: Version 4.1.0

LGBTQ+ conscientious objection
preferred label: Objeción de conciencia LGBTQ+ @es
alternative label: LGBTQ conscientious objection
alternative label: Objeción de conciencia LGBTQ @es
comment: LGBTQ+ people exercising their right to refuse to perform military service or participate in same-sex marriages on the grounds of freedom of thought, conscience, and/or religion.
comment: Personas LGBTQ+ que ejercen su derecho a negarse a realizar el servicio militar o participar de matrimonios entre personas del mismo sexo por motivos de libertad de pensamiento, conciencia y/o religión. @es
broader: LGBTQ+ direct action
related: Same-sex marriage
has top concept: LGBTQ+ activism
replaces: LGBTQConscientiousObjection
issued: 2019-05-14
modified: 2025-02-23
type: Concept
in scheme: v3
change note: Version 4.1.0

LGBTQ+ cruises
preferred label: Cruceros LGBTQ+ @es
alternative label: LGBTQ cruises
alternative label: Cruceros LGBTQ @es
comment: Voyages on a ship taken for pleasure or as a vacation; use in reference to cruises catered toward LGBTQ+ clientele.
comment: Viajes en un barco realizados por placer o como vacaciones; utilícese en referencia a cruceros dirigidos a clientes LGBTQ+. @es
broader: LGBTQ+ tourism
has top concept: LGBTQ+ tourism
replaces: LGBTQCruises
issued: 2019-05-14
modified: 2025-02-23
type: Concept
in scheme: v3
change note: Version 4.1.0

LGBTQ+ dating websites
preferred label: Sitios web de citas LGBTQ+ @es
alternative label: LGBTQ dating websites
alternative label: Sitios web de citas LGBTQ @es
comment: Websites designed to generate connections between LGBTQ+ people interested in romantic or sexual relationships.
comment: Sitios web diseñados para generar conexiones entre personas LGBTQ+ interesadas en relaciones románticas o sexuales. @es
broader: LGBTQ+ websites
related: Dating applications
related: LGBTQ+ meeting places
related: Digital identification of LGBTQ+ people by police
related: LGBTQ+ dating
related: LGBTQ+ online dating
has top concept: LGBTQ+ websites
replaces: LGBTQDatingWebsites
issued: 2019-05-14
modified: 2025-04-01
type: Concept
in scheme: v3
change note: Version 4.1.0

LGBTQ+ death and dying
preferred label: Morir y la muerte LGBTQ+ @es
alternative label: LGBTQ death and dying
alternative label: El proceso de morir y la muerte LGBTQ+ @es
comment: Experiences related to LGBTQ+ people approaching or having reached the end of their lives.
comment: Experiencias relacionadas con personas LGBTQ+ que se acercan o han llegado al final de sus vidas. @es
narrower: LGBTQ+ suicide
related: LGBTQ+ death notices
related: LGBTQ+ obituaries
related: Terminal care (AIDS)
related: AIDS death and dying
replaces: LGBTQDeathAndDying
issued: 2019-05-14
modified: 2025-02-23
type: Concept
in scheme: v3
change note: Version 4.1.0

LGBTQ+ death notices
preferred label: Obituarios LGBTQ+ @es
alternative label: LGBTQ death announcements
alternative label: LGBTQ death notices
alternative label: Avisos de muerte LGBTQ || @es
comment: Public announcements in periodicals, online information centers, or social media about the death of an LGBTQ+ person, typically including details about funerals and memorial services.
comment: Anuncios públicos en publicaciones periódicas, centros de información en línea o redes sociales sobre la muerte de una persona LGBTQ+, que generalmente incluyen detalles sobre funerales y servicios conmemorativos. @es
related: LGBTQ+ death and dying
related: LGBTQ+ obituaries
related: AIDS death and dying
replaces: LGBTQDeathNotices
issued: 2019-05-14
modified: 2025-02-23
type: Concept
in scheme: v3
change note: Version 4.1.0

LGBTQ+ defamation campaigns
preferred label: Campañas de difamación LGBTQ+ @es
alternative label: LGBTQ smear campaigns
alternative label: LGBTQ defamation campaigns
comment: Publication and dissemination of false statements about LGBTQ+ people, groups, or communities in order to harm their reputations.
comment: Publicación y difusión de declaraciones falsas sobre personas, grupos o comunidades LGBTQ+ con el fin de dañar su reputación. @es
broader: LGBTQ+ persecutions
related: Hate speech
has top concept: LGBTQ+ persecutions
replaces: LGBTQDefamationCampaigns
issued: 2019-05-14
modified: 2025-02-23
type: Concept
in scheme: v3
change note: Version 4.1.0

LGBTQ+ demonstrations
preferred label: Manifestaciones LGBTQ+ @es
alternative label: Marches (LGBTQ)
alternative label: LGBTQ+ rallies
alternative label: Rallies (LGBTQ)
alternative label: Demonstrations (LGBTQ)
alternative label: LGBTQ+ protests
alternative label: Protests (LGBTQ)
alternative label: Marchas políticas LGBTQ @es
alternative label: Protestas LGBTQ @es
alternative label: Concentraciones LGBTQ @es
alternative label: Demostraciones LGBTQ+ @es
comment: Marches, rallies, and other large, public gatherings organized to protest discrimination against LGBTQ+ people and advocate for LGBTQ+ visibility, rights, and issues. For street processions of people recognizing and celebrating LGBTQ+ people and culture, use the term "Pride parades."
comment: Acción tomada por grandes grupos de personas en protesta por la discriminación o en apoyo a personas, comunidades, temas o derechos LGBTQ+; típicamente incluye marchas y concentraciones con oradores. @es
broader: LGBTQ+ action campaigns
narrower: Zaps
narrower: Lesbian demonstrations
narrower: Gay demonstrations
narrower: Bisexual demonstrations
narrower: Transgender demonstrations
narrower: Queer demonstrations
narrower: Intersex demonstrations
related: LGBTQ+ riots
related: LGBTQ+ movement
related: Pride parades
related: Two-Spirit demonstrations
has top concept: LGBTQ+ activism
replaces: LGBTQDemonstrations
issued: 2019-05-14
modified: 2025-04-23
type: Concept
in scheme: v3
change note: Version 4.1.0

LGBTQ+ mystery and detective fiction
preferred label: Ficción LGBTQ+ de misterio y de detectives @es
alternative label: Mystery and detective fiction (LGBTQ)
comment: Written literary works about the investigation of crime or the work of detectives; use in reference to mystery and detective fiction focusing on LGBTQ+ characters and themes.
comment: Obras literarias escritas sobre la investigación de crímenes o el trabajo de detectives; utilícese en referencia a la ficción de misterio y de detectives centrada en personajes y temas LGBTQ+. @es
broader: LGBTQ+ fiction
narrower: Lesbian mystery and detective fiction
narrower: Gay mystery and detective fiction
narrower: Bisexual mystery and detective fiction
narrower: Transgender mystery and detective fiction
narrower: Queer mystery and detective fiction
narrower: Asexual mystery and detective fiction
narrower: Demisexual mystery and detective fiction
narrower: Aromantic mystery and detective fiction
narrower: Intersex mystery and detective fiction
narrower: Megasexual mystery and detective fiction
narrower: Greyromantic mystery and detective fiction
narrower: Non-binary mystery and detective fiction
related: Māhū mystery and detective fiction
related: Two-Spirit mystery and detective fiction
has top concept: Subcultures
replaces: mysteryAndDetectiveFictionLGBTQ
issued: 2019-05-14
modified: 2025-02-23
type: Concept
in scheme: v3
change note: Version 4.1.0

LGBTQ+ direct action
preferred label: Acción directa LGBTQ+ @es
alternative label: LGBTQ direct action
comment: Use to describe a group of LGBTQ+ people taking action that is intended to reveal an existing problem, highlight an alternative, or demonstrate a possible solution to a social issue.
comment: Utilícese para describir a un grupo de personas LGBTQ+ que toman medidas destinadas a revelar un problema existente, resaltar una alternativa o demostrar una posible solución a un problema social. @es
broader: LGBTQ+ activism
narrower: LGBTQ+ action campaigns
narrower: LGBTQ+ civil disobedience
narrower: LGBTQ+ conscientious objection
narrower: LGBTQ+ lobbying
narrower: LGBTQ+ nonviolent resistance
narrower: LGBTQ+ petitions
narrower: LGBTQ+ self-defense
narrower: Outing (LGBTQ+ culture)
related: Europride
has top concept: LGBTQ+ activism
replaces: LGBTQDirectAction
issued: 2019-05-14
modified: 2025-04-17
type: Concept
in scheme: v3
change note: Version 4.1.0

LGBTQ+ divorce
preferred label: Divorcio LGBTQ+ @es
alternative label: LGBTQ divorce
comment: Legal dissolution of marriages involving one or more LGBTQ+ people.
comment: Disolución legal de matrimonios que involucran a una o más personas LGBTQ+. @es
broader: LGBTQ+ separation
broader: Marriage
narrower: Same-sex divorce
related: Child custody
related: Divorced people
has top concept: Living arrangements
replaces: LGBTQDivorce
issued: 2019-05-14
modified: 2025-02-23
type: Concept
in scheme: v3
change note: Version 4.1.0

LGBTQ+ domestic violence
preferred label: Violencia doméstica LGBTQ+ @es
alternative label: LGBTQ domestic violence
comment: Acts of violence and abuse directed toward individuals in private, domestic settings; can be used to describe singular or repeated incidents.
comment: Actos de violencia y abuso dirigidos a personas en entornos domésticos y privados; se puede utilizar para describir incidentes singulares o repetidos. @es
broader: Anti-LGBTQ+ violence
broader: Sexual violence
narrower: Intimate partner violence
related: Consent
related: LGBTQ+ sexual abuse
related: LGBTQ+ victims of sexual abuse
related: LGBTQ+ partners
related: Sexual assault
related: Significant others
related: LGBTQ+ survivors of sexual abuse
has top concept: Anti-LGBTQ+ violence
replaces: LGBTQDomesticViolence
issued: 2019-05-14
modified: 2025-02-23
type: Concept
in scheme: v3
change note: Version 4.1.0

LGBTQ+ older people's organizations
preferred label: Organizaciones para personas LGBTQ+ en su tercera edad @es
preferred label: LGBTQ+ older people's organisations
alternative label: Organizaciones para personas envejecientes LGBTQ+ @es
alternative label: Organizaciones para personas LGBTQ+ de tercera edad @es
alternative label: Organizaciones para personas en su tercera edad (LGBTQ) @es
comment: Organized groups that serve the needs and interests of older LGBTQ+ people, typically those 60 years and older.
comment: Grupos organizados que atienden las necesidades y los intereses de personas mayores LGBTQ+, generalmente aquellas de 60 años o más. @es
broader: LGBTQ+ clubs and organizations
related: LGBTQ+ older people
has top concept: LGBTQ+ clubs and organizations
replaces: LGBTQOlderPeoplesOrganisations
issued: 2019-05-14
modified: 2025-02-23
type: Concept
in scheme: v3
change note: Version 4.1.0

LGBTQ+ emancipation
preferred label: Emancipación LGBTQ+ @es
alternative label: LGBTQ emancipation
alternative label: Emancipación LGBTQ @es
comment: Term used to describe efforts to obtain LGBTQ+ political rights or equality.
comment: Término utilizado para describir los esfuerzos para obtener igualdad o derechos políticos LGBTQ+. @es
broader: LGBTQ+ social processes
related: Gay liberation
has top concept: LGBTQ+ social processes
replaces: LGBTQEmancipation
issued: 2019-05-14
modified: 2025-02-23
type: Concept
in scheme: v3
change note: Version 4.1.0

LGBTQ+ emotions
preferred label: LGBTQ+ intimacy
preferred label: Intimidad LGBTQ+ @es
alternative label: LGBTQ emotions
alternative label: LGBTQ intimacy
alternative label: Intimidad LGBTQ @es
is replaced by: homoit0000889
replaces: LGBTQEmotions
replaces: LGBTQIntimacy
issued: 2019-05-14
modified: 2022-10-13
modified: 2025-02-23
type: Concept
in scheme: v3
change note: Version 4.1.0
comment: Feelings of close familiarity or connection between two or more LGBTQ+ people that can be romantic, sexual, or platonic in nature. Can be used to describe the particularities of intimacy as experienced by LGBTQ+ people, as well as the ways intimacy is discussed and expressed within LGBTQ+ communities.
comment: Sentimientos de estrecha familiaridad o una conexión entre dos o más personas LGBTQ+ que pueden ser de naturaleza romántica, sexual o platónica. Puede utilizarse para describir las particularidades de la intimidad experimentada por las personas LGBTQ+, así como las formas en que se discute y expresa la intimidad dentro de las comunidades LGBTQ+. @es

LGBTQ+ erotic literature
preferred label: Literatura erótica LGBTQ+ @es
alternative label: Erotic literature (LGBTQ)
alternative label: Literatura erótica (LGBTQ) @es
comment: Literary works that have erotic or sexual elements; use in reference to erotic literature focusing on LGBTQ+ characters or themes.
comment: Obras literarias que tengan elementos eróticos o sexuales; utilícese en referencia a literatura erótica centrada en personajes o temas LGBTQ+. @es
broader: Erotica
broader: LGBTQ+ fiction
narrower: Lesbian erotic literature
narrower: Gay erotic literature
narrower: Bisexual erotic literature
narrower: Transgender erotic literature
narrower: Queer erotic literature
narrower: Asexual erotic literature
narrower: Intersex erotic literature
narrower: Demisexual erotic literature
narrower: Aromantic erotic literature
narrower: Megasexual erotic literature
narrower: Greyromantic erotic literature
narrower: Non-binary erotic literature
related: Hentai
related: Mpreg
related: Original slash fiction
related: Slash fiction
related: Māhū erotic literature
related: Two-Spirit erotic literature
has top concept: Erotica
replaces: eroticLiteratureLGBTQ
issued: 2019-05-14
modified: 2025-02-23
type: Concept
in scheme: v3
change note: Version 4.1.0

LGBTQ+ people of shared ethnic or national identities
preferred label: Personas LGBTQ+ en grupos étnicos @es
alternative label: LGBTQ+ people in ethnic groups
alternative label: LGBTQ+ people by ethnicity
alternative label: LGBTQ+ people by nationality
alternative label: LGBTQ+ ethnic people
alternative label: Ethnic LGBTQ+ people
alternative label: Ethnic people (LGBTQ)
comment: Umbrella term for groups of LGBTQ+ people who share an ethnic or national identity, including a common nationality, country of citizenship, ancestry, culture, language, ethno-religion, etc. Use more specific terms whenever possible. Do not use to describe migrants or immigrants as a whole.
comment: Grupos de personas que comparten una identidad basada en una nacionalidad, cultura, ascendencia, idioma, religión, etc. en común y que también se autoidentifican como LGBTQ+. No debe utilizarse para describir a personas migrantes. @es
broader: LGBTQ+ people
narrower: Jewish LGBTQ+ people
narrower: Romani LGBTQ+ people
narrower: Pacific Islander American LGBTQ+ people
narrower: Chicano/a/x LGBTQ+ people
narrower: Arab LGBTQ+ people
narrower: South Asian LGBTQ+ people
narrower: Assamese LGBTQ+ people
narrower: Awadhi LGBTQ+ people
narrower: Bhojpuri LGBTQ+ people
narrower: Bengali LGBTQ+ people
narrower: Bhil LGBTQ+ people
narrower: Chakma LGBTQ+ people
narrower: Kho LGBTQ+ people
narrower: Maldivian LGBTQ+ people
narrower: Dogra LGBTQ+ people
narrower: Garhwali LGBTQ+ people
narrower: Gujarati LGBTQ+ people
narrower: Haryanvi LGBTQ+ people
narrower: Kalash LGBTQ+ people
narrower: Kashmiri LGBTQ+ people
narrower: Konkan LGBTQ+ people
narrower: Kumaoni LGBTQ+ people
narrower: Kutchi LGBTQ+ people
narrower: Armenian LGBTQ+ people
narrower: Belarusian LGBTQ+ people
narrower: Russian LGBTQ+ people
narrower: Ukrainian LGBTQ+ people
narrower: Hispanic LGBTQ+ people
narrower: Indigenous LGBTQ+ people
narrower: Latino/a/x LGBTQ+ people
narrower: Sámi LGBTQ+ people
related: Intersectionality
related: LGBTQ+ migrants
related: Social privilege
related: Undocumented LGBTQ+ residents
has top concept: LGBTQ+ people
replaces: LGBTQEthnicGroups
issued: 2019-05-14
modified: 2026-02-26
type: Concept
in scheme: v3
change note: Version 4.1.0

LGBTQ+ veterans
preferred label: Veteranos LGBTQ+ @es
alternative label: LGBTQ ex-military personnel
alternative label: LGBTQ veterans
comment: LGBTQ+ people who have served in but are no longer active members of the military or armed forces.
comment: Personas LGBTQ+ que han servido pero que ya no son miembros activos del ejército o de las fuerzas armadas. @es
broader: LGBTQ+ people
related: LGBTQ+ people in the military
has top concept: LGBTQ+ people
replaces: LGBTQVeterans
issued: 2019-05-14
modified: 2025-02-23
type: Concept
in scheme: v3
change note: Version 4.1.0

LGBTQ+ ex-partners
preferred label: Ex-parejas LGBTQ+ @es
alternative label: LGBTQ ex-partners
comment: Gender-neutral term for former sexual, romantic, or play partners who are also LGBTQ+.
comment: Término de género neutro para antiguas parejas sexuales, románticas o de juego que también son LGBTQ+. @es
broader: LGBTQ+ partners
has top concept: LGBTQ+ families
replaces: LGBTQExPartners
issued: 2019-05-14
modified: 2025-02-23
type: Concept
in scheme: v3
change note: Version 4.1.0

LGBTQ+ family planning
preferred label: Planificación familiar LGBTQ+ @es
alternative label: LGBTQ family planning
comment: The practice of determining the shape of a family by LGBTQ+ people.
comment: La práctica de determinar la forma de una familia por parte de personas LGBTQ+. @es
narrower: LGBTQ+ adoption
narrower: Conception by LGBTQ+ people
related: Desire to have children
related: Egg donors
related: LGBTQ+ families
related: LGBTQ+ adoptive parenthood
related: LGBTQ+ biological parents
related: LGBTQ+ foster parenthood
related: LGBTQ+ social parenthood
related: Motherhood
related: LGBTQ+ parents
related: Fatherhood
related: Sperm donors
replaces: LGBTQFamilyPlanning
issued: 2019-05-14
modified: 2025-02-23
type: Concept
in scheme: v3
change note: Version 4.1.0

LGBTQ+ fantasy fiction
preferred label: Ficción fantástica LGBTQ+ @es
alternative label: Fantasy fiction (LGBTQ)
comment: Genre that uses magic and other supernatural phenomena as a primary element of plot, theme, and/or setting; use for fantasy fiction focusing on LGBTQ+ characters or themes.
comment: Género que utiliza la magia y otros fenómenos sobrenaturales como elemento principal de la trama, el tema y/o el escenario; utilícese para ficción fantástica que se centre en personajes o temas LGBTQ+. @es
broader: LGBTQ+ fiction
narrower: Lesbian fantasy fiction
narrower: Gay fantasy fiction
narrower: Bisexual fantasy fiction
narrower: Transgender fantasy fiction
narrower: Queer fantasy fiction
narrower: Asexual fantasy fiction
narrower: Aromantic fantasy fiction
narrower: Intersex fantasy fiction
narrower: Demisexual fantasy fiction
narrower: Megasexual fantasy fiction
narrower: Greyromantic fantasy fiction
narrower: Non-binary fantasy fiction
narrower: LGBTQ+ urban fantasy fiction
related: LGBTQ+ science fiction
related: Māhū fantasy fiction
related: Two-Spirit fantasy fiction
has top concept: Subcultures
replaces: fantasyFictionLGBTQ
issued: 2019-05-14
modified: 2025-02-23
type: Concept
in scheme: v3
change note: Version 4.1.0

LGBTQ+ fatherhood
preferred label: Paternidad LGBTQ+ @es
alternative label: Fatherhood (LGBTQ)
alternative label: LGBTQ fatherhood
alternative label: Paternity (LGBTQ)
alternative label: LGBTQ+ paternity
comment: Fatherhood experiences, as experienced by LGBTQ+ people.
comment: Experiencias de paternidad, tal como las viven las personas LGBTQ+. @es
broader: LGBTQ+ adoptive families
broader: LGBTQ+ parenthood
related: Fathers
has top concept: LGBTQ+ families
replaces: LGBTQFatherhood
issued: 2019-05-14
modified: 2025-02-23
type: Concept
in scheme: v3
change note: Version 4.1.0

LGBTQ+ film censorship
preferred label: Censura de cine LGBTQ+ @es
alternative label: LGBTQ film censorship
comment: The suppression or prohibition of films by LGBTQ+ filmmakers or about LGBTQ+ people and issues; includes censorship due to religious, moral, political, or social objections.
comment: La supresión o prohibición de películas de cineastas LGBTQ+ o sobre personas y temas LGBTQ+; incluye censura por objeciones religiosas, morales, políticas o sociales. @es
broader: LGBTQ+ censorship
related: LGBTQ+ films
related: LGBTQ+ cinema
has top concept: Censorship
replaces: LGBTQFilmCensorship
issued: 2019-05-14
modified: 2025-02-23
type: Concept
in scheme: v3
change note: Version 4.1.0

LGBTQ+ film festivals
preferred label: Festivales de cine LGBTQ+ @es
alternative label: LGBTQ film festivals
comment: Organized presentations of films in a single location, often with prizes awarded in various categories; use in reference to film festivals focusing on films created by LGBTQ+ people or featuring LGBTQ+ characters and themes.
comment: Presentaciones organizadas de películas en un solo lugar, a menudo con premios otorgados en varias categorías; utilícese en referencia a festivales de cine que se centran en películas creadas por personas LGBTQ+ o que presentan personajes y temas LGBTQ+. @es
narrower: Lesbian film festivals
narrower: Gay film festivals
narrower: Bisexual film festivals
narrower: Transgender film festivals
narrower: Queer film festivals
narrower: Non-binary film festivals
narrower: Intersex film festivals
related: LGBTQ+ films
related: LGBTQ+ cinema
related: Two-Spirit film festivals
replaces: LGBTQFilmFestivals
issued: 2019-05-14
modified: 2025-02-23
type: Concept
in scheme: v3
change note: Version 4.1.0

LGBTQ+ films
preferred label: Películas LGBTQ+ @es
alternative label: LGBTQ films
comment: Series of moving images edited to tell a story or capture an event; use in reference to films focusing on LGBTQ+ characters or themes.
comment: Serie de imágenes en movimiento editadas para contar una historia o capturar un evento; utilícese en referencia a películas centradas en personajes o temas LGBTQ+. @es
broader: LGBTQ+ cinema
narrower: LGBTQ+ home movies
narrower: Lesbian films
narrower: Gay films
narrower: Transgender films
narrower: Queer films
narrower: Bisexual films
narrower: LGBTQ+ erotic films
narrower: Intersex films
narrower: Aromantic films
narrower: Asexual films
narrower: Demisexual films
narrower: LGBTQ+ documentaries
related: LGBTQ+ porn films
related: LGBTQ+ characters
related: LGBTQ+ arts
related: LGBTQ+ film censorship
related: LGBTQ+ film festivals
related: Actorfic
related: Two-Spirit films
has top concept: Subcultures
replaces: LGBTQFilms
issued: 2019-05-14
modified: 2025-02-23
type: Concept
in scheme: v3
change note: Version 4.1.0

LGBTQ+ foster families
preferred label: Familas de acogida LGBTQ+ @es
alternative label: LGBTQ foster families
comment: Families including foster children in which one or more individuals identify as LGBTQ+.
comment: Familias que incluyen niños de acogida en las que una o más personas se autoidentifican como LGBTQ+. @es
broader: LGBTQ+ families
narrower: LGBTQ+ foster parents
related: Child custody
related: LGBTQ+ adoption
related: LGBTQ+ adoptive parenthood
related: LGBTQ+ parenthood
related: LGBTQ+ parents
has top concept: LGBTQ+ families
replaces: LGBTQFosterFamilies
issued: 2019-05-14
modified: 2025-02-23
type: Concept
in scheme: v3
change note: Version 4.1.0

LGBTQ+ foster parenthood
preferred label: Maternidad y paternidad de acogida LGBTQ+ @es
alternative label: LGBTQ foster parenthood
alternative label: Maternidad de acogida LGBTQ+ @es
alternative label: Paternidad de acogida LGBTQ+ @es
comment: The experiences involved in foster parenting, as experienced by LGBTQ+ people.
comment: Las experiencias involucradas en la crianza de acogida, tal como las viven las personas LGBTQ+. @es
broader: LGBTQ+ parenthood
related: LGBTQ+ families
related: LGBTQ+ adoptive parenthood
related: LGBTQ+ family planning
related: LGBTQ+ social parenthood
related: Motherhood
related: Fatherhood
has top concept: LGBTQ+ parenthood
replaces: LGBTQFosterParenthood
issued: 2019-05-14
modified: 2025-02-23
type: Concept
in scheme: v3
change note: Version 4.1.0

LGBTQ+ foster parents
preferred label: Madres y padres de acogida LGBTQ+ @es
alternative label: LGBTQ foster parents
alternative label: Madres de acogida LGBTQ+ @es
alternative label: Padres de acogida LGBTQ+ @es
comment: Foster parents who are LGBTQ+ people.
comment: Padres y/o madres adoptivos que sean personas LGBTQ+. @es
broader: LGBTQ+ families
broader: LGBTQ+ foster families
broader: LGBTQ+ parents
related: LGBTQ+ adoptive parents
has top concept: LGBTQ+ families
replaces: LGBTQFosterParents
issued: 2019-05-14
modified: 2025-02-23
type: Concept
in scheme: v3
change note: Version 4.1.0

LGBTQ+ friendliness
preferred label: Amabilidad LGBTQ+ @es
alternative label: LGBTQ friendliness
comment: Places, policies, people, or institutions that are open and welcoming to LGBTQ+ people.
comment: Lugares, políticas, personas o instituciones abiertas y acogedoras para las personas LGBTQ+. @es
related: Allies
related: Gay-straight alliances
related: Pinkwashing
related: LGBTQ+ safe spaces
replaces: LGBTQFriendliness
issued: 2019-05-14
modified: 2025-02-23
type: Concept
in scheme: v3
change note: Version 4.1.0

LGBTQ+ graphic novels
preferred label: Novelas gráficas LGBTQ+ @es
alternative label: LGBTQ graphic novels
comment: Works consisting of sequential images often accompanied by text that generally contain stand-alone stories; used in reference to graphic novels focusing on LGBTQ+ characters or themes.
comment: Obras que consisten en imágenes secuenciales, a menudo acompañadas de texto, que generalmente contienen historias independientes; utilizado en referencia a novelas gráficas que se centran en personajes o temas LGBTQ+. @es
broader: LGBTQ+ fiction
broader: LGBTQ+ comics
narrower: Asexual graphic novels
narrower: Demisexual graphic novels
narrower: Aromantic graphic novels
narrower: Intersex graphic novels
narrower: Non-binary graphic novels
narrower: Gay graphic novels
narrower: Lesbian graphic novels
narrower: Bisexual graphic novels
narrower: Megasexual graphic novels
narrower: Transgender graphic novels
narrower: Queer graphic novels
related: Māhū graphic novels
related: Two-Spirit graphic novels
related: LGBTQ+ cartoonists
has top concept: Subcultures
replaces: LGBTQGraphicNovels
issued: 2019-05-14
modified: 2025-03-13
type: Concept
in scheme: v3
change note: Version 4.1.0

Romani LGBTQ+ people
preferred label: Personas LGBTQ+ romaníes @es
alternative label: Roma (LGBTQ)
alternative label: Romani people (LGBTQ)
alternative label: LGBTQ+ Roma
alternative label: LGBTQ+ Romani people
alternative label: Personas romaníes LGBTQ+ @es
comment: LGBTQ+ people who are Romani, or part of the traditionally nomadic Indo-European people.
comment: Personas LGBTQ+ que son romaníes o parte del pueblo indoeuropeo tradicionalmente nómada. @es
broader: LGBTQ+ people of shared ethnic or national identities
narrower: Romani lesbians
narrower: Romani gay men
narrower: Romani bisexual people
narrower: Romani transgender people
narrower: Romani queer people
narrower: Romani intersex people
narrower: Romani asexual people
narrower: Romani non-binary people
has top concept: LGBTQ+ people
replaces: LGBTQRoma
issued: 2019-05-14
modified: 2026-02-11
type: Concept
in scheme: v3
change note: Version 4.1.0

LGBTQ+ health care centers
preferred label: Centros de salud LGBTQ+ @es
preferred label: LGBTQ+ health care centres
comment: Institutions providing health services for LGBTQ+ people.
comment: Instituciones que brindan servicios de salud para personas LGBTQ+. @es
broader: LGBTQ+ centers
related: Health care for LGBTQ+ people
has top concept: LGBTQ+ centers
replaces: LGBTQHealthCareCentres
issued: 2019-05-14
modified: 2025-02-23
type: Concept
in scheme: v3
change note: Version 4.1.0

LGBTQ+ health education
preferred label: Educación sanitaria LGBTQ+ @es
alternative label: LGBTQ health education
alternative label: Educación sanitaria (LGBTQ) @es
comment: Instruction about health for LGBTQ+ people, including topics such as gender-affirming healthcare and safer sex practices.
comment: Instrucción sobre la salud para personas LGBTQ+, incluidos temas como la atención médica de afirmación de género y prácticas sexuales más seguras. @es
broader: Information provision
has top concept: Information provision
replaces: LGBTQHealthEducation
issued: 2019-05-14
modified: 2025-02-23
type: Concept
in scheme: v3
change note: Version 4.1.0

LGBTQ+ historical terms
preferred label: Términos históricos LGBTQ+ @es
alternative label: LGBTQ historical terms
alternative label: Términos históricos LGBTQ @es
comment: Historical terms for LGBTQ+ people, identities, and practices that are now considered outdated and/or offensive.
comment: Términos históricos para personas, identidades y prácticas LGBTQ+ que ahora se consideran obsoletos y/u ofensivos. @es
narrower: Banjees
narrower: Berdache
narrower: Boston marriages
narrower: Sodomites
narrower: Clones (Gay culture)
narrower: Dandies
narrower: Eonism
narrower: Eonist people
narrower: Faggots
narrower: FtMs
narrower: Fricatrices
narrower: Homophiles
narrower: Homosexuals
narrower: Inverts
narrower: MtFs
narrower: Pederasts
narrower: Pederasty
narrower: Sea queens
narrower: Sexual inversion
narrower: Sodomy
narrower: Transvestites
narrower: Tribades
narrower: Uranians
narrower: Uranism
narrower: Tribadism
narrower: Hermaphrodites
narrower: Masquerading
narrower: GRID (Gay-Related Immune Deficiency)
narrower: Fairies (Gay culture)
narrower: Female impersonation shows
narrower: Male impersonation shows
related: LGBTQ+ history
replaces: LGBTQHistoricalTerms
issued: 2019-05-14
modified: 2025-02-23
type: Concept
in scheme: v3
change note: Version 4.1.0

LGBTQ+ unhoused people
preferred label: Personas LGBTQ+ sin hogar @es
alternative label: Unhoused people (LGBT)
alternative label: LGBTQ+ homeless people
alternative label: LGBTQ+ houseless people
alternative label: LGBTQ+ unsheltered people
comment: LGBTQ+ people who do not have access to stable, safe, and adequate housing; includes people living in emergency shelters; transitional housing, and on the street.
comment: Personas LGBTQ+ que no tienen acceso a una vivienda estable, segura y adecuada; incluye a personas que viven en refugios de emergencia, viviendas de transición y en la calle. @es
broader: LGBTQ+ people
narrower: LGBTQ+ unhoused youth
has top concept: LGBTQ+ people
replaces: LGBTQHomelessPeople
issued: 2019-05-14
modified: 2025-02-23
type: Concept
in scheme: v3
change note: Version 4.1.0

LGBTQ+ unhoused youth
preferred label: Jóvenes LGBTQ+ sin hogar @es
alternative label: LGBTQ+ homeless youth
alternative label: LGBTQ+ unhoused adolescents
alternative label: LGBTQ+ unhoused teenagers
alternative label: LGBTQ+ unsheltered youth
comment: LGBTQ+ people between the ages of childhood and adulthood who do not have access to stable, safe, and adequate housing; includes youth living in emergency shelters, transitional housing, and on the street.
comment: Personas LGBTQ+ entre las edades de la niñez y la edad adulta que no tienen acceso a una vivienda estable, segura y adecuada; incluye a jóvenes que viven en refugios de emergencia, viviendas de transición y en la calle. @es
broader: LGBTQ+ unhoused people
broader: LGBTQ+ youth
related: Aromantic youth
has top concept: LGBTQ+ people
replaces: LGBTQHomelessYouth
issued: 2019-05-14
modified: 2025-02-23
type: Concept
in scheme: v3
change note: Version 4.1.0

LGBTQ+ hotels
preferred label: Hoteles LGBTQ+ @es
alternative label: LGBTQ hotels
alternative label: Hoteles LGBTQ @es
comment: Establishments providing accommodations, meals, and other services for travelers; use in reference to hotels catering to LGBTQ+ people or commonly used by LGBTQ+ people.
comment: Establecimientos que brindan alojamiento, comidas y otros servicios a viajeros; utilícese en referencia a hoteles que atienden a personas LGBTQ+ o que son comúnmente utilizados por personas LGBTQ+. @es
narrower: LGBTQ+ resorts
related: LGBTQ+ tourism
replaces: LGBTQHotels
issued: 2019-05-14
modified: 2025-02-23
type: Concept
in scheme: v3
change note: Version 4.1.0

LGBTQIA
comment: Acronym used to describe describe lesbians, gay people, bisexuals, transgender people, queer people, intersex people, and asexual people as a group.
comment: Acrónimo utilizado para describir a lesbianas, hombres gay, personas bisexuales, personas transgénero, personas queer, personas intersexuales y personas asexuales como grupo. @es
narrower: LGB
narrower: LGBTQ
related: Asexuality
related: Bisexual community
related: Gay community
related: Intersex movement
related: Lesbian community
related: Queer community
related: Transgender community
replaces: LGBTQIA
issued: 2019-05-14
modified: 2025-02-23
type: Concept
in scheme: v3
change note: Version 4.1.0

LGBTQ+ immigration rights
preferred label: Derechos de inmigracion LGBTQ+ @es
alternative label: LGBTQ immigration rights
alternative label: Derechos de inmigración LGBTQ @es
alternative label: Derechos migratorios LGBTQ+ @es
comment: Legal and social entitlement to freedom, equality, and protection held by LGBTQ+ immigrants.
comment: Derecho legal y social a la libertad, la igualdad y la protección que tienen los inmigrantes LGBTQ+. @es
broader: Legal status
related: Detention of LGBTQ+ people
related: LGBTQ+ refugees
related: Official documentation
related: Passports
related: Undocumented LGBTQ+ residents
related: LGBTQ+ immigrants
related: LGBTQ+ asylum seekers
has top concept: Legal status
replaces: LGBTQImmigrationRights
issued: 2019-05-14
modified: 2025-02-23
type: Concept
in scheme: v3
change note: Version 4.1.0

LGBTQ+ incarceration
preferred label: Encarcelamiento LGBTQ+ @es
alternative label: LGBTQ+ imprisonment
alternative label: Incarceration (LGBTQ)
alternative label: Imprisonment (LGBTQ)
alternative label: Encarcelamiento LGBTQ @es
comment: The restraint of an LGBTQ+ person's liberty against their will, with or without legal process, whether by a government authority, institution, or extrajudicial actors. Generally, this refers to physical and/or legal confinement within a jail, prison, detention center, etc. It may also include the forced confinement of LGBTQ+ people within hospitals and other healthcare facilities.
comment: Confinamiento, incluida la restricción física y/o legal, de personas LGBTQ+ por parte de una institución o autoridad. Típicamente se utiliza para describir el confinamiento en una prisión pública o privada sentenciado por un tribunal dentro de un sistema penal. @es
broader: Detention of LGBTQ+ people
related: LGBTQ+ incarcerated people
has top concept: Detention of LGBTQ+ people
replaces: LGBTQImprisonment
issued: 2019-05-14
modified: 2025-04-17
type: Concept
in scheme: v3
change note: Version 4.1.0

LGBTQ+ incest victims
preferred label: Víctimas LGBTQ+ de incesto @es
alternative label: LGBTQ victims of incest
alternative label: LGBTQ incest victims
comment: LGBTQ+ people who have experienced incest and may or may not have survived; follow individuals' preference for "victims" or "survivors" whenever possible.
comment: Personas LGBTQ+ que han sufrido el incesto y que pueden o no haber sobrevivido; siga la preferencia de la persona sobre el uso de "víctimas" o "sobrevivientes" siempre que sea posible. @es
broader: LGBTQ+ victims of sexual abuse
narrower: LGBTQ+ incest survivors
has top concept: LGBTQ+ people
replaces: LGBTQIncestVictims
issued: 2019-05-14
modified: 2025-02-23
type: Concept
in scheme: v3
change note: Version 4.1.0

Indigenous LGBTQ+ people
preferred label: Personas LGBTQ+ indígenas @es
alternative label: Indigenous people (LGBTQ)
alternative label: LGBTQ+ Indigenous people
alternative label: Personas indígenas LGBTQ+ @es
comment: LGBTQ+ people who are part of an Indigenous people, or culturally distinct ethnic group whose members are directly descended from the earliest known inhabitants of a particular region and, to some extent, maintain the language and culture of those people. Only use to describe people who identify as Indigenous; use more specific terms whenever possible.
comment: Personas LGBTQ+ que forman parte de un pueblo indígena o grupo étnico culturalmente distinto cuyos miembros descienden directamente de los primeros habitantes conocidos de una región en particular y, hasta cierto punto, mantienen el idioma y la cultura de esas personas. Utilícese únicamente para describir a personas que se autoidentifiquen como indígenas; utilícese términos más específicos siempre que sea posible. @es
broader: LGBTQ+ people of color
broader: LGBTQ+ people of shared ethnic or national identities
narrower: Aboriginal Australian LGBTQ+ people
narrower: Inuit LGBTQ+ people
narrower: Takatāpui
narrower: Papuan LGBTQ+ people
narrower: Native American LGBTQ+ people
narrower: Indigiqueer people
narrower: Kānaka Maoli LGBTQ+ people
narrower: Indigenous lesbians
narrower: Indigenous gay men
narrower: Indigenous bisexual people
narrower: Indigenous transgender people
narrower: Indigenous queer people
narrower: Indigenous intersex people
narrower: Indigenous asexual people
narrower: Palestinian LGBTQ+ people
narrower: Central American Indigenous LGBTQ+ people
narrower: South American Indigenous LGBTQ+ people
narrower: Indigenous non-binary people
narrower: Pacific Islander American LGBTQ+ people
narrower: Two-Spirit people
narrower: Ainu LGBTQ+ people
narrower: Ryukyuan LGBTQ+ people
narrower: Sámi LGBTQ+ people
related: Ritual homosexuality
related: Police harassment of Indigenous LGBTQ+ people
related: Non-Euro-American gender and sexual identities
has top concept: LGBTQ+ people
replaces: LGBTQIndigenousPeople
issued: 2019-05-14
modified: 2025-04-24
type: Concept
in scheme: v3
change note: Version 4.1.0

LGBTQ+ incarcerated people
preferred label: Prisioneros LGBTQ+ @es
alternative label: Prisoners (LGBTQ)
alternative label: LGBTQ+ inmates
alternative label: LGBTQ+ prisoners
alternative label: Incarcerated people (LGBTQ)
alternative label: Incarcerated LGBTQ+ people
alternative label: LGBTQ+ imprisoned people
alternative label: Imprisoned people (LGBTQ)
alternative label: Imprisoned LGBTQ+ people
alternative label: Prisioneros (LGBTQ) @es
comment: LGBTQ+ people whose liberty is restrained against their will, with or without legal process, whether by a government authority, institution, or extrajudicial actors. Generally, this refers to individuals subject to physical and/or legal confinement within a jail, prison, detention center, etc. It may also include LGBTQ+ people forcibly confined within hospitals and other healthcare facilities.
comment: Personas LGBTQ+ que son privadas de su libertad contra su voluntad por una institución o autoridad. Normalmente se utiliza para describir a personas condenadas a confinamiento en una prisión pública o privada por un tribunal dentro de un sistema penal, pero también puede incluir a personas confinadas por la fuerza en hospitales y otras instituciones. @es
broader: LGBTQ+ people
narrower: LGBTQ+ prisoners of conscience
related: Detention of LGBTQ+ people
related: LGBTQ+ incarceration
has top concept: LGBTQ+ people
replaces: LGBTQPrisoners
issued: 2019-05-14
modified: 2025-04-17
type: Concept
in scheme: v3
change note: Version 4.1.0

LGBTQ+ literary awards
preferred label: Premios literarios LGBTQ+ @es
alternative label: LGBTQ literary awards
alternative label: Premios literarios LGBTQ @es
comment: Prizes or forms of recognition given in honor of influential LGBTQ+ writers or literary works featuring LGBTQ+ characters and themes.
comment: Premios o formas de reconocimiento otorgados en honor a escritores o obras literarias LGBTQ+ influyentes que presenten personajes y temas LGBTQ+. @es
broader: LGBTQ+ awards
related: LGBTQ+ literature
has top concept: LGBTQ+ awards
replaces: LGBTQLiteraryAwards
issued: 2019-05-14
modified: 2025-02-23
type: Concept
in scheme: v3
change note: Version 4.1.0

LGBTQ+ literary salons
preferred label: Salones literarios LGBTQ+ @es
alternative label: LGBTQ literary salons
alternative label: Salones literarios LGBTQ @es
comment: Social gatherings, typically hosted by a notable public figure, for discussing literature or other shared topics; use in reference to literary salons with primarily LGBTQ+ membership or literary salons focused on works featuring LGBTQ+ characters and themes.
comment: Reuniones sociales, normalmente organizadas por una figura pública destacada, para discutir literatura u otros temas compartidos; utilícese en referencia a salones literarios con membresía principalmente LGBTQ+ o salones literarios centrados en obras con personajes y temas LGBTQ+. @es
related: LGBTQ+ night life
related: LGBTQ+ literature
replaces: LGBTQLiterarySalons
issued: 2019-05-14
modified: 2025-02-23
type: Concept
in scheme: v3
change note: Version 4.1.0

LGBTQ+ lobbying
preferred label: Cabildeo LGBTQ+ @es
alternative label: LGBTQ lobbying
alternative label: Cabildeo LGBTQ @es
alternative label: Lobbying LGBTQ+ @es
alternative label: Lobbying LGBTQ @es
comment: Actions taken by individuals or groups to influence legislative action (or non-action), policies, or decisions of government officials in favor of LGBTQ+ people, communities, or issues.
comment: Acciones tomadas por personas o grupos para influir en la acción (o inacción) legislativa, las políticas o las decisiones de funcionarios gubernamentales, a favor de personas, comunidades o asuntos LGBTQ+. @es
broader: LGBTQ+ direct action
related: Law
has top concept: LGBTQ+ activism
replaces: LGBTQLobbying
issued: 2019-05-14
modified: 2025-02-23
type: Concept
in scheme: v3
change note: Version 4.1.0

LGBTQ+ lovers
preferred label: Amantes LGBTQ+ @es
alternative label: Lovers (LGBTQ)
alternative label: LGBTQ lovers
alternative label: Amantes LGBTQ @es
alternative label: Amantes (LGBTQ) @es
comment: LGBTQ+ people engaging in sexual or romantic relationships with other people; typically used to describe people who are not married.
comment: Personas LGBTQ+ que mantienen relaciones sexuales o románticas con otras personas; normalmente se utiliza para describir a personas que no están casadas. @es
broader: LGBTQ+ people
related: Fuck buddies
related: LGBTQ+ partners
related: Sexual relationships
related: Significant others
has top concept: LGBTQ+ people
replaces: LGBTQLovers
issued: 2019-05-14
modified: 2025-02-23
type: Concept
in scheme: v3
change note: Version 4.1.0

LGBTQ+ magazines
preferred label: Revistas LGBTQ+ @es
alternative label: LGBTQ magazines
alternative label: Revistas LGBTQ @es
comment: Print or digital publications about LGBTQ+ people and LGBTQ+ issues (typically produced by LGBTQ+ people or LGBTQ+ organizations) that contain articles, photographs, and illustrations, and advertisements.
comment: Publicaciones impresas o digitales sobre personas LGBTQ+ y temas LGBTQ+ (normalmente producidas por personas LGBTQ+ u organizaciones LGBTQ+) que contienen artículos, fotografías, ilustraciones y anuncios. @es
broader: LGBTQ+ press
broader: LGBTQ+ periodicals
related: Bisexual press
related: Gay press
related: Lesbian press
related: LGBTQ+ zines
related: LGBTQ+ newsletters
related: LGBTQ+ newspapers
related: Transgender press
has top concept: LGBTQ+ press
replaces: LGBTQMagazines
issued: 2019-05-14
modified: 2025-02-23
type: Concept
in scheme: v3
change note: Version 4.1.0

LGBTQ+ manga
preferred label: Manga LGBTQ+ @es
alternative label: LGBTQ manga
alternative label: Manga LGBTQ @es
comment: Japanese comics or graphic novels focused on LGBTQ+ people or themes.
comment: Cómics o novelas gráficas japonesas centradas en personas o temas LGBTQ+. @es
broader: LGBTQ+ comics
related: Anime and manga fandom
related: Hentai
has top concept: Subcultures
replaces: LGBTQMangas
issued: 2019-05-14
modified: 2025-02-23
type: Concept
in scheme: v3
change note: Version 4.1.0

Takatāpui
alternative label: LGBTQ+ Māori people
alternative label: Māori (LGBTQ)
alternative label: Māori LGBTQ+ people
alternative label: Personas LGBTQ+ Maori @es
alternative label: Personas LGBTQ+ Māori @es
comment: Term used by the Māori people, or people who are part of the Indigenous Polynesian people of mainland Aotearoa (New Zealand), that was historically used to describe an "intimate companion of the same sex." In the 1980s, the term was reclaimed for use by lesbian, gay, bisexual, transgender, queer, intersex people, and other members of Rainbow communities. Only use to refer to individuals who identify as Takatāpui.
comment: Término utilizado por el pueblo maorí, o personas que forman parte del pueblo indígena polinesio de la parte continental de Aotearoa (Nueva Zelanda), que históricamente se utilizó para describir a un "compañero íntimo del mismo sexo". En la década de 1980, el término fue reclamado para ser utilizado por personas lesbianas, gay, bisexuales, transgénero, queer, intersex y otros miembros de las comunidades arcoíris. Utilícese únicamente para referirse a personas que se identifiquen como takatāpui. @es
broader: Non-Euro-American gender and sexual identities
broader: Indigenous LGBTQ+ people
broader: Sexual minorities
related: Indigiqueer
has top concept: Gender
replaces: takatapui
issued: 2019-05-14
modified: 2025-02-23
type: Concept
in scheme: v3
change note: Version 4.1.0

LGBTQ+ marketing
preferred label: Marketing LGBTQ+ @es
alternative label: LGBTQ marketing
alternative label: Marketing LGBTQ @es
alternative label: Mercadeo LGBTQ+ @es
alternative label: Mercadotecnia LGBTQ+ @es
comment: Marketing strategies and campaigns specifically targeting LGBTQ+ people.
comment: Estrategias y campañas de marketing dirigidas específicamente a personas LGBTQ+. @es
related: Pinkwashing
related: Queerbaiting
replaces: LGBTQMarketing
issued: 2019-05-14
modified: 2025-02-23
type: Concept
in scheme: v3
change note: Version 4.1.0

LGBTQ+ meeting places
preferred label: Espacios de encuentro LGBTQ+ @es
alternative label: LGBTQ meeting places
alternative label: Espacios de reunión LGBTQ+ @es
alternative label: Espacios de encuentro LGBTQ @es
alternative label: Espacios de reunión LGBTQ @es
comment: Physical or online spaces in which LGBTQ+ people meet.
comment: Espacios físicos o en línea en los que se encuentran personas LGBTQ+. @es
narrower: LGBTQ+ bars
narrower: LGBTQ+ beaches
narrower: LGBTQ+ community centers
narrower: LGBTQ+ spaces
related: Cruising (LGBTQ+ culture)
related: Dating applications
related: LGBTQ+ dating websites
related: Europride
related: LGBTQ+ night life
related: LGBTQ+ social media
related: Sex locations
related: Public sex
related: Fandom conventions
related: Furry conventions
related: Slash conventions
replaces: LGBTQMeetingPlaces
issued: 2019-05-14
modified: 2025-02-23
type: Concept
in scheme: v3
change note: Version 4.1.0

LGBTQ+ memorials
preferred label: Memoriales LGBTQ+ @es
alternative label: LGBTQ memorials
alternative label: Memoriales LGBTQ @es
comment: Projects, events, monuments, and sculptures created to memorialize or celebrate LGBTQ+ people, communities, or events.
comment: Proyectos, eventos, monumentos y esculturas creadas para conmemorar o celebrar a personas, comunidades o eventos LGBTQ+. @es
narrower: Transgender Day of Remembrance
related: AIDS memorial quilts
related: AIDS memorials
related: LGBTQ+ history
replaces: LGBTQMemorials
issued: 2019-05-14
modified: 2025-02-23
type: Concept
in scheme: v3
change note: Version 4.1.0

LGBTQ+ migrants
preferred label: Migrantes LGBTQ+ @es
alternative label: Migrants (LGBTQ)
alternative label: LGBTQ migrants
alternative label: Migrantes LGBTQ @es
alternative label: Migrantes (LGBTQ) @es
comment: LGBTQ+ people who temporarily or permanently move away from their place of residence within a country or across an international border.
comment: Personas LGBTQ+ que se mudan temporal o permanentemente de su lugar de residencia dentro de un país o a través de una frontera internacional. @es
broader: LGBTQ+ people
related: LGBTQ+ people of shared ethnic or national identities
related: LGBTQ+ refugees
related: Undocumented LGBTQ+ residents
related: LGBTQ+ immigrants
related: LGBTQ+ asylum seekers
has top concept: LGBTQ+ people
replaces: LGBTQMigrants
issued: 2019-05-14
modified: 2025-02-23
type: Concept
in scheme: v3
change note: Version 4.1.0

Multiracial LGBTQ+ people
preferred label: Personas LGBTQ+ multirraciales @es
alternative label: Multi-racial people (LGBTQ)
alternative label: Multiracial people (LGBTQ)
alternative label: LGBTQ+ mixed-race people
alternative label: LGBTQ+ multi-racial people
alternative label: LGBTQ+ multiracial people
alternative label: Mixed-race LGBTQ+ people
alternative label: Multi-racial LGBTQ+ people
alternative label: Personas multirraciales LGBTQ+ @es
comment: LGBTQ+ people who belong to more than one racial group.
comment: Personas LGBTQ+ que pertenecen a dos o más de un grupos raciales. Utilícese únicamente para personas que se autoidentifiquen como multirraciales. @es
broader: LGBTQ+ people of color
narrower: Multiracial lesbians
narrower: Multiracial gay men
narrower: Multiracial bisexual people
narrower: Multiracial transgender people
narrower: Multiracial queer people
narrower: Multiracial asexual people
narrower: Multiracial intersex people
narrower: Multiracial non-binary people
has top concept: LGBTQ+ people
replaces: LGBTQMultiRacialPeople
issued: 2019-05-14
modified: 2025-02-23
type: Concept
in scheme: v3
change note: Version 4.1.0

LGBTQ+ Mormons
preferred label: Mormones LGBTQ+ @es
alternative label: Mormons (LGBTQ)
alternative label: LGBTQ Mormons
alternative label: Mormones LGBTQ @es
alternative label: Mormones (LGBTQ) @es
comment: LGBTQ+ people who are members of the Mormon Church.
comment: Personas LGBTQ+ que son miembros de la Iglesia mormona. @es
broader: LGBTQ+ Christians
has top concept: LGBTQ+ African religions
replaces: LGBTQMormons
issued: 2019-05-14
modified: 2025-02-23
type: Concept
in scheme: v3
change note: Version 4.1.0

LGBTQ+ motherhood
preferred label: Maternidad LGBTQ+ @es
alternative label: LGBTQ motherhood
alternative label: Maternity (LGBTQ)
alternative label: Motherhood (LGBTQ)
alternative label: LGBTQ+ maternity
alternative label: Maternidad LGBTQ @es
alternative label: Maternidad (LGBTQ) @es
comment: Motherhood experiences, as experienced by LGBTQ+ people.
comment: Experiencias de maternidad, tal como las viven las personas LGBTQ+. @es
broader: LGBTQ+ adoptive families
broader: LGBTQ+ parenthood
related: Motherhood
related: Mothers
has top concept: LGBTQ+ families
replaces: LGBTQMotherhood
issued: 2019-05-14
modified: 2025-02-23
type: Concept
in scheme: v3
change note: Version 4.1.0

LGBTQ+ motorcycle clubs
preferred label: Clubs de Motociclistas LGBTQ+ @es
alternative label: LGBTQ motorcycle clubs
alternative label: Moto Clubs LGBTQ+ @es
alternative label: Clubs de Moteros LGBTQ+ @es
alternative label: Clubs de motoreros LGBTQ+ @es
comment: Organized groups of LGBTQ+ people formed around shared interest in and activities related to motorcycles.
comment: Grupos organizados de personas LGBTQ+ que se forman en torno a intereses compartidos y actividades relacionadas con las motocicletas. @es
broader: LGBTQ+ clubs and organizations
related: Dykes on bikes
related: Leather community
related: Leather and kink clubs
has top concept: LGBTQ+ clubs and organizations
replaces: LGBTQMotorcycleClubs
issued: 2019-05-14
modified: 2025-02-23
type: Concept
in scheme: v3
change note: Version 4.1.0

LGBTQ+ museums
alternative label: LGBTQ museums
broader: LGBTQ+ cultural heritage institutions
narrower: Asexual museums
narrower: Intersex museums
has top concept: LGBTQ+ cultural heritage institutions
is replaced by: homoit0001030
replaces: LGBTQMuseums
issued: 2019-05-14
modified: 2023-06-30
type: Concept
in scheme: v3
change note: Version 4.1.0

LGBTQ+ musicians
preferred label: Músicos LGBTQ+ @es
alternative label: Musicians (LGBTQ)
alternative label: LGBTQ musicians
alternative label: Músicos LGBTQ @es
alternative label: Músicos (LGBTQ) @es
comment: LGBTQ+ people who create and/or perform music.
comment: Personas LGBTQ+ que crean y/o interpretan música. @es
broader: LGBTQ+ people
related: LGBTQ+ arts
related: LGBTQ+ choruses
related: Bandslash
related: LGBTQ+ music
has top concept: LGBTQ+ people
replaces: LGBTQMusicians
issued: 2019-05-14
modified: 2026-02-24
type: Concept
in scheme: v3
change note: Version 4.1.0

LGBTQ+ night life
preferred label: Vida nocturna LGBTQ+ @es
alternative label: LGBTQ night life
alternative label: Vida nocturna (LGBTQ) @es
comment: Nighttime social activities and entertainment catering to LGBTQ+ people, often located at bars and clubs.
comment: Actividades sociales nocturnas y entretenimiento para personas LGBTQ+, a menudo ubicadas en bares y discotecas. @es
narrower: Gay saunas
narrower: Gay discos
related: LGBTQ+ bars
related: LGBTQ+ literary salons
related: LGBTQ+ meeting places
related: LGBTQ+ restaurants
related: Police raids on LGBTQ+ nightclubs
replaces: LGBTQNightLife
issued: 2019-05-14
modified: 2026-02-23
type: Concept
in scheme: v3
change note: Version 4.1.0

LGBTQ+ nonviolent resistance
preferred label: Resistencia no violenta LGBTQ+ @es
alternative label: LGBTQ nonviolent resistance
alternative label: Resistencia no violenta (LGBTQ) @es
comment: Actions taken to promote social change for LGBTQ+ people and communities through non-violent means, including protests, boycotts, and organized non-cooperation.
comment: Acciones tomadas para promover el cambio social para las personas y comunidades LGBTQ+ a través de medios no violentos, incluidas las protestas, los boicots y la no-cooperación organizada. @es
broader: LGBTQ+ direct action
has top concept: LGBTQ+ activism
replaces: LGBTQNonviolentResistance
issued: 2019-05-14
modified: 2025-02-23
type: Concept
in scheme: v3
change note: Version 4.1.0

LGBTQ+ obituaries
preferred label: Obituarios LGBTQ+ @es
alternative label: LGBTQ obituaries
comment: Public notices published shortly after an LGBTQ+ person's death to inform others of their passing and celebrate their life.
comment: Avisos públicos publicados poco después de la muerte de una persona LGBTQ+ para informar a otras personas sobre su fallecimiento y celebrar su vida. @es
broader: LGBTQ+ newspapers
related: LGBTQ+ death and dying
related: LGBTQ+ death notices
related: AIDS death and dying
has top concept: LGBTQ+ press
replaces: LGBTQObituaries
issued: 2019-05-14
modified: 2025-02-23
type: Concept
in scheme: v3
change note: Version 4.1.0

LGBTQ+ Old Catholics
preferred label: Católicos antiguos LGBTQ+ @es
alternative label: LGBTQ+ Old Catholic Church
alternative label: Iglesia católica antigua LGBTQ+ @es
comment: LGBTQ+ members of the anti-papal-primacy Christian denomination that originated with groups that split from the Holy See because they disagreed with essential doctrines.
comment: Miembros LGBTQ+ de la denominación cristiana antiprimacía papal que se originó con grupos que se separaron de la Santa Sede porque no estaban de acuerdo con doctrinas esenciales. @es
broader: LGBTQ+ Christians
has top concept: LGBTQ+ African religions
replaces: LGBTQOldCatholicChurch
issued: 2019-05-14
modified: 2025-02-23
type: Concept
in scheme: v3
change note: Version 4.1.0

Papuan LGBTQ+ people
preferred label: Personas LGBTQ+ papúes @es
alternative label: Papuans (LGBTQ)
alternative label: Papuan people (LGBTQ)
alternative label: LGBTQ+ Papuan people
alternative label: LGBTQ+ Papuans
alternative label: Personas papúes LGBTQ+ @es
comment: LGBTQ+ people who are Papuan, or part of the Indigenous peoples of new Guinea; only use for people who identify as Papuan.
comment: Personas LGBTQ+ que son papúes o parte de los pueblos indígenas de Nueva Guinea. Utilícese únicamente para personas que se autoidentifiquen como papúes. @es
broader: Indigenous LGBTQ+ people
narrower: Papuan lesbians
narrower: Papuan gay men
narrower: Papuan bisexual people
narrower: Papuan transgender people
narrower: Papuan queer people
narrower: Papuan intersex people
narrower: Papuan asexual people
narrower: Papuan non-binary people
related: Indigiqueer people
related: Indigiqueer
has top concept: LGBTQ+ people
replaces: LGBTQPapuans
issued: 2019-05-14
modified: 2025-02-23
type: Concept
in scheme: v3
change note: Version 4.1.0

LGBTQ+ parenthood
preferred label: Maternidad y paternidad LGBTQ+ @es
alternative label: Parenting
alternative label: LGBTQ parenthood
alternative label: Paternidad LGBTQ+ @es
alternative label: Maternidad LGBTQ+ @es
comment: The experiences of being an LGBTQ+ parent and the responsibilities involved.
comment: Las experiencias de ser padre LGBTQ+ y las responsabilidades que implica. @es
narrower: Adoptive parenthood
narrower: Biological parenthood
narrower: LGBTQ+ adoptive parenthood
narrower: LGBTQ+ adoptive parents
narrower: LGBTQ+ co-parenthood
narrower: LGBTQ+ fatherhood
narrower: LGBTQ+ foster parenthood
narrower: LGBTQ+ motherhood
narrower: LGBTQ+ social parenthood
related: Desire to have children
related: LGBTQ+ families
related: Genetic parenthood
related: LGBTQ+ adoption
related: LGBTQ+ biological parents
related: LGBTQ+ foster families
related: Motherhood
related: Parental rights
related: LGBTQ+ parents
related: Fatherhood
related: Queer families
replaces: LGBTQParenthood
issued: 2019-05-14
modified: 2025-02-23
type: Concept
in scheme: v3
change note: Version 4.1.0

LGBTQ+ people
preferred label: Personas LGBTQ+ @es
alternative label: Gay people
alternative label: LGBTQ people
alternative label: People (LGBTQ)
comment: Self-identified lesbians, gay men, bisexual people, transgender people, queer people, and other sexual and gender minorities.
comment: Personas que se identifican como lesbianas, gay, bisexuales, transgénero, queer y/o otras minorías sexuales y de género. @es
narrower: LGBTQ+ political activists
narrower: LGBTQ+ actors
narrower: LGBTQ+ artists
narrower: LGBTQ+ atheists
narrower: Bi+ people
narrower: Bisexual people
narrower: LGBTQ+ victims of crime
narrower: LGBTQ+ daughters
narrower: LGBTQ+ people who use substances
narrower: LGBTQ+ older people
narrower: Gay men
narrower: Lesbians
narrower: Intersex people
narrower: LGBTQ+ people of shared ethnic or national identities
narrower: LGBTQ+ veterans
narrower: LGBTQ+ unhoused people
narrower: LGBTQ+ incarcerated people
narrower: LGBTQ+ lovers
narrower: LGBTQ+ migrants
narrower: LGBTQ+ musicians
narrower: LGBTQ+ refugees
narrower: LGBTQ+ victims of war
narrower: Men who have sex with men
narrower: Pansexual people
narrower: Queer people
narrower: LGBTQ+ sons
narrower: LGBTQ+ survivors of war
narrower: Transgender people
narrower: Undocumented LGBTQ+ residents
narrower: Women who have sex with women
narrower: LGBTQ+ people in recovery
narrower: LGBTQ+ people with addictions
narrower: LGBTQ+ chefs
narrower: Closeted LGBTQ+ people
narrower: LGBTQ+ immigrants
narrower: LGBTQ+ asylum seekers
narrower: LGBTQ+ disabled people
narrower: LGBTQ+ people with chronic illnesses
narrower: Polysexual people
narrower: LGBTQ+ athletes
narrower: LGBTQ+ victims of bullying
narrower: LGBTQ+ people in fandom
narrower: Substance abuse
narrower: LGBTQ+ people in Adult Children of Alcoholics
narrower: Sobriety
narrower: Sapphics
narrower: MLM (Men Loving Men)
narrower: WLW (Women Loving Women)
narrower: Adopted LGBTQ+ people
narrower: LGBTQ+ siblings
narrower: LGBTQ+ grandchildren
narrower: LGBTQ+ grandparents
narrower: LGBTQ+ family members
narrower: LGBTQ+ children of LGBTQ+ parents
narrower: LGBTQ+ teachers
narrower: LGBTQ+ academics
narrower: Rural LGBTQ+ people
narrower: LGBTQ+ students
narrower: LGBTQ+ people of color
narrower: LGBTQ+ scientists
narrower: LGBTQ+ television personalities
narrower: LGBTQ+ philanthropists
narrower: LGBTQ+ punks
narrower: Uranic people
narrower: Neptunic people
narrower: Saturnic people
narrower: LGBTQ+ sex workers
narrower: LGBTQ+ authors
narrower: LGBTQ+ celebrities
narrower: LGBTQ+ dancers
narrower: LGBTQ+ fashion designers
narrower: LGBTQ+ people in arts and media
narrower: LGBTQ+ journalists

LGBTQ+ people with physical disabilities
alternative label: People with physical disabilities (LGBTQ)
alternative label: LGBTQ people with physical disabilities
broader: LGBTQ+ people
narrower: LGBTQ+ deaf people
narrower: LGBTQ+ people with visual disabilities
has top concept: LGBTQ+ people
is replaced by: homoit0001854
replaces: LGBTQPeopleWithPhysicalDisabilities
issued: 2019-05-14
modified: 2022-08-22
type: Concept
in scheme: v3
change note: Version 4.1.0

LGBTQ+ people with visual disabilities
alternative label: LGBTQ people with visual impairments
alternative label: People with visual disabilities (LGBTQ)
alternative label: Visually disabled LGBTQ people
alternative label: LGBTQ people with visual disabilities
is replaced by: homoit0001854
replaces: LGBTQPeopleWithVisualDisabilities
issued: 2019-05-14
modified: 2022-08-22
type: Concept
in scheme: v3
change note: Version 4.1.0

LGBTQ+ personal and family law
preferred label: Derecho personal y familiar LGBTQ+ @es
alternative label: LGBTQ personal and family law
alternative label: Leyes personales y familiares LGBTQ @es
comment: Legal regulations and laws addressing changes to LGBTQ people’s legal names or gender markers, as well as LGBTQ people’s family relationships, including cohabitation, marriage, adoption, parent-child relationships, divorce, and child custody.
comment: Regulaciones legales y leyes que abordan cambios en los nombres legales o marcadores de género de las personas LGBTQ, así como en las relaciones familiares de las personas LGBTQ, incluida la cohabitación, el matrimonio, la adopción, las relaciones entre padres e hijos, el divorcio y la custodia de los hijos. @es
broader: Law
narrower: Legal name change
narrower: Marriage law
related: Birth certificate amendments
related: Child custody
related: Civil unions
related: Second parent adoption
related: Domestic partnership contracts
related: Domestic partnership retirement benefits
related: Donors
related: Intimate partner violence
related: LGBTQ+ adoption
related: LGBTQ+ adoptive parenthood
related: Official documentation
related: Parental rights
has top concept: Law
replaces: LGBTQPersonalAndFamilyLaw
issued: 2019-05-14
modified: 2025-03-20
type: Concept
in scheme: v3
change note: Version 4.1.0

LGBTQ+ petitions
preferred label: Peticiones LGBTQ+ @es
alternative label: LGBTQ petitions
alternative label: Peticiones LGBTQ @es
comment: Written requests for political or social action that are addressed to government officials or public entities and signed by numerous people; use in reference to petitions created by or addressing LGBTQ+ organizations, communities, and/or concerns.
comment: Solicitudes escritas para acción política o social dirigidas a funcionarios gubernamentales o entidades públicas, y firmadas por numerosas personas; utilícese en referencia a peticiones creadas o dirigidas a organizaciones, comunidades y/o inquietudes LGBTQ+. @es
broader: LGBTQ+ direct action
has top concept: LGBTQ+ activism
replaces: LGBTQPetitions
issued: 2019-05-14
modified: 2025-02-23
type: Concept
in scheme: v3
change note: Version 4.1.0

LGBTQ+ phobia
preferred label: Fobia LGBTQ+ @es
alternative label: LGBTQ phobia
alternative label: Fobia LGBTQ @es
comment: Antagonism or disgust directed towards LGBTQ+ identities or people due to their sexuality or gender, perceived or actual. LGBTQ+ phobia can include denial of the existence of certain LGBTQ+ identities, stereotypes, verbal harassment, and physical violence.
comment: Antagonismo o disgusto dirigido hacia identidades o personas LGBTQ+ debido a su sexualidad o género, percibido o real. La fobia LGBTQ+ puede incluir la negación de la existencia de ciertas identidades LGBTQ+, estereotipos, acoso verbal y violencia física. @es
narrower: Biphobia
narrower: Genderism
narrower: Homophobia
narrower: Intersexphobia
narrower: Lesbophobia
narrower: Queerphobia
narrower: Transphobia
related: AIDS phobia
related: Bullying
related: Anti-Two-Spirit discrimination
related: Internalized oppression
replaces: LGBTQPhobia
issued: 2019-05-14
modified: 2025-02-23
type: Concept
in scheme: v3
change note: Version 4.1.0

LGBTQ+ platonic love
preferred label: Amor platónico LGBTQ+ @es
alternative label: LGBTQ platonic love
alternative label: Queerplatonic
alternative label: Amor platónico LGBTQ @es
comment: Deep feelings of affection between two or more LGBTQ+ people that is neither sexual nor romantic.
comment: Sentimientos profundos de afecto entre dos o más personas LGBTQ+ que no son ni sexuales ni románticos. @es
broader: Being in love
related: Queerplatonic relationships
has top concept: Being in love
replaces: LGBTQPlatonicLove
issued: 2019-05-14
modified: 2025-02-23
type: Concept
in scheme: v3
change note: Version 4.1.0

LGBTQ+ plays
preferred label: Obras de teatro LGBTQ+ @es
alternative label: LGBTQ stage performances
alternative label: LGBTQ plays
alternative label: Obras LGBTQ @es
alternative label: Representaciones teatrales LGBTQ @es
comment: Works of drama consisting primarily of dialogue between characters and intended for theatrical performance; use in reference to plays focusing on LGBTQ+ characters or themes.
comment: Obras dramáticas que principalmente consisten de diálogos entre personajes y que son destinadas a ser puestas en escena; utilícese en referencia a obras teatrales que se centren en personajes o temas LGBTQ+. @es
related: LGBTQ+ drama
related: Gay theater
related: Lesbian theater
related: LGBTQ+ arts
replaces: LGBTQPlays
issued: 2019-05-14
modified: 2025-02-23
type: Concept
in scheme: v3
change note: Version 4.1.0

LGBTQ+ porn magazines
preferred label: Revistas porno LGBTQ+ @es
alternative label: LGBTQ porn magazines
alternative label: Revistas pornográficas (LGBTQ) @es
alternative label: Revistas pornográficas LGBTQ+ @es
comment: Erotic or sexually explicit magazines featuring LGBTQ+ people.
comment: Revistas eróticas o sexualmente explícitas protagonizadas por personas LGBTQ+. @es
broader: LGBTQ+ press
broader: LGBTQ+ pornography
related: Porn industry
related: LGBTQ+ periodicals
has top concept: LGBTQ+ press
replaces: LGBTQPornMagazines
issued: 2019-05-14
modified: 2025-02-23
type: Concept
in scheme: v3
change note: Version 4.1.0

LGBTQ+ prisoners of conscience
preferred label: Prisioneros de conciencia LGBTQ+ @es
alternative label: Prisoners of conscience (LGBTQ)
alternative label: LGBTQ prisoners of conscience
alternative label: Prisioneros de conciencia (LGBTQ) @es
comment: LGBTQ+ people who are incarcerated because of their gender identity or sexuality, or due to conscientiously held beliefs such as opposition to war or human rights violations.
comment: Personas LGBTQ+ que están encarceladas por su identidad sexual o de género; también puede utilizarse para describir a personas LGBTQ+ encarceladas debido a su raza, religión u opiniones políticas. @es
broader: LGBTQ+ incarcerated people
has top concept: LGBTQ+ people
replaces: LGBTQPrisonersOfConscience
issued: 2019-05-14
modified: 2025-04-17
type: Concept
in scheme: v3
change note: Version 4.1.0

LGBTQ+ pubs
preferred label: Pubs LGBTQ+ @es
alternative label: LGBTQ public houses
alternative label: LGBTQ pubs
alternative label: Tabernas LGBTQ+ @es
comment: A drinking establishment that serves food and acts as a community gathering place; use in reference to pubs that primarily cater to LGBTQ+ people.
comment: Un establecimiento de bebidas que sirve comida y funge como lugar de encuentro comunitario; utilícese en referencia a pubs que atienden principalmente a personas LGBTQ+. @es
related: LGBTQ+ bars
related: Drag bars
related: Gay bars
related: Lesbian bars
replaces: LGBTQPubs
issued: 2019-05-14
modified: 2025-02-23
type: Concept
in scheme: v3
change note: Version 4.1.0

LGBTQ+ Quakers
preferred label: Cuáqueros LGBTQ+ @es
alternative label: LGBTQ Religious Society of Friends
alternative label: LGBTQ Society of Friends
alternative label: Quakers (LGBTQ)
alternative label: LGBTQ Quakers
comment: LGBTQ+ people who are Quakers.
comment: Personas LGBTQ+ que son cuáqueras. @es
broader: LGBTQ+ Protestants
has top concept: LGBTQ+ African religions
replaces: LGBTQQuakers
issued: 2019-05-14
modified: 2025-02-23
type: Concept
in scheme: v3
change note: Version 4.1.0

LGBTQ+ refugees
preferred label: Refugiados LGBTQ+ @es
alternative label: Refugees (LGBTQ)
alternative label: LGBTQ refugees
alternative label: Refugiados LGBTQ @es
alternative label: Refugiados (LGBTQ) @es
comment: LGBTQ+ people who have fled to another country to escape war, persecution, natural disaster, or other forms of conflict. Only use for people legally recognized as refugees; otherwise, use LGBTQ+ asylum seekers.
comment: Personas LGBTQ+ que han huido a otro país para escapar de la guerra, la persecución, los desastres naturales u otras formas de conflicto. Utilícese únicamente para personas legalmente reconocidas como refugiadas; en caso contrario, utilícese "solicitantes de asilo LGBTQ+". @es
broader: LGBTQ+ people
related: Legal status
related: LGBTQ+ immigration rights
related: LGBTQ+ migrants
related: LGBTQ+ persecutions
related: Undocumented LGBTQ+ residents
related: LGBTQ+ immigrants
related: LGBTQ+ asylum seekers
has top concept: LGBTQ+ people
replaces: LGBTQRefugees
issued: 2019-05-14
modified: 2025-02-23
type: Concept
in scheme: v3
change note: Version 4.1.0

LGBTQ+ resorts
preferred label: Resorts LGBTQ+ @es
alternative label: LGBTQ resorts
alternative label: Resorts (LGBTQ) @es
comment: Commercial establishments providing lodging, entertainment, food, drinks, sporting, and shopping; use in reference to resorts that cater primarily to LGBTQ+ people or are known to be frequented by LGBTQ+ people.
comment: Establecimientos comerciales que brindan alojamiento, entretenimiento, alimentos, bebidas, deportes y lugares de compras; utilícese en referencia a resorts que principalmente atienden a personas LGBTQ+ o que son conocidos por ser frecuentados por personas LGBTQ+. @es
broader: LGBTQ+ hotels
has top concept: LGBTQ+ hotels
replaces: LGBTQResorts
issued: 2019-05-14
modified: 2025-02-23
type: Concept
in scheme: v3
change note: Version 4.1.0

LGBTQ+ restaurants
preferred label: Restaurantes LGBTQ+ @es
alternative label: LGBTQ restaurants
alternative label: Restaurants (LGBTQ) @es
comment: Commercial establishments that prepare and serve food and drinks; use in reference to restaurants that cater primarily to LGBTQ+ people or are known to be frequented by LGBTQ+ people.
comment: Establecimientos comerciales que preparan y sirven alimentos y bebidas; utilícese en referencia a restaurantes que atienden principalmente a personas LGBTQ+ o que son conocidos por ser frecuentados por personas LGBTQ+. @es
related: LGBTQ+ night life
related: LGBTQ+ tourism
replaces: LGBTQRestaurants
issued: 2019-05-14
modified: 2025-02-23
type: Concept
in scheme: v3
change note: Version 4.1.0

LGBTQ+ retirement homes
preferred label: Casas de retiro LGBTQ+ @es
alternative label: LGBTQ retirement homes
alternative label: Casas de retiro (LGBTQ) @es
alternative label: Hogares de retiro LGBTQ+ @es
alternative label: Casas de reposo LGBTQ+ @es
alternative label: Hogares de retiro (LGBTQ) @es
alternative label: Casas de reposo (LGBTQ) @es
alternative label: Residencias de gente mayor LGBTQ+ @es
alternative label: Residencias de gente mayor (LGBTQ) @es
comment: Multi-residence facilities that provide assisted living services to elderly people; use in reference to retirement homes that primarily cater to LGBTQ+ people.
comment: Instalaciones multiresidencia que brindan servicios de vida asistida a personas mayores; utilícese en referencia a casas de retiro que atienden principalmente a personas LGBTQ+. @es
related: LGBTQ+ older people
replaces: LGBTQRetirementHomes
issued: 2019-05-14
modified: 2025-02-23
type: Concept
in scheme: v3
change note: Version 4.1.0

LGBTQ+ riots
preferred label: Disturbios LGBTQ+ @es
alternative label: LGBTQ riots
alternative label: Disturbios (LGBTQ) @es
alternative label: Motines (LGBTQ) @es
alternative label: Motines LGBTQ+ @es
comment: Civil disorder directed against authorities, property, and other individuals, typically in response to grievances, conflicts, or injustice; use in reference to riots involving LGBTQ+ people or in response to LGBTQ+ issues.
comment: Desorden civil dirigido contra autoridades, propiedades y otras personas, generalmente en respuesta a agravios, conflictos o injusticias; utilícese en referencia a disturbios que involucran a personas LGBTQ+ o en respuesta a asuntos LGBTQ+. @es
narrower: Stonewall riots
related: LGBTQ+ demonstrations
replaces: LGBTQRiots
issued: 2019-05-14
modified: 2025-02-23
type: Concept
in scheme: v3
change note: Version 4.1.0

Schools for LGBTQ+ youth
preferred label: Escuelas para la juventud LGBTQ+ @es
alternative label: LGBTQ schools
alternative label: Schools for LGBTQ youth
alternative label: Escuelas LGBTQ+ @es
alternative label: Escuelas LGBTQ @es
comment: Educational institutions providing instruction and resources specifically for LGBTQ+ youth.
comment: Instituciones educativas que brindan instrucción y recursos específicamente para jóvenes LGBTQ+. @es
related: LGBTQ+ youth
replaces: schoolsForLGBTQYouth
issued: 2019-05-14
modified: 2025-02-23
type: Concept
in scheme: v3
change note: Version 4.1.0

LGBTQ+ science fiction
preferred label: Ciencia ficción LGBTQ+ @es
alternative label: Science fiction (LGBTQ)
alternative label: Ciencia ficción (LGBTQ) @es
comment: Written literary work about imaginative or futuristic concepts incorporating science, technology, space, time travel, and other speculative elements; use in reference to science fiction focusing on LGBTQ+ characters or themes.
comment: Obras literarias escritas sobre conceptos imaginativos o futuristas que incorporen la ciencia, la tecnología, el espacio, los viajes en el tiempo y otros elementos especulativos; utilícese en referencia a la ciencia ficción centrada en personajes o temas LGBTQ+. @es
broader: LGBTQ+ fiction
narrower: Lesbian science fiction
narrower: Gay science fiction
narrower: Bisexual science fiction
narrower: Transgender science fiction
narrower: Queer science fiction
narrower: Asexual science fiction
narrower: Demisexual science fiction
narrower: Aromantic science fiction
narrower: Intersex science fiction
narrower: Megasexual science fiction
narrower: Greyromantic science fiction
narrower: Non-binary science fiction
related: LGBTQ+ fantasy fiction
related: Kirk/Spock
related: Māhū science fiction
related: Two-Spirit science fiction
has top concept: Subcultures
replaces: scienceFictionLGBTQ
issued: 2019-05-14
modified: 2025-02-23
type: Concept
in scheme: v3
change note: Version 4.1.0

LGBTQ+ self-defense
preferred label: Autodefensa LGBTQ+ @es
preferred label: LGBTQ+ self-defence
comment: Countermeasures taken by an LGBTQ+ person to protect their own health or well being from harm.
comment: Contramedidas tomadas por una persona LGBTQ+ para proteger su propia salud o bienestar de daños. @es
broader: LGBTQ+ direct action
has top concept: LGBTQ+ activism
replaces: LGBTQSelfDefence
issued: 2019-05-14
modified: 2025-02-23
type: Concept
in scheme: v3
change note: Version 4.1.0

LGBTQ+ self-repression
preferred label: Auto represión LGBTQ+ @es
alternative label: LGBTQ self-repression
alternative label: Auto represión LGBTQ @es
comment: Restraint or denial of one’s own thoughts, wishes, feelings or identity, as experienced by LGBTQ+ people.
comment: Restricción o negación de los pensamientos, deseos, sentimientos o identidad propia, tal como lo experimentan las personas LGBTQ+. @es
related: Denial of sexual orientation
related: Internalized homophobia
related: Internalized oppression
replaces: LGBTQSelfRepression
issued: 2019-05-14
modified: 2025-02-23
type: Concept
in scheme: v3
change note: Version 4.1.0

LGBTQ+ separation
preferred label: Separación LGBTQ+ @es
alternative label: Marital separation (LGBTQ)
alternative label: LGBTQ separation
alternative label: Separación LGBTQ @es
comment: Arrangement mutually agreed upon or ordered by a judge for married LGBTQ+ people to live apart while remaining legally married.
comment: Arreglo mutuamente acordado u ordenado por un juez para que las personas LGBTQ+ casadas vivan separadas mientras permanecen legalmente casadas. @es
broader: Marriage
narrower: LGBTQ+ divorce
related: Child custody
related: Marital status
related: Relationship satisfaction
has top concept: Living arrangements
replaces: LGBTQSeparation
issued: 2019-05-14
modified: 2025-02-23
type: Concept
in scheme: v3
change note: Version 4.1.0

LGBTQ+ sexual abuse
preferred label: Abuso sexual LGBTQ+ @es
alternative label: LGBTQ sexual abuse
alternative label: Abuso sexual LGBTQ @es
comment: Acts of sexual abuse and violence directed towards LGBTQ+ people.
comment: Actos de abuso y violencia sexual dirigidos a personas LGBTQ+. @es
broader: Sexual violence
related: Consent
related: LGBTQ+ domestic violence
related: LGBTQ+ victims of sexual abuse
related: LGBTQ+ survivors of sexual abuse
has top concept: Sexual violence
replaces: LGBTQSexualAbuse
issued: 2019-05-14
modified: 2025-02-23
type: Concept
in scheme: v3
change note: Version 4.1.0

LGBTQ+ shamans
preferred label: Chamanes LGBTQ+ @es
alternative label: Shamans (LGBTQ)
alternative label: LGBTQ shamans
alternative label: Chamanes LGBTQ @es
alternative label: Chamanes (LGBTQ) @es
comment: LGBTQ+ people who are shamans either through traditional community practices or self-designation.
comment: Personas LGBTQ+ que son chamanes ya sea a través de prácticas comunitarias tradicionales o por autodesignación. @es
broader: LGBTQ+ African religions
has top concept: LGBTQ+ African religions
replaces: LGBTQShamans
issued: 2019-05-14
modified: 2025-02-23
type: Concept
in scheme: v3
change note: Version 4.1.0

LGBTQ+ Shintoists
preferred label: Sintoístas LGBTQ+ @es
alternative label: LGBTQ Shinto
alternative label: Shintoists (LGBTQ)
alternative label: LGBTQ Shintoists
alternative label: Sintoístas LGBTQ @es
comment: LGBTQ+ people who are Shintoists.
comment: Personas LGBTQ+ que son sintoístas. @es
broader: LGBTQ+ African religions
has top concept: LGBTQ+ African religions
replaces: LGBTQShintoists
issued: 2019-05-14
modified: 2025-02-23
type: Concept
in scheme: v3
change note: Version 4.1.0

LGBTQ+ single fathers
preferred label: Padres solteros LGBTQ+ @es
alternative label: LGBTQ single fathers
alternative label: Papás solteros LGBTQ @es
comment: LGBTQ+ people who are fathers but are not married or part of a long-term partnership.
comment: Personas LGBTQ+ que son padres pero no están casados ni en una relación a largo plazo. @es
broader: LGBTQ+ single parents
has top concept: LGBTQ+ families
replaces: LGBTQSingleFathers
issued: 2019-05-14
modified: 2025-02-23
type: Concept
in scheme: v3
change note: Version 4.1.0

LGBTQ+ single mothers
preferred label: Madres solteras LGBTQ+ @es
alternative label: LGBTQ single mothers
alternative label: Madres solteras LGBTQ @es
alternative label: Mamás solteras LGBTQ+ @es
comment: LGBTQ+ people who are mothers but are not married or part of a long-term partnership.
comment: Personas LGBTQ+ que son madres pero no están casadas ni en una relación a largo plazo. @es
broader: LGBTQ+ single parents
broader: Mothers
has top concept: LGBTQ+ families
replaces: LGBTQSingleMothers
issued: 2019-05-14
modified: 2025-02-23
type: Concept
in scheme: v3
change note: Version 4.1.0

LGBTQ+ single-parent families
preferred label: Familias monoparentales LGBTQ+ @es
alternative label: Single-parent families (LGBTQ)
alternative label: Single parent families (LGBTQ)
alternative label: LGBTQ+ single parent families
comment: Families headed by a single parent; use in reference to single parent families headed by or including LGBTQ+ people.
comment: Familias encabezadas por un solo progenitor; utilícese en referencia a familias monoparentales encabezadas por personas LGBTQ+ o que las incluyan. @es
replaces: LGBTQSingleParentFamilies
issued: 2019-05-14
modified: 2025-03-20
type: Concept
in scheme: v3
change note: Version 4.1.0

LGBTQ+ single parents
preferred label: Madres y padres solteros LGBTQ+ @es
alternative label: LGBTQ single parents
alternative label: Padres solteros LGBTQ+ @es
alternative label: Madres solteras LGBTQ+ @es
comment: LGBTQ+ people who are parents but are not married or part of a long-term partnership.
comment: Personas LGBTQ+ que son padres y/o madres pero no están casadas ni en una relación a largo plazo. @es
broader: LGBTQ+ parents
broader: Single people
narrower: LGBTQ+ single fathers
narrower: LGBTQ+ single mothers
has top concept: LGBTQ+ families
replaces: LGBTQSingleParents
issued: 2019-05-14
modified: 2025-03-20
type: Concept
in scheme: v3
change note: Version 4.1.0

LGBTQ+ social parenthood
preferred label: Paternidad social LGBTQ+ @es
alternative label: Social parenthood (LGBTQ)
alternative label: Paternidad social LGBTQ @es
comment: The experiences involved in social parenting, as experienced by LGBTQ+ people.
comment: Las experiencias involucradas en la paternidad social, tal como las experimentan las personas LGBTQ+. @es
broader: LGBTQ+ parenthood
related: LGBTQ+ families
related: LGBTQ+ adoptive parenthood
related: LGBTQ+ family planning
related: LGBTQ+ foster parenthood
has top concept: LGBTQ+ parenthood
replaces: LGBTQSocialParenthood
issued: 2019-05-14
modified: 2025-02-23
type: Concept
in scheme: v3
change note: Version 4.1.0

LGBTQ+ social media
preferred label: Redes sociales LGBTQ+ @es
alternative label: LGBTQ social media
alternative label: Redes sociales LGBTQ @es
comment: Web-based and mobile technologies that facilitate interactive dialogue, as used by or designed for LGBTQ+ people.
comment: Tecnologías móviles y basadas en la web que facilitan el diálogo interactivo, tal como las utilizan o están diseñadas para personas LGBTQ+. @es
narrower: Blogs
narrower: Chatrooms
narrower: Dating applications
narrower: Internet forums
related: LGBTQ+ meeting places
related: LGBTQ+ websites
related: LGBTQ+ vlogs
replaces: LGBTQSocialMedia
issued: 2019-05-14
modified: 2025-03-20
type: Concept
in scheme: v3
change note: Version 4.1.0

LGBTQ+ social processes
preferred label: Procesos sociales LGBTQ+ @es
alternative label: LGBTQ social processes
alternative label: Procesos sociales LGBTQ @es
comment: Forms of social interaction that occur repeatedly; use to describe the ways in which LGBTQ+ people interact and establish social relationships.
comment: Formas de interacción social que ocurren repetidamente; utilícese para describir las formas en que las personas LGBTQ+ interactúan y establecen relaciones sociales. @es
narrower: Gay liberation
narrower: Gay-straight alliances
narrower: Gender relations
narrower: Lesbian liberation
narrower: LGBTQ+ emancipation
narrower: LGBTQ+ visibility
related: Normalization
related: Sex scandals
related: Sexual reform
related: Sexual revolution
related: Impact of COVID-19 pandemic on LGBTQ+ people
replaces: LGBTQSocialProcesses
issued: 2019-05-14
modified: 2025-02-23
type: Concept
in scheme: v3
change note: Version 4.1.0

LGBTQ+ spiritual people
preferred label: Personas espirituales LGBTQ+ @es
alternative label: LGBTQ+ spirituality
alternative label: Espiritualidad LGBTQ+ @es
alternative label: Espirtualidad LGBTQ @es
comment: LGBTQ+ people who hold spiritual beliefs or engage in spiritual practices, typically involving an understanding of something greater than human existence, whether divine or cosmic in nature.
comment: Personas LGBTQ+ que tienen creencias espirituales o participan en prácticas espirituales, que generalmente implican una comprensión de algo más grande que la existencia humana, ya sea de naturaleza divina o cósmica. @es
related: LGBTQ+ African religions
related: Queer theology
replaces: LGBTQSpirituality
issued: 2019-05-14
modified: 2025-03-20
type: Concept
in scheme: v3
change note: Version 4.1.0

LGBTQ+ sports clubs
preferred label: Clubs deportivos LGBTQ+ @es
alternative label: LGBTQ sports clubs
alternative label: Clubs de deporte LGBTQ @es
alternative label: Clubs deportivos LGBTQ @es
comment: Organized groups of LGBTQ+ people formed for the purpose of playing sports; includes professional and amateur sports clubs.
comment: Grupos organizados de personas LGBTQ+ formados para el propósito de jugar deportes; incluye clubs deportivos profesionales y aficionados. @es
broader: LGBTQ+ clubs and organizations
narrower: Gay sports clubs
narrower: Lesbian sports clubs
related: LGBTQ+ athletes
has top concept: LGBTQ+ clubs and organizations
replaces: LGBTQSportsClubs
issued: 2019-05-14
modified: 2025-02-23
type: Concept
in scheme: v3
change note: Version 4.1.0

LGBTQ+ student organizations
preferred label: Clubs estudiantiles LGBTQ+ @es
alternative label: Students organizations (LGBTQ)
alternative label: LGBTQ+ student clubs
alternative label: Student clubs (LGBTQ)
alternative label: LGBTQ+ students' clubs
alternative label: LGBTQ+ students' organizations
alternative label: Students' clubs (LGBTQ)
alternative label: Students' organizations (LGBTQ)
alternative label: Clubs de estudiantes LGBTQ @es
comment: Organized clubs and groups composed primarily of LGBTQ+ students.
comment: Grupos organizados compuestos principalmente por estudiantes LGBTQ+. @es
broader: LGBTQ+ clubs and organizations
related: LGBTQ+ students
has top concept: LGBTQ+ clubs and organizations
replaces: LGBTQStudentsClubs
issued: 2019-05-14
modified: 2025-02-23
type: Concept
in scheme: v3
change note: Version 4.1.0

LGBTQ+ suicide
preferred label: Suicidio LGBTQ+ @es
alternative label: LGBTQ suicide
alternative label: Suicidio LGBTQ @es
comment: Deaths of LGBTQ+ people as a result of intentional, self-inflicted harm or injury.
comment: Muertes de personas LGBTQ+ como resultado de daños o lesiones intencionales y autoinfligidos. @es
broader: LGBTQ+ death and dying
related: Mental health care for LGBTQ+ people
has top concept: LGBTQ+ death and dying
replaces: LGBTQSuicide
issued: 2019-05-14
modified: 2025-02-23
type: Concept
in scheme: v3
change note: Version 4.1.0

LGBTQ+ support groups
preferred label: Grupos de apoyo LGBTQ+ @es
alternative label: LGBTQ support groups
alternative label: Grupos de apoyo LGBTQ @es
comment: Groups of LGBTQ+ people meeting to offer encouragement, comfort, and advice to one another, typically relating to common experiences and issues related to being LGBTQ+.
comment: Grupos de personas LGBTQ+ que se reúnen para ofrecerse aliento, consuelo y consejos, generalmente en relación con experiencias y asuntos comunes relacionados con ser LGBTQ+. @es
broader: Mental health care for LGBTQ+ people
related: Recovery groups
has top concept: Health care for LGBTQ+ people
replaces: LGBTQSupportGroups
issued: 2019-05-14
modified: 2025-02-23
type: Concept
in scheme: v3
change note: Version 4.1.0

LGBTQ+ symbols
preferred label: Símbolos LGBTQ+ @es
alternative label: LGBTQ symbols
alternative label: Símbolos LGBTQ @es
comment: Characters, signs, or objects used to represent LGBTQ+ people, identities, communities, and/or specific historical events.
comment: Personajes, símbolos u objetos utilizados para representar personas, identidades, comunidades y/o eventos históricos específicos LGBTQ+. @es
narrower: Red ribbons (AIDS)
narrower: Freedom rings
narrower: Handkerchief codes
narrower: Labrys
narrower: Lambda
narrower: Pink triangles
narrower: LGBTQ+ pride flags
replaces: LGBTQSymbols
issued: 2019-05-14
modified: 2025-02-23
type: Concept
in scheme: v3
change note: Version 4.1.0

LGBTQ+ Taoists
preferred label: Taoístas LGBTQ+ @es
alternative label: Taoists (LGBTQ)
alternative label: LGBTQ Taoists
alternative label: Taoístas LGBTQ @es
alternative label: Taoístas (LGBTQ) @es
comment: LGBTQ+ people who are Taoists.
comment: Personas LGBTQ+ que son taoístas. @es
broader: LGBTQ+ African religions
has top concept: LGBTQ+ African religions
replaces: LGBTQTaoists
issued: 2019-05-14
modified: 2025-02-23
type: Concept
in scheme: v3
change note: Version 4.1.0

LGBTQ+ tourism
preferred label: Turismo LGBTQ+ @es
alternative label: LGBTQ tourism
alternative label: Turismo LGBTQ @es
comment: Industry centered around LGBTQ+ people traveling to and staying in various locations for recreation or leisure.
comment: Industria centrada en personas LGBTQ+ que viajan y se alojan en diversos lugares por motivos de recreación u ocio. @es
narrower: LGBTQ+ cruises
narrower: LGBTQ+ sex tourism
narrower: LGBTQ+ travel guides
related: LGBTQ+ hotels
related: LGBTQ+ restaurants
replaces: LGBTQTourism
issued: 2019-05-14
modified: 2025-02-23
type: Concept
in scheme: v3
change note: Version 4.1.0

LGBTQ+ unrequited love
preferred label: Amor LGBTQ+ no correspondido @es
alternative label: LGBTQ unrequited love
comment: Attraction to another person that is not reciprocated, by LGBTQ+ people
comment: Atracción hacia otra persona que no es correspondida, por parte de personas LGBTQ+. @es
broader: Being in love
has top concept: Being in love
replaces: LGBTQUnrequitedLove
issued: 2019-05-14
modified: 2025-02-23
type: Concept
in scheme: v3
change note: Version 4.1.0

LGBTQ+ victims of rape
preferred label: Víctimas LGBTQ+ de violación @es
alternative label: LGBTQ victims of rape
alternative label: Rape victims (LGBTQ)
alternative label: Victims of rape (LGBTQ)
comment: LGBTQ+ people who have experienced rape and may or may not have survived; follow the individual's preference for "victims" or "survivors" whenever possible.
comment: Personas LGBTQ+ que han sufrido una violación y pueden o no haber sobrevivido; siga la preferencia de la persona sobre el uso de "víctimas" o "sobrevivientes" siempre que sea posible. @es
broader: LGBTQ+ victims of crime
broader: LGBTQ+ victims of sexual abuse
broader: Sexual violence
narrower: Bisexual victims of rape
narrower: Gay victims of rape
narrower: Lesbian victims of rape
narrower: Queer victims of rape
narrower: LGBTQ+ survivors of rape
narrower: Transgender victims of rape
narrower: Asexual victims of rape
related: Anti-LGBTQ+ violence
related: Consent
related: Sexually abused LGBTQ+ children
related: Rape/non-con (Content warning)
related: Two-Spirit victims of rape
has top concept: LGBTQ+ people
replaces: victimsOfRapeLGBTQ
issued: 2019-05-14
modified: 2025-02-23
type: Concept
in scheme: v3
change note: Version 4.1.0

LGBTQ+ victims of sexual abuse
preferred label: Víctimas LGBTQ+ de abuso sexual @es
alternative label: Sexual abuse victims (LGBTQ)
alternative label: Sexual violence victims (LGBTQ)
alternative label: Victims of sex crimes (LGBTQ)
alternative label: Victims of sexual abuse (LGBTQ)
comment: LGBTQ+ people who have experienced sexual abuse and may or may not have survived; follow the individual's preference for "victims" or "survivors" whenever possible.
comment: Personas LGBTQ+ que han sufrido abuso sexual y pueden o no haber sobrevivido; siga la preferencia de la persona sobre el uso de "víctimas" o "sobrevivientes" siempre que sea posible. @es
broader: LGBTQ+ victims of crime
narrower: Bisexual victims of sexual abuse
narrower: Gay victims of sexual abuse
narrower: Lesbian victims of sexual abuse
narrower: LGBTQ+ incest victims
narrower: LGBTQ+ victims of rape
narrower: Queer victims of sexual abuse
narrower: Sexually abused LGBTQ+ children
narrower: LGBTQ+ survivors of sexual abuse
narrower: Transgender victims of sexual abuse
narrower: Asexual victims of sexual abuse
narrower: Intersex victims of sexual abuse
related: Anti-LGBTQ+ violence
related: Consent
related: LGBTQ+ domestic violence
related: LGBTQ+ sexual abuse
related: Rape/non-con (Content warning)
related: Two-Spirit victims of sexual abuse
has top concept: LGBTQ+ people
replaces: victimsOfSexualAbuseLGBTQ
issued: 2019-05-14
modified: 2025-02-23
type: Concept
in scheme: v3
change note: Version 4.1.0

LGBTQ+ visibility
preferred label: Visibilidad LGBTQ+ @es
alternative label: Visibility of LGBTQ people
alternative label: LGBTQ visibility
comment: Visibility of LGBTQ+ people in society, meaning the extent to which LGBTQ+ people and identities are recognized by the general public.
comment: Visibilidad de las personas LGBTQ+ en la sociedad, es decir, el grado en que las personas e identidades LGBTQ+ son reconocidas por el público en general. @es
broader: LGBTQ+ social processes
has top concept: LGBTQ+ social processes
replaces: LGBTQVisibility
issued: 2019-05-14
modified: 2025-02-23
type: Concept
in scheme: v3
change note: Version 4.1.0

LGBTQ+ victims of war
preferred label: Víctimas LGBTQ+ de guerra @es
alternative label: LGBTQ war victims
alternative label: Victims of war (LGBTQ)
comment: LGBTQ+ people who have experienced war and may or may not have survived; follow the individual's preference for "victims" or "survivors" whenever possible.
comment: Personas LGBTQ+ que han sufrido la guerra y que pueden haber sobrevivido o no; siga la preferencia de la persona sobre el uso de "víctimas" o "sobrevivientes" siempre que sea posible. @es
broader: LGBTQ+ people
narrower: Bisexual victims of war
narrower: Gay victims of war
narrower: Lesbian victims of war
narrower: Queer victims of war
narrower: Transgender victims of war
narrower: Asexual victims of war
narrower: Intersex victims of war
related: LGBTQ+ survivors of war
related: Two-Spirit victims of war
has top concept: LGBTQ+ people
replaces: victimsOfWarLGBTQ
issued: 2019-05-14
modified: 2025-02-23
type: Concept
in scheme: v3
change note: Version 4.1.0

LGBTQ+ websites
preferred label: Sitios web LGBTQ+ @es
alternative label: LGBTQ websites
alternative label: Sitios web LGBTQ @es
comment: Public web pages that primarily address LGBTQ+ communities and issues, as well as web pages intended for use by LGBTQ+ people.
comment: Páginas web públicas que abordan principalmente comunidades y cuestiones LGBTQ+, así como páginas web destinadas a personas LGBTQ+. @es
narrower: LGBTQ+ dating websites
narrower: Lesbian websites
narrower: Gay websites
narrower: Bisexual websites
narrower: Transgender websites
narrower: Queer websites
narrower: Intersex websites
narrower: Aromantic websites
narrower: Asexual websites
narrower: Demisexual websites
narrower: Greyromantic websites
narrower: Megasexual websites
narrower: Non-binary websites
related: Internet forums
related: LGBTQ+ social media
related: Two-Spirit websites
replaces: LGBTQWebsites
issued: 2019-05-14
modified: 2025-02-23
type: Concept
in scheme: v3
change note: Version 4.1.0

LGBTQ+ weddings
preferred label: Bodas LGBTQ+ @es
alternative label: LGBTQ weddings
alternative label: Weddings (LGBTQ)
alternative label: Bodas LGBTQ @es
alternative label: Matrimonios LGBTQ @es
alternative label: Casamientos LGBTQ @es
comment: Marriage ceremonies and the accompanying festivities; use to describe weddings in which both partners are LGBTQ+.
comment: Ceremonias matrimoniales y las festividades que las acompañan; utilícese para describir bodas en las que ambas personas son LGBTQ+. @es
related: Domestic partnership contracts
related: Marriage
replaces: LGBTQWeddings
issued: 2019-05-14
modified: 2026-02-24
type: Concept
in scheme: v3
change note: Version 4.1.0

LGBTQ+ youth centers
preferred label: Centros juveniles LGBTQ+ @es
preferred label: LGBTQ+ youth centres
comment: Spaces in which LGBTQ+ young people meet for social, education, recreational, or organizing activities.
comment: Espacios en los que jóvenes LGBTQ+ se reúnen para realizar actividades sociales, educativas, recreativas u organizativas. @es
broader: LGBTQ+ centers
related: LGBTQ+ youth
related: Social work with LGBTQ+ youth
has top concept: LGBTQ+ centers
replaces: LGBTQYouthCentres
issued: 2019-05-14
modified: 2025-04-29
type: Concept
in scheme: v3
change note: Version 4.1.0

LGBTQ+ zines
preferred label: Zines LGBTQ+ @es
alternative label: LGBTQ zines
alternative label: Zines LGBTQ @es
comment: Independent, small-circulation publications usually reproduced via photocopier; use for zines created by LGBTQ+ people and/or focusing on LGBTQ+ identities, issues, or cultures.
comment: Publicaciones independientes de pequeña tirada generalmente reproducidas mediante fotocopiadora; utilícese para revistas creadas por personas LGBTQ+ y/o centradas en identidades, asuntos o culturas LGBTQ+. @es
broader: LGBTQ+ press
narrower: Intersex zines
narrower: Transgender zines
narrower: Aromantic zines
narrower: Asexual zines
narrower: Non-binary zines
narrower: Queer zines
narrower: Lesbian zines
narrower: Gay zines
related: LGBTQ+ magazines
related: LGBTQ+ periodicals
related: Two-Spirit zines
has top concept: LGBTQ+ press
replaces: LGBTQZines
issued: 2019-05-14
modified: 2025-02-23
type: Concept
in scheme: v3
change note: Version 4.1.0

Lhamana
comment: Native American Zuni people assigned male at birth who exhibit mixed gender traits.
comment: Personas del pueblo nativo americano Zuni asignadas al sexo masculino al nacer que exhiben rasgos de género mixto. @es
broader: Non-Euro-American gender and sexual identities
related: Two-Spirit people
has top concept: Gender
replaces: lhamana
issued: 2019-05-14
modified: 2025-02-23
type: Concept
in scheme: v3
change note: Version 4.1.0

Libido
preferred label: Líbido @es
alternative label: Sex drive
alternative label: Deseo sexual @es
comment: A person's overall sexual drive or desire for sexual activity.
comment: El impulso sexual general de una persona o el deseo de actividad sexual. @es
related: Sex (Act)
related: Sexual excitement
related: Sexual function
related: Sexuality
replaces: libido
issued: 2019-05-14
modified: 2025-02-23
type: Concept
in scheme: v3
change note: Version 4.1.0

LGBTQ+ libraries
preferred label: Bibliotecas LGBTQ+ @es
alternative label: Libraries (LGBTQ)
alternative label: Bibliotecas (LGBTQ) @es
comment: Libraries that hold materials primarily pertaining to LGBTQ+ people or intended for use by LGBTQ+ people.
comment: Bibliotecas que contienen materiales principalmente relacionados con personas LGBTQ+ o destinados a personas LGBTQ+. @es
broader: LGBTQ+ cultural heritage institutions
narrower: Bisexual libraries
narrower: Gay libraries
narrower: Lesbian libraries
narrower: Queer libraries
narrower: Transgender libraries
narrower: Women's libraries
narrower: Intersex libraries
narrower: Asexual libraries
related: LGBTQ+ archives
related: LGBTQ+ books
related: LGBTQ+ special collections
related: Two-Spirit libraries
related: LGBTQ+ archivists
related: LGBTQ+ librarians
has top concept: LGBTQ+ cultural heritage institutions
replaces: librariesLGBTQ
issued: 2019-05-14
modified: 2026-02-26
type: Concept
in scheme: v3
change note: Version 4.1.0

Licking
preferred label: Lengüetear @es
alternative label: Lamer @es
comment: To touch or pass over with the tongue to moisten or taste; use to describe licking associated in the context of sexual practices or sexual arousal.
comment: Tocar o pasar con la lengua para humedecer o saborear; utilícese para describir el acto de lamer en relación al contexto de prácticas sexuales o de excitación sexual. @es
broader: Oral sex
narrower: Rimming
narrower: Cunnilingus
has top concept: Sex (Act)
replaces: licking
issued: 2019-05-14
modified: 2025-02-23
type: Concept
in scheme: v3
change note: Version 4.1.0

Lingerie
preferred label: Lencería @es
alternative label: Ropa íntima @es
comment: Category of clothing that includes bras, underwear, hosiery, and robes; typically refers to undergarments and sleepwear designed to be sexually appealing and worn in erotic contexts.
comment: Categoría de ropa que incluye sujetadores, ropa interior, medias y batas; típicamente, se refiere a ropa interior y ropa de dormir diseñada para ser sexualmente atractiva y usada en contextos eróticos. @es
broader: Clothing
broader: Drag
broader: Sex accessories
related: Crossdressers
related: Crossdressing
has top concept: Gender
replaces: lingerie
issued: 2019-05-14
modified: 2025-02-23
type: Concept
in scheme: v3
change note: Version 4.1.0

Lipstick lesbians
preferred label: Lesbiana lipstick @es
comment: Lesbians whose appearance or mannerisms are more traditionally feminine.
comment: Lesbianas cuya apariencia o gestos son más tradicionalmente femeninos. @es
broader: Lesbians
related: Femmes
has top concept: LGBTQ+ people
replaces: lipstickLesbians
issued: 2019-05-14
modified: 2025-02-23
type: Concept
in scheme: v3
change note: Version 4.1.0

LGBTQ+ literature
preferred label: Literatura LGBTQ+ @es
alternative label: Literature (LGBTQ)
alternative label: Literatura LGBTQ @es
comment: Written literary works featuring LGBTQ+ characters and themes.
comment: Obras literarias escritas con personajes y temas LGBTQ+. @es
broader: LGBTQ+ culture
narrower: Bisexual literature
narrower: LGBTQ+ drama
narrower: LGBTQ+ fiction
narrower: Gay literature
narrower: Lesbian literature
narrower: LGBTQ+ poetry
narrower: Queer literature
narrower: Transgender literature
narrower: LGBTQ+ youth literature
narrower: Aromantic literature
narrower: Asexual literature
narrower: Demisexual literature
narrower: Megasexual literature
narrower: Greyromantic literature
narrower: Intersex literature
narrower: LGBTQ+ children's literature
narrower: LGBTQ+ essays
narrower: LGBTQ+ people's writings
narrower: LGBTQ+ survival guides
related: LGBTQ+ arts
related: LGBTQ+ books
related: LGBTQ+ literary awards
related: LGBTQ+ literary salons
related: LGBTQ+ press
related: Queer (Verb)
related: LGBTQ+ literary criticism
related: LGBTQ+ authors
related: LGBTQ+ cultural heritage institutions
related: Queer coding
related: Two-Spirit literature
related: LGBTQ+ librarians
related: LGBTQ+ people in literature
has top concept: Subcultures
replaces: literatureLGBTQ
issued: 2019-05-14
modified: 2025-04-23
type: Concept
in scheme: v3
change note: Version 4.1.0

Living arrangements
preferred label: Arreglos de vivienda @es
comment: Structure or composition of an individual's household or living environment, including the number of household members and their relationships to each other.
comment: Estructura o composición del hogar o entorno de vida de una persona, incluido el número de miembros del hogar y sus relaciones entre sí. @es
narrower: Civil unions
narrower: Domestic partnerships
narrower: Marriage
related: Domestic partnership contracts
replaces: livingArrangements
issued: 2019-05-14
modified: 2025-02-23
type: Concept
in scheme: v3
change note: Version 4.1.0

Sex locations
preferred label: Lugares de sexo @es
alternative label: Locations for sex
alternative label: Ubicaciones para sexo @es
alternative label: Locaciones para sexo @es
comment: Places where people engage in sexual activities, including private and public spaces.
comment: Lugares donde las personas participan en actividades sexuales, incluidos espacios públicos y privados. @es
narrower: Dark rooms
narrower: Cottages (Gay culture)
narrower: Gay saunas
narrower: Sex parties
narrower: Tearooms (Gay culture)
narrower: Play spaces
related: Anonymous sex
related: LGBTQ+ meeting places
related: Public sex
related: Sex (Act)
related: Sexuality
replaces: sexLocations
issued: 2019-05-14
modified: 2025-02-23
type: Concept
in scheme: v3
change note: Version 4.1.0

Locker rooms
preferred label: Camerinos @es
alternative label: Cambiadores @es
alternative label: Camarinos @es
alternative label: Vestuarios @es
alternative label: Vestidores @es
comment: Rooms or areas in public or commercial spaces where people change clothes, bathe, and store items or personal belongings. LGBTQ+ people, particularly trans people, are often restricted from using locker rooms under the pretense of public safety.
comment: Habitaciones o áreas en espacios públicos o comerciales donde las personas se cambian de ropa, se bañan y guardan artículos o efectos personales. A las personas LGBTQ+, en particular a las personas trans, a menudo se les restringe el uso de los vestuarios con el pretexto de seguridad pública. @es
broader: Public facilities
related: Bathroom bans
has top concept: Public facilities
replaces: lockerRooms
issued: 2019-05-14
modified: 2025-02-23
type: Concept
in scheme: v3
change note: Version 4.1.0

Love triangles
preferred label: Triángulos amorosos @es
comment: Polyamorous relationships that involve three people in various arrangements.
comment: Relaciones poliamorosas que involucran a tres personas en diversos arreglos. @es
broader: Sexual relationships
related: Being in love
has top concept: Relationship satisfaction
replaces: loveTriangles
issued: 2019-05-14
modified: 2026-02-27
type: Concept
in scheme: v3
change note: Version 4.1.0

Lubricants
preferred label: Lubricantes @es
comment: Liquids or gels used during sexual activity, typically to ease the act of penetration by a penis or a sex toy.
comment: Líquidos o geles utilizados durante la actividad sexual, generalmente para facilitar el acto de penetración de un pene o un juguete sexual. @es
broader: Sex accessories
has top concept: Sex accessories
replaces: lubricants
issued: 2019-05-14
modified: 2025-02-23
type: Concept
in scheme: v3
change note: Version 4.1.0

Macho men
preferred label: Hombres macho @es
alternative label: Machos
comment: Subculture of gay men who display characteristics associated with machismo (e.g., masculine pride, self-reliance, physical strength). Though "macho men" can be used more broadly, this term refers to gay men who embrace machismo and traditional masculinity through their dress and behavior.
comment: Subcultura de hombres gay que muestran características asociadas con el machismo (por ejemplo, el orgullo masculino, la autosuficiencia, la fuerza física). Aunque "hombres machos" puede utilizarse de forma más amplia, este término se refiere a hombres gay que abrazan el machismo y la masculinidad tradicional a través de su vestimenta y comportamiento. @es
broader: Gay men
related: Banjees
related: Machismo
related: Masculinities
related: Bara
related: Bara fandom
has top concept: LGBTQ+ people
replaces: machoMen
issued: 2019-05-14
modified: 2025-02-23
type: Concept
in scheme: v3
change note: Version 4.1.0

Māhū
alternative label: Mahu @haw
comment: Term used in Hawaiian and Tahitian cultures for third gender people who blend genders and often hold spiritual roles.
comment: Término utilizado en las culturas hawaianas y tahitianas para las personas del tercer género que mezclan géneros y que, a menudo, desempeñan roles espirituales. @es
broader: Non-Euro-American gender and sexual identities
broader: MVPFAFF+
narrower: Māhūkāne
narrower: Māhūwahine
narrower: Pregnant māhū
narrower: Māhū teachers
narrower: Māhū sex workers
related: Kānaka Maoli LGBTQ+ people
related: Kānaka Maoli transgender people
has top concept: Gender
replaces: mahu
issued: 2019-05-14
modified: 2025-02-23
type: Concept
in scheme: v3
change note: Version 4.1.0

Mak nyahs
comment: Term used in Malaysia for transgender women.
comment: Término utilizado en Malasia para mujeres transgénero. @es
broader: Non-Euro-American gender and sexual identities
has top concept: Gender
replaces: makNyah
issued: 2019-05-14
modified: 2025-02-23
type: Concept
in scheme: v3
change note: Version 4.1.0

Male bonding
preferred label: Vinculación masculina @es
comment: Friendship and connection between two or more male-identified people.
comment: Amistad y conexión entre dos o más personas que se autoidentifican como masculinas. @es
related: Homosociality
related: Men's friendships
replaces: maleBonding
issued: 2019-05-14
modified: 2025-02-23
type: Concept
in scheme: v3
change note: Version 4.1.0

Men's friendships
preferred label: Amistades entre hombres @es
alternative label: Male friendships
alternative label: Amistades masculinas @es
comment: Connections based on affection and trust between two or more men.
comment: Conexiones basadas en el afecto y la confianza entre dos o más hombres. @es
broader: Friendships
broader: Homosociality
related: Male bonding
has top concept: Relationship satisfaction
replaces: mensFriendships
issued: 2019-05-14
modified: 2025-02-23
type: Concept
in scheme: v3
change note: Version 4.1.0

Male impersonators
preferred label: Imitadores masculinos @es
comment: Historical term used to describe performers, often female-identified people, who enact male personas for the purpose of entertainment, typically for straight audiences. Only use in historical contexts.
comment: Término histórico utilizado para describir a los artistas, a menudo personas identificadas como mujeres, que representan personajes masculinos con fines de entretenimiento, generalmente para audiencias heterosexuales. Utilícese únicamente en contextos históricos. @es
broader: LGBTQ+ theater
related: Drag kings
related: Male impersonation shows
has top concept: LGBTQ+ theater
replaces: maleImpersonators
issued: 2019-05-14
modified: 2025-02-23
type: Concept
in scheme: v3
change note: Version 4.1.0

Male prostitution
broader: Prostitution
has top concept: Sex industry
is replaced by: homoit0000236
replaces: maleProstitution
issued: 2019-05-14
modified: 2025-01-28
type: Concept
in scheme: v3
change note: Version 4.1.0

Males
preferred label: Men
preferred label: Hombres @es
has top concept: Gender
is replaced by: homoit0001008
replaces: males
replaces: men
issued: 2019-05-14
modified: 2022-10-25
modified: 2025-02-23
type: Concept
in scheme: v3
change note: Version 4.1.0
comment: Adults who self-identify as men and understand their gender in terms of Western conceptions of manliness, maleness, and/or masculinity. The term has typically been defined as adult male humans, though not all men identify with the term "male" depending on the context in which it is used.
comment: Adultos que se identifican como hombres y que entienden su género en términos de las concepciones occidentales de ser hombre, lo masculino y/o la masculinidad. El término normalmente se ha definido como humanos masculinos adultos, aunque no todos los hombres se identifican con el término "masculino" según el contexto en el que se utiliza. @es
broader: Gender identity
narrower: Bisexual men
narrower: Cisgender men
narrower: Gay men
narrower: Heterosexual men
narrower: Men who have sex with men
narrower: Trans men
narrower: MLM (Men Loving Men)
narrower: Pregnant men
related: Cisgender people
related: Non-Euro-American gender and sexual identities
related: Gender binaries
related: Transgender people
related: Females
related: Men in fandom

MtFs
preferred label: MTFs @es
alternative label: Males transitioning to females
alternative label: MtF transsexuals
alternative label: Male-to-female
alternative label: M2Fs
alternative label: Transsexual women
comment: MtF (male-to-female) is a mostly historical term that has been largely replaced by "trans women." This is due in part to the term’s connection to the medicalisation of transgender people and its assumption that trans women are "born" male and become female (typically through hormones and/or surgery).
comment: MtF (del inglés "male-to-female", traducido como "de hombre a mujer") es un término mayoritariamente histórico que ha sido reemplazado en gran medida por "mujeres trans". Esto se debe en parte a la conexión del término con la medicalización de las personas transgénero y su suposición de que las mujeres trans "nacen" hombres y se vuelven mujeres (generalmente a través de hormonas y/o cirugía). @es
broader: LGBTQ+ historical terms
broader: Transsexual people
broader: Trans women
related: Estrogen
related: FtMs
related: FtXs
related: MtXs
has top concept: LGBTQ+ historical terms
replaces: MtFs
issued: 2019-05-14
modified: 2025-02-23
type: Concept
in scheme: v3
change note: Version 4.1.0

Mangaiko
comment: Mbo term for third gender people.
comment: Término mbo para personas del tercer género. @es
broader: Non-Euro-American gender and sexual identities
has top concept: Gender
replaces: mangaiko
issued: 2019-05-14
modified: 2025-02-23
type: Concept
in scheme: v3
change note: Version 4.1.0

Manual sex
preferred label: Sexo manual @es
comment: Sexual activity involving manual stimulation of erogenous zones using the hands.
comment: Actividad sexual que implica la estimulación manual de zonas erógenas mediante el uso de las manos. @es
broader: Sex (Act)
broader: Sexual practices
narrower: Fingering
narrower: Wacking off
narrower: Wanking
related: Erotic massage
related: Masturbation
has top concept: Sex (Act)
replaces: manualSex
issued: 2019-05-14
modified: 2025-03-20
type: Concept
in scheme: v3
change note: Version 4.1.0

Marital status
preferred label: Estado civil @es
comment: A person's state of being single, married, separated, divorced, or widowed, as defined by a government or legal authority.
comment: El estado de una persona de estar soltera, casada, separada, divorciada o viuda, según lo define un gobierno o una autoridad legal. @es
broader: Marriage
narrower: Divorced people
narrower: Married people
narrower: Single people
narrower: Unmarried couples
narrower: Widowed people
related: Legal status
related: LGBTQ+ separation
related: Marriage law
has top concept: Living arrangements
replaces: maritalStatus
issued: 2019-05-14
modified: 2025-02-23
type: Concept
in scheme: v3
change note: Version 4.1.0

Marriage
preferred label: Matrimonio @es
comment: Legal union between two or more people in a personal relationship that may or may not grant certain economic, legal, and social rights.
comment: Unión jurídica entre dos o más personas en una relación personal que puede o no otorgar ciertos derechos económicos, legales y sociales. @es
broader: Living arrangements
narrower: Mixed-orientation marriage
narrower: Common law marriage
narrower: Same-sex marriage
narrower: Heterosexual marriage
narrower: LGBTQ+ divorce
narrower: LGBTQ+ separation
narrower: Marital status
narrower: Marriage certificates
narrower: Marriage licenses
narrower: Women's marriages
related: Legal name change
related: Civil unions
related: Domestic partnership contracts
related: Domestic partnerships
related: LGBTQ+ weddings
related: Marriage law
related: Official documentation
has top concept: Living arrangements
replaces: marriage
issued: 2019-05-14
modified: 2026-02-24
type: Concept
in scheme: v3
change note: Version 4.1.0

Marriage certificates
preferred label: Certificados de matrimonio @es
comment: Government-issued documents that serve as official records of marriages; can be used in reference to LGBTQ+ people's marriage certificates or their efforts to acquire marriage certificates.
comment: Documentos emitidos por el gobierno que sirven como registros oficiales de matrimonios; se puede utilizar en referencia a los certificados de matrimonio de personas LGBTQ+ o sus esfuerzos por adquirir certificados de matrimonio. @es
broader: Marriage
broader: Official documentation
related: Marriage law
has top concept: Living arrangements
replaces: marriageCertificates
issued: 2019-05-14
modified: 2025-02-23
type: Concept
in scheme: v3
change note: Version 4.1.0

Marriage law
preferred label: Derecho matrimonial @es
alternative label: Matrimonial law
alternative label: Ley matrimonial @es
alternative label: Ley de matrimonio @es
comment: Legal regulations and laws dictating where, when, under what conditions, and who can be legally married in a certain jurisdiction.
comment: Regulaciones legales y leyes que dictan dónde, cuándo, bajo qué condiciones y quiénes pueden casarse legalmente en una determinada jurisdicción. @es
broader: LGBTQ+ personal and family law
narrower: Common law marriage
related: Civil unions
related: Marital status
related: Marriage
related: Marriage certificates
related: Marriage licenses
has top concept: Law
replaces: marriageLaw
issued: 2019-05-14
modified: 2025-02-23
type: Concept
in scheme: v3
change note: Version 4.1.0

Marriage licenses
preferred label: Licencias de matrimonio @es
comment: Legal documents issued by a religious organization or local authority that authorizes marriage. In some jurisdictions a license is necessary to legalize a union, but this varies by locale.
comment: Documentos legales emitidos por una organización religiosa o autoridad local que autoriza el matrimonio. En algunas jurisdicciones es necesaria una licencia para legalizar una unión, pero esto varía según la localidad. @es
broader: Marriage
broader: Official documentation
related: Marriage law
has top concept: Living arrangements
replaces: marriageLicenses
issued: 2019-05-14
modified: 2025-02-23
type: Concept
in scheme: v3
change note: Version 4.1.0

Married people
preferred label: Personas casadas @es
comment: Individuals who are currently married, or part of a legal union involving two or more people in a personal relationship that may or may not grant certain economic, legal, and social rights.
comment: Personas que actualmente están casadas o forman parte de una unión legal entre dos o más personas en una relación personal que puede o no otorgar ciertos derechos económicos, legales y sociales. @es
broader: Marital status
has top concept: Living arrangements
replaces: marriedPeople
issued: 2019-05-14
modified: 2025-02-23
type: Concept
in scheme: v3
change note: Version 4.1.0

Masculinities
preferred label: Masculinidades @es
alternative label: Masculinity
alternative label: Masculinidad @es
comment: Culture-specific sets of attributes, behaviors, and roles generally associated with men or boys.
comment: Conjuntos de atributos, comportamientos y roles específicos de una cultura generalmente asociados con hombres o niños. @es
broader: Gender expression
narrower: Female masculinity
narrower: Toxic masculinity
narrower: Transmasculinity
narrower: Masculine of center
related: Androgyny
related: Butches
related: Femininities
related: Gender roles
related: Machismo
related: Macho men
related: Transmasculine people
related: Wolves (Gay culture)
has top concept: Gender
replaces: masculinity
issued: 2019-05-14
modified: 2025-03-20
type: Concept
in scheme: v3
change note: Version 4.1.0

Mashoga
comment: Swahili term for people assigned male at birth who engage in sex with men and who may dress as women.
comment: Término swahili para personas asignadas al sexo masculino al nacer que tienen relaciones sexuales con hombres y que pueden vestirse como mujeres. @es
broader: Non-Euro-American gender and sexual identities
has top concept: Gender
replaces: mashoga
issued: 2019-05-14
modified: 2025-02-23
type: Concept
in scheme: v3
change note: Version 4.1.0

Masochism
preferred label: Masoquismo @es
comment: Erotic or sexual enjoyment of pain and intense sensations.
comment: Disfrute erótico o sexual del dolor y de sensaciones intensas. @es
broader: Sadomasochism
broader: Sexual preference
related: Sadism
related: Sexual identity
has top concept: Eroticism
replaces: masochism
issued: 2019-05-14
modified: 2025-02-23
type: Concept
in scheme: v3
change note: Version 4.1.0

Massage
preferred label: Masaje @es
comment: Manipulation of the body through techniques like rubbing and kneading muscles and joints with the hands, typically to relieve tension and pain or to provide erotic stimulation.
comment: Manipulación del cuerpo con las manos mediante técnicas como frotar y masajear músculos y articulaciones, generalmente para aliviar la tensión y el dolor o proporcionar estimulación erótica. @es
narrower: Erotic massage
related: Physical affection
replaces: massage
issued: 2019-05-14
modified: 2025-02-23
type: Concept
in scheme: v3
change note: Version 4.1.0

LGBTQ+ dominants
preferred label: Dominantes LGBTQ+ @es
alternative label: Masters (LGBTQ)
alternative label: LGBTQ+ D-types
alternative label: LGBTQ+ Doms
alternative label: LGBTQ+ masters
alternative label: Amos LGBTQ+ @es
alternative label: Amos (LGBTQ+) @es
comment: The person who takes on the position of authority or power in a power exchange relationship or kink activity.
comment: La persona que asume la posición de autoridad o poder en una relación de intercambio de poder o actividad kink. @es
broader: Sexual identity
broader: Sexual roles
broader: Relationship minorities
broader: Kinky people
narrower: Bisexual dominants
narrower: Gay dominants
narrower: Queer dominants
narrower: Transgender dominants
narrower: Asexual dominants
narrower: Lesbian dominants
related: LGBTQ+ dominatrices
related: Leather community
related: LGBTQ+ mistresses (BDSM culture)
related: Social privilege
related: LGBTQ+ submissives
related: Tops (Sex)
related: Power exchange
has top concept: Sexual identity
replaces: mastersLGBTQ
issued: 2019-05-14
modified: 2025-02-23
type: Concept
in scheme: v3
change note: Version 4.1.0

Masturbation
preferred label: Masturbación @es
comment: Sexual stimulation of one's own genitals for sexual pleasure.
comment: Estimulación sexual de los propios genitales para el placer sexual. @es
broader: Sex (Act)
broader: Sexual practices
narrower: Jerking off
narrower: Mutual masturbation
narrower: Wacking off
related: Autoeroticism
related: Getting off
related: Manual sex
related: Solo sex
has top concept: Sex (Act)
replaces: masturbation
issued: 2019-05-14
modified: 2025-02-23
type: Concept
in scheme: v3
change note: Version 4.1.0

Motherhood
preferred label: Maternidad @es
alternative label: Maternity
comment: The state, condition, or fact of being a mother.
comment: El estado, la condición o el hecho de ser madre. @es
related: Biological parenthood
related: LGBTQ+ adoptive parenthood
related: LGBTQ+ family planning
related: LGBTQ+ foster parenthood
related: LGBTQ+ motherhood
related: LGBTQ+ parenthood
related: Mothers
replaces: motherhood
issued: 2019-05-14
modified: 2025-02-23
type: Concept
in scheme: v3
change note: Version 4.1.0

Mati
comment: Surinamese-Creole women who have sexual relations with other women but also have had or do have relationships with men.
comment: Mujeres surinamesas-criollas que tienen relaciones sexuales con otras mujeres pero que también han tenido o tienen relaciones con hombres. @es
broader: Bisexual women
broader: Women who have sex with women
has top concept: LGBTQ+ people
replaces: mati
issued: 2019-05-14
modified: 2025-02-23
type: Concept
in scheme: v3
change note: Version 4.1.0

Medical care
preferred label: Asistencia médica @es
alternative label: Atención medica @es
comment: Organized measures taken for the maintenance or improvement of health via the prevention, diagnosis, treatment, or cure of disease, illness, injury, or other condition.
comment: Medidas organizadas tomadas para el mantenimiento o la mejora de la salud mediante la prevención, diagnóstico, tratamiento o cura de enfermedades, dolencias, lesiones u otras condiciones. @es
narrower: AIDS memorials
narrower: Gender-affirming surgery
narrower: Medicalization
narrower: Therapies
related: Donors
related: Medical practitioners' statements
related: Informed consent
replaces: medicalCare
issued: 2019-05-14
modified: 2026-02-24
type: Concept
in scheme: v3
change note: Version 4.1.0

Medical practitioners' statements
preferred label: Declaraciones de los médicos @es
comment: Official documents from medical practitioners (e.g., doctors, nurses, therapists) diagnosing a patient's gender dysphoria and, typically, recommending gender-affirming healthcare; sometimes required for an individual's gender-affirming healthcare to be covered under insurance or for an individual to legally change their name or gender marker.
comment: Documentos oficiales de profesionales médicos (por ejemplo, doctores, enfermeras, terapeutas) que diagnostican la disforia de género de un paciente y, por lo general, recomiendan atención médica de afirmación de género; a veces es requerido para que el seguro cubra la atención médica de afirmación de género de una persona o para que una persona cambie legalmente su nombre o marcador de género. @es
broader: Official documentation
related: Birth certificates
related: Driver's licenses
related: Gender markers
related: Medical care
related: Transitioning (Gender)
has top concept: Legal status
replaces: medicalPractitionersStatements
issued: 2019-05-14
modified: 2025-02-23
type: Concept
in scheme: v3
change note: Version 4.1.0

Medicalization
preferred label: Medicalización @es
preferred label: Medicalisation
comment: Process by which human conditions and experiences come to be defined and treated as medical conditions and thus become the subject of medical study, diagnosis, prevention, and/or treatment. Use in reference to non-medical problems, such as LGBTQ+ identities and practices, that have been wrongly treated as medical issues.
comment: Proceso por el cual las condiciones y experiencias humanas pasan a definirse y tratarse como condiciones médicas y, por tanto, a convertirse en objeto de estudio, diagnóstico, prevención y/o tratamiento médico. Utilícese en referencia a problemas no médicos, tales como identidades y prácticas LGBTQ+, que han sido erróneamente tratadas como problemas médicos. @es
broader: Medical care
narrower: Eonism
narrower: Gender identity disorder
narrower: Intersex variations
narrower: Sexual inversion
narrower: Transgenderism
narrower: Transsexualism
narrower: Transvestism
narrower: Transmedicalism
related: Anti-transgender discrimination
related: Disorders of sexual development
related: Gender dysphoria
related: Sex assigned at birth
related: Social constructionism
related: Early genital surgery model
related: Hopkins model
has top concept: Medical care
replaces: medicalisation
issued: 2019-05-14
modified: 2025-03-20
type: Concept
in scheme: v3
change note: Version 4.1.0

Medication
preferred label: Medicamento @es
alternative label: Pharmaceuticals
alternative label: Productos farmacéuticos @es
alternative label: Farmacéuticos @es
comment: Non-recreational drugs as used by members of the LGBTQ+ community.
comment: Drogas no recreativas utilizadas por miembros de la comunidad LGBTQ+. @es
broader: Therapies
narrower: Erection pills
narrower: Hormone blockers
narrower: Passive immune therapy
narrower: Puberty blockers
narrower: HAART (Highly Active Antiretroviral Therapy)
narrower: PEP (HIV)
related: Hormone therapy (Gender)
related: Cocaine
has top concept: Medical care
replaces: medication
issued: 2019-05-14
modified: 2025-03-20
type: Concept
in scheme: v3
change note: Version 4.1.0

Men who have sex with men
preferred label: Hombres que tienen sexo con hombres @es
alternative label: MSM
comment: Men who engage in sexual activity with other men, whether or not they identify as gay or bisexual.
comment: Hombres que participan de actividades sexuales con otros hombres, se autoidentifiquen o no como gay o bisexuales. @es
broader: LGBTQ+ people
broader: Males
related: Banjees
related: Bisexual men
related: Down-low
related: Gay men
related: Same-gender-loving
related: Sexual minorities
has top concept: LGBTQ+ people
replaces: menWhoHaveSexWithMen
issued: 2019-05-14
modified: 2025-02-23
type: Concept
in scheme: v3
change note: Version 4.1.0

Men's movement
preferred label: Movimiento de hombres @es
comment: Movement that began in the 1960s and 1970s (primarily in the United States, United Kingdom, and Australia) in response to the women's movement. Consists of groups and organizations of men and their allies working to address gender issues and their impact on men. Different men's movement groups vary significantly in how they frame their relationship to the women's movement and society at large. Not to be confused with the men's or father's rights movement, which focuses on perceived inequalities faced by men and seeks to maintain patriarchal values.
comment: Movimiento que comenzó en las décadas de 1960 y 1970 (principalmente en los Estados Unidos, el Reino Unido y Australia) en respuesta al movimiento de mujeres. Está formado por grupos y organizaciones de hombres y sus aliados que trabajan para abordar los asuntos de género y su impacto en los hombres. Los diferentes grupos del movimiento de hombres varían significativamente en la forma en que enmarcan su relación con el movimiento de mujeres y la sociedad en general. No confundir con el movimiento por los derechos de los hombres o de los padres, que se centra en las desigualdades percibidas que enfrentan los hombres y busca mantener los valores patriarcales. @es
broader: Social movements
has top concept: Social movements
replaces: mensMovement
issued: 2019-05-14
modified: 2025-02-23
type: Concept
in scheme: v3
change note: Version 4.1.0

Mental disorders
preferred label: Desórdenes mentales @es
alternative label: Mental illnesses
alternative label: Psychiatric disorders
alternative label: Enfermedades mentales @es
alternative label: Desórdenes psiquiátricos @es
alternative label: Trastornos mentales @es
comment: Medical conditions defined by changes or disturbances in an individual's thinking, feeling, mood, and behavior.
comment: Condiciones médicas definidas por cambios o alteraciones en el pensamiento, los sentimientos, el estado de ánimo y el comportamiento de una persona. @es
narrower: Ego-dystonic sexual orientation
replaces: mentalDisorders
issued: 2019-05-14
modified: 2026-02-24
type: Concept
in scheme: v3
change note: Version 4.1.0

Mental health care for LGBTQ+ people
preferred label: Cuidados de salud mental para las personas LGBTQ+ @es
alternative label: Mental health care for LGBTQ people
alternative label: Salud mental para personas LGBTQ+ @es
comment: Organized measures taken for the diagnosis, maintenance, treatment, or improvement of mental health or psychological well being; use in reference to mental health care addressing the particular needs of LGBTQ+ individuals or communities.
comment: Medidas organizadas tomadas para el diagnóstico, el mantenimiento, el tratamiento o la mejora de la salud mental o el bienestar psicológico; utilícese en referencia a los cuidados de salud mental que abordan las necesidades particulares de personas o comunidades LGBTQ+. @es
broader: Health care for LGBTQ+ people
narrower: LGBTQ+ support groups
narrower: Recovery groups
related: Detention of LGBTQ+ people under a hospital order
related: DSM (Diagnostic and Statistical Manual of Mental Disorders)
related: LGBTQ+ suicide
related: Therapies
related: LGBTQ+ psychology
has top concept: Health care for LGBTQ+ people
replaces: mentalHealthCareForLGBTQPeople
issued: 2019-05-14
modified: 2026-02-24
type: Concept
in scheme: v3
change note: Version 4.1.0

Metis
comment: Officially recognized third gender in Nepal; predominantly used to refer to transgender women.
comment: Tercer género oficialmente reconocido en Nepal; se utiliza predominantemente para referirse a mujeres transgénero. @es
broader: Non-Euro-American gender and sexual identities
has top concept: Gender
replaces: metis
issued: 2019-05-14
modified: 2025-02-23
type: Concept
in scheme: v3
change note: Version 4.1.0

Micropenis
preferred label: Micropene @es
alternative label: Microphallus
alternative label: Microfalo @es
comment: A person born with a micropenis has a penis that is smaller than the typical size range for an infant. People may also develop a micropenis as a result of several different intersex variations. The size of a person’s penis does not generally affect its functionality.
comment: Una persona que nace con un micropene tiene un pene que es más pequeño que el rango de tamaño usual para un bebé. Las personas también pueden desarrollar un micropene como resultado de diferentes variaciones intersex. Por lo general, el tamaño del pene de una persona no afecta su funcionalidad. @es
broader: Intersex variations
has top concept: Sex (Body)
replaces: micropenis
issued: 2019-05-14
modified: 2025-02-23
type: Concept
in scheme: v3
change note: Version 4.1.0

Misandry
preferred label: Misandria @es
comment: Hate or dislike of men or boys.
comment: Odio o desagrado hacia los hombres o los niños. @es
related: Intolerance towards LGBTQ+ people
replaces: misandry
issued: 2019-05-14
modified: 2025-02-23
type: Concept
in scheme: v3
change note: Version 4.1.0

Misgendering
preferred label: Malgenerizar @es
comment: The act of referring to a person's gender incorrectly, often by using pronouns they do not identify with.
comment: El acto de referirse incorrectamente al género de una persona, a menudo mediante el uso de pronombres con los que no se identifica. @es
related: Deadnaming
related: Gender identity
related: Pronouns
related: Gender-neutral language
replaces: misgendering
issued: 2019-05-14
modified: 2025-02-23
type: Concept
in scheme: v3
change note: Version 4.1.0

Misogyny
preferred label: Misoginia @es
comment: Hate or dislike of women or girls.
comment: Odio o desagrado hacia las mujeres o las niñas. @es
narrower: Misogyny in fandom
related: Intolerance towards LGBTQ+ people
related: Social privilege
related: Transmisogyny
related: Transmisogynoir
related: Misogynoir
replaces: misogyny
issued: 2019-05-14
modified: 2025-02-23
type: Concept
in scheme: v3
change note: Version 4.1.0

LGBTQ+ mistresses (BDSM culture)
preferred label: Amas LGBTQ+ @es
alternative label: Mistresses (LGBTQ)
alternative label: LGBTQ+ mistresses
alternative label: Amas (LGBTQ) @es
comment: LGBTQ+ women who are part of the BDSM scene and assume the mistress role in sexual relationships with a mistress/submissive dynamic.
comment: Mujeres LGBTQ+ que forman parte de la escena BDSM y asumen el rol de ama en relaciones sexuales con una dinámica ama/esclava. @es
broader: Sexual identity
broader: Sexual roles
broader: Tops (Sex)
narrower: Bisexual mistresses
narrower: Lesbian mistresses
narrower: Queer mistresses
narrower: Transgender mistresses
narrower: Asexual mistresses
related: LGBTQ+ dominatrices
related: LGBTQ+ dominants
related: Social privilege
related: LGBTQ+ submissives
has top concept: Sexual identity
replaces: mistressesLGBTQ
issued: 2019-05-14
modified: 2025-02-23
type: Concept
in scheme: v3
change note: Version 4.1.0

Monogamy
preferred label: Monogamia @es
comment: Relationship orientation in which individuals are exclusively committed to one partner at a time.
comment: Orientación relacional en la que las personas se comprometen exclusivamente con una pareja a la vez. @es
broader: Partner preference
broader: Sexual relationships
broader: Relationship orientation
related: Sexual identity
related: Mononormativity
related: Monogamous people
has top concept: Sexual preference
replaces: monogamy
issued: 2019-05-14
modified: 2025-02-23
type: Concept
in scheme: v3
change note: Version 4.1.0

Mosaicism involving "sex" chromosomes
comment: People with mosaic chromosomes have different chromosome patterns in some cells of their body than in others. Mosaicism results from random differences in how cells divide while an embryo is growing, resulting in different numbers of chromosomes in different cells (such as 45X/46XX or 45X/46XY, which are both variants of Turner syndrome, or 46XY/47XXY or 46XX/47XXY, which are both variants of Klinefelter syndrome). If someone specifically has 46XX chromosomes in some cells and 46XY in others, their variation is probably chimerism instead of mosaicism. Having mosaic chromosomes can cause someone to develop variations in their genitals, gonads, or hormone function. For example, if they have at least one Y chromosome, they may have both ovarian and testicular tissue, or genital differences like hypospadias, or they may develop some secondary sex characteristics at puberty that are not expected for the sex they were assigned. People who have mosaicism without a Y chromosome (e.g., 45X/46XX, or 46XX/47XXX) may have streak gonads or ovaries that stop functioning at an earlier age than typical, which can affect development during puberty and fertility. Other people may not have any noticeable signs of their mosaicism at all.
broader: Intersex variations
has top concept: Sex (Body)
replaces: mosaicismInvolvingSexChromosomes
issued: 2019-05-14
modified: 2025-02-23
type: Concept
in scheme: v3
change note: Version 4.1.0

Mothers
preferred label: Madres @es
alternative label: Mamás @es
comment: People who are mothers.
comment: Personas que son madres. @es
broader: Family members
narrower: LGBTQ+ co-mothers
narrower: LGBTQ+ single mothers
narrower: LGBTQ+ mothers
narrower: Mothers of LGBTQ+ people
narrower: Asexual mothers
narrower: Intersex mothers
narrower: Two-Spirit mothers
related: Lesbian parents
related: LGBTQ+ motherhood
related: Motherhood
has top concept: Family members
replaces: mothers
issued: 2019-05-14
modified: 2025-02-23
type: Concept
in scheme: v3
change note: Version 4.1.0

Mothers of bisexual people
preferred label: Madres de personas bisexuales @es
alternative label: Mamás de personas bisexuales @es
comment: A person who assumes the role of mother to a bisexual person; use only for individuals who self-identify as mothers.
comment: Una persona que asume el rol de madre de una persona bisexual; utilícese únicamente para personas que se autoidentifiquen como madres. @es
broader: Mothers of LGBTQ+ people
has top concept: Family members
replaces: mothersOfBisexualPeople
issued: 2019-05-14
modified: 2025-02-23
type: Concept
in scheme: v3
change note: Version 4.1.0

Mothers of gay men
preferred label: Madres de hombres gay @es
alternative label: Mamás de hombres gay @es
comment: A person who assumes the role of mother to a gay man; use only for individuals who self-identify as mothers.
comment: Una persona que asume el rol de madre de un hombre gay; utilícese únicamente para personas que se autoidentifiquen como madres. @es
broader: Mothers of LGBTQ+ people
has top concept: Family members
replaces: mothersOfGayMen
issued: 2019-05-14
modified: 2025-02-23
type: Concept
in scheme: v3
change note: Version 4.1.0

Mothers of lesbians
preferred label: Madres de lesbianas @es
alternative label: Mamás de lesbianas @es
comment: A person who assumes the role of mother to a lesbian; use only for individuals who self-identify as mothers.
comment: Una persona que asume el rol de madre de una lesbiana; utilícese únicamente para personas que se autoidentifiquen como madres. @es
broader: Mothers of LGBTQ+ people
has top concept: Family members
replaces: mothersOfLesbians
issued: 2019-05-14
modified: 2025-02-23
type: Concept
in scheme: v3
change note: Version 4.1.0

Mothers of transgender people
preferred label: Madres de personas transgénero @es
alternative label: Mamás de personas transgénero @es
comment: A person who assumes the role of mother to a transgender person; use only for individuals who self-identify as mothers.
comment: Una persona que asume el rol de madre de una persona transgénero; utilícese únicamente para personas que se autoidentifiquen como madres. @es
broader: Mothers of LGBTQ+ people
has top concept: Family members
replaces: mothersOfTransgenderPeople
issued: 2019-05-14
modified: 2025-02-23
type: Concept
in scheme: v3
change note: Version 4.1.0

LGBTQ+ movement
preferred label: Movimiento LGBTQ+ @es
alternative label: Movement (LGBTQ)
alternative label: Movimento (LGBTQ) @es
comment: Refers to various social and political movements aimed at securing equity and equal representation for LGBTQ+ people.
comment: Se refiere a varios movimientos sociales y políticos destinados a garantizar la equidad y la representación equitativa de las personas LGBTQ+. @es
broader: Social movements
narrower: Bisexual movement
narrower: Gay movement
narrower: Intersex movement
narrower: Lesbian movement
narrower: Queer movement
narrower: Transgender movement
narrower: Asexual movement
related: AIDS activists
related: LGBTQ+ civil rights
related: Gay-straight alliances
related: Zaps
related: Two-Spirit movement
related: LGBTQ+ philanthropy
related: LGBTQ+ demonstrations
has top concept: Social movements
replaces: movementLGBTQ
issued: 2019-05-14
modified: 2026-02-24
type: Concept
in scheme: v3
change note: Version 4.1.0

MtXs
preferred label: MTXs @es
comment: People who transition from male to unknown or not male.
comment: Personas que hacen transición de hombre a un género desconocido o a no-hombre. @es
broader: Transgender people
related: FtMs
related: FtXs
related: MtFs
related: X-jendā
has top concept: LGBTQ+ people
replaces: mtxs
issued: 2019-05-14
modified: 2025-02-23
type: Concept
in scheme: v3
change note: Version 4.1.0

Mud sex
preferred label: Sexo en el barro @es
comment: Sexual activities that take place outside in mud.
comment: Actividades sexuales que se llevan a cabo al aire libre en el barro. @es
broader: Sex (Act)
broader: Sexual practices
has top concept: Sex (Act)
replaces: mudSex
issued: 2019-05-14
modified: 2025-02-23
type: Concept
in scheme: v3
change note: Version 4.1.0

Mukhannathun
alternative label: Mukhannaths @ar
comment: A term used in classical Arabic to refer to men who are perceived as effeminate.
comment: Término utilizado en el árabe clásico para referirse a hombres percibidos como afeminados. @es
broader: Non-Euro-American gender and sexual identities
has top concept: Gender
replaces: mukhannathun
issued: 2019-05-14
modified: 2025-02-23
type: Concept
in scheme: v3
change note: Version 4.1.0

LGBTQ+ museums
preferred label: Museos LGBTQ+ @es
alternative label: Museums (LGBTQ)
alternative label: Museos (LGBTQ) @es
comment: Institutions dedicated to the storage, exhibition, conservation, and preservation of materials relating to LGBTQ+ people, LGBTQ+ communities, and LGBTQ+ history.
comment: Instituciones dedicadas al almacenamiento, la exhibición, la conservación y la preservación de materiales relacionados con las personas LGBTQ+, las comunidades LGBTQ+ y la historia LGBTQ+. @es
broader: LGBTQ+ cultural heritage institutions
narrower: Bisexual museums
narrower: Gay museums
narrower: Lesbian museums
narrower: Queer museums
narrower: Transgender museums
related: LGBTQ+ special collections
related: Two-Spirit museums
has top concept: LGBTQ+ cultural heritage institutions
replaces: museumsLGBTQ
issued: 2019-05-14
modified: 2026-02-23
type: Concept
in scheme: v3
change note: Version 4.1.0

LGBTQ+ musicals
preferred label: Musicales LGBTQ+ @es
alternative label: Musicals (LGBTQ)
alternative label: Musicales (LGBTQ) @es
comment: Films or theatrical productions in which singing and/or dancing are essential elements. Use for musicals created by LGBTQ+ directors, depicting LGBTQ+ people, or that are regarded as important within LGBTQ+ culture.
comment: Películas o producciones teatrales en las que el canto y/o el baile son elementos imprescindibles. Utilícese para musicales creados por directores LGBTQ+ o que son considerados importantes dentro de la cultura LGBTQ+. @es
broader: LGBTQ+ arts
narrower: Gay musicals
narrower: Bisexual musicals
narrower: Transgender musicals
narrower: Asexual musicals
narrower: Intersex musicals
narrower: Lesbian musicals
related: Gay theater groups
related: Lesbian theater groups
related: LGBTQ+ theater
has top concept: Subcultures
replaces: musicals
issued: 2019-05-14
modified: 2025-02-23
type: Concept
in scheme: v3
change note: Version 4.1.0

LGBTQ+ Muslims
preferred label: Musulmanes LGBTQ+ @es
alternative label: Muslims (LGBTQ)
alternative label: Musulmanes (LGBTQ) @es
comment: LGBTQ+ people who are Muslim.
comment: Personas LGBTQ+ que son musulmanas. @es
broader: LGBTQ+ African religions
narrower: Bisexual Muslims
narrower: Gay Muslims
narrower: Lesbian Muslims
narrower: Queer Muslims
narrower: Transgender Muslims
narrower: Intersex Muslims
narrower: Asexual Muslims
has top concept: LGBTQ+ African religions
replaces: muslimsLGBTQ
issued: 2019-05-14
modified: 2025-02-23
type: Concept
in scheme: v3
change note: Version 4.1.0

Mutual masturbation
preferred label: Masturbación mutua @es
comment: Sex act in which two or more people simultaneously stimulate their own genitalia.
comment: Acto sexual en el que dos o más personas estimulan simultáneamente sus propios genitales. @es
broader: Masturbation
broader: Sex (Act)
broader: Sexual practices
has top concept: Sex (Act)
replaces: mutualMasturbation
issued: 2019-05-14
modified: 2025-02-23
type: Concept
in scheme: v3
change note: Version 4.1.0

Muxe
comment: In Zapotec cultures of Oaxaca (southern Mexico), this term refers to people assigned male at birth who dress and behave in feminine ways; sometimes considered a third gender.
comment: En las culturas zapotecas de Oaxaca (sur de México), este término se refiere a personas asignadas al sexo masculino al nacer que se visten y comportan de manera femenina; a veces es considerado un tercer género. @es
broader: Non-Euro-American gender and sexual identities
has top concept: Gender
replaces: muxe
issued: 2019-05-14
modified: 2025-02-23
type: Concept
in scheme: v3
change note: Version 4.1.0

Nádleehi
comment: Term used in Native American Navajo tribes to describe people assigned male at birth who take on the role of girls in childhood and women in adulthood.
comment: Término utilizado en las tribus nativo americanas navajos para describir a las personas asignadas al sexo masculino al nacer que asumen el papel de niñas en la niñez y de mujeres en la adultez. @es
broader: Non-Euro-American gender and sexual identities
related: Dilbaa
related: Two-Spirit people
has top concept: Gender
replaces: nadleehi
issued: 2019-05-14
modified: 2025-02-23
type: Concept
in scheme: v3
change note: Version 4.1.0

Native American LGBTQ+ people
preferred label: Personas LGBTQ+ nativoamericanas @es
alternative label: American Indians (LGBTQ)
alternative label: Native Americans (LGBTQ)
alternative label: American Indian LGBTQ+ people
alternative label: LGBTQ+ American Indians
alternative label: LGBTQ+ Native Americans
alternative label: Personas nativoamericanas LGBTQ+ @es
comment: People who are part of the Native peoples of the continental United States and Canada (excluding Inuit people) and self-identity as LGBTQ+. Use more specific terms when available.
comment: Personas LGBTQ+ que son nativoamericanas o parte de los pueblos indígenas de Norteamérica; utilícese únicamente para personas que se autoidentifiquen como nativoamericanas y LGBTQ+. @es
broader: Indigenous LGBTQ+ people
narrower: Native American bisexual people
narrower: Native American gay men
narrower: Native American lesbians
narrower: Native American queer people
narrower: Native American transgender people
narrower: Native American asexual people
narrower: Native American intersex people
narrower: Native American non-binary people
related: Berdache
related: Two-Spirit people
related: Indigiqueer people
related: Indigiqueer
related: Two-Spirit identity
has top concept: LGBTQ+ people
replaces: nativeAmericansLGBTQ
issued: 2019-05-14
modified: 2025-02-23
type: Concept
in scheme: v3
change note: Version 4.1.0

Nudism
preferred label: Nudismo @es
alternative label: Naturism
alternative label: Naturismo @es
comment: Practice of engaging in social activities while nude, either in private or public. This term also refers to the cultural movement advocating for nudism as an alternative, healthy lifestyle.
comment: Práctica de participar en actividades sociales al desnudo, ya sea en privado o en público. Este término también se refiere al movimiento cultural que aboga por el nudismo como un estilo de vida alternativo y saludable. @es
related: Nude beaches
replaces: nudism
issued: 2019-05-14
modified: 2025-02-23
type: Concept
in scheme: v3
change note: Version 4.1.0

Tantric sex
preferred label: Sexo tántrico @es
alternative label: Neotantra
comment: Traditionally refers to a wide range of practices in Hindu and Buddhist yoga usually involving the ritual exercise of sexuality. Do not use outside of these contexts.
comment: Tradicionalmente se refiere a una amplia gama de prácticas de yoga hindú y budista que generalmente implican el ejercicio ritual de la sexualidad. No se debe utilizar fuera de estos contextos. @es
broader: Sex (Act)
broader: Sexual practices
has top concept: Sex (Act)
replaces: tantricSex
issued: 2019-05-14
modified: 2025-02-23
type: Concept
in scheme: v3
change note: Version 4.1.0

Neovagina
comment: A surgically constructed vagina; typically made using tissue grafted from other parts of the body.
comment: Una vagina construida quirúrgicamente; por lo general, se elabora con tejido injertado de otras partes del cuerpo. @es
broader: Gender-affirming surgery
broader: Vagina
related: Clitoroplasty
related: Labiaplasty
related: Vaginoplasty
has top concept: Medical care
replaces: neovagina
issued: 2019-05-14
modified: 2025-02-23
type: Concept
in scheme: v3
change note: Version 4.1.0

LGBTQ+ newsletters
preferred label: Boletines LGBTQ+ @es
alternative label: Newsletters (LGBTQ)
alternative label: Boletines (LGBTQ) @es
comment: Print or digital periodicals created by or for LGBTQ+ people, often with the purpose of sharing community news and information about related issues.
comment: Publicaciones periódicas impresas o digitales creadas por o para personas LGBTQ+, a menudo con el propósito de compartir noticias e información de la comunidad sobre temas relacionados. @es
broader: LGBTQ+ press
broader: LGBTQ+ periodicals
narrower: Bisexual newsletters
narrower: Gay newsletters
narrower: Lesbian newsletters
narrower: Queer newsletters
narrower: Transgender newsletters
narrower: Asexual newsletters
narrower: Intersex newsletters
related: LGBTQ+ magazines
related: LGBTQ+ newspapers
related: Two-Spirit newsletters
has top concept: LGBTQ+ press
replaces: newslettersLGBTQ
issued: 2019-05-14
modified: 2025-02-23
type: Concept
in scheme: v3
change note: Version 4.1.0

LGBTQ+ newspapers
preferred label: Periódicos LGBTQ+ @es
alternative label: Newspapers (LGBTQ)
alternative label: Diarios LGBTQ+ @es
alternative label: Diarios (LGBTQ) @es
alternative label: Periódicos (LGBTQ) @es
comment: Serialized print or digital publications about LGBTQ+ people and LGBTQ+ issues (typically produced by LGBTQ+ people or LGBTQ+ organizations) that contain news, articles, columns, correspondence, and advertisements.
comment: Publicaciones impresas o digitales serializadas sobre personas LGBTQ+ y temas LGBTQ+ (normalmente producidas por personas LGBTQ+ u organizaciones LGBTQ+) que contienen noticias, artículos, columnas, correspondencia y anuncios. @es
broader: LGBTQ+ press
broader: LGBTQ+ periodicals
narrower: Bisexual newspapers
narrower: Gay newspapers
narrower: Lesbian newspapers
narrower: LGBTQ+ obituaries
narrower: Queer newspapers
narrower: Transgender newspapers
narrower: Asexual newspapers
narrower: Intersex newspapers
related: LGBTQ+ magazines
related: LGBTQ+ newsletters
related: Two-Spirit newspapers
has top concept: LGBTQ+ press
replaces: newspapersLGBTQ
issued: 2019-05-14
modified: 2025-02-23
type: Concept
in scheme: v3
change note: Version 4.1.0

Niizh manidoowag
comment: Native American Ojibwa term for Two-Spirit people.
comment: Término nativoamericano ojibwa para referirse a las personas dos espíritus. @es
broader: Non-Euro-American gender and sexual identities
related: Two-Spirit people
has top concept: Gender
replaces: niizhManidoowag
issued: 2019-05-14
modified: 2025-02-23
type: Concept
in scheme: v3
change note: Version 4.1.0

Ninauposkitzipxpe
comment: Used in Native American Blackfoot tribes for people assigned female at birth who are not constrained to the social roles of women; translates to "manly-hearted woman."
comment: Se utiliza en las tribus nativo americanas blackfoot para personas asignadas al sexo femenino al nacer que no están limitadas a los roles sociales de las mujeres; se traduce a "mujer de corazón varonil". @es
broader: Non-Euro-American gender and sexual identities
related: Two-Spirit people
has top concept: Gender
replaces: ninauposkitzipxpe
issued: 2019-05-14
modified: 2025-02-23
type: Concept
in scheme: v3
change note: Version 4.1.0

Nipple clamps
preferred label: Pinzas para pezones @es
comment: Sex toys consisting of clamps, usually connected by a chain, that are attached to the nipples to cause pain and erotic pleasure.
comment: Juguetes sexuales que consisten de pinzas, generalmente conectadas por una cadena, que se sujetan a los pezones para provocar dolor y placer erótico. @es
broader: Sex accessories
broader: Clamps (Erotic)
related: Nipple
has top concept: Sex accessories
replaces: nippleClamps
issued: 2019-05-14
modified: 2025-02-23
type: Concept
in scheme: v3
change note: Version 4.1.0

Nipple play
preferred label: Juego de pezones @es
alternative label: Nipple sex
alternative label: Sexo de pezones @es
comment: Sexual acts involving stimulation of the nipples.
comment: Actos sexuales que implican la estimulación de los pezones. @es
broader: Sex (Act)
broader: Sexual practices
broader: Breast play
broader: Chest play
narrower: Nipple torture
related: Breast fetish
related: Nipple
related: Breast torture
has top concept: Sex (Act)
replaces: nipplePlay
issued: 2019-05-14
modified: 2025-02-23
type: Concept
in scheme: v3
change note: Version 4.1.0

No hormone identity
preferred label: Identidad sin hormonas @es
comment: Individuals who have not undergone hormone treatment; typically used to describe trans people who have not undergone and/or do not plan to undergo hormone treatment.
comment: Personas que no se han sometido a tratamiento hormonal; normalmente se utiliza para describir a personas trans que no se han sometido y/o no planean someterse a tratamiento hormonal. @es
broader: Transitioning status
related: Hormone therapy (Gender)
related: Herbal treatments
related: Non-operative
related: Transgender people
related: Transsexual people
has top concept: Transitioning (Gender)
replaces: noHormoneIdentity
issued: 2019-05-14
modified: 2025-02-23
type: Concept
in scheme: v3
change note: Version 4.1.0

Non-binary people
preferred label: Personas no binarias @es
alternative label: Nonbinary people
alternative label: Enbies
alternative label: NB-ies
alternative label: No binarios @es
comment: Individuals whose gender identity exists outside of the gender binary; only use to describe individuals who self-identify as non-binary.
comment: Personas cuya identidad de género existe fuera del binario de género; utilícese únicamente para describir a personas que se autoidentifiquen como no binarias. @es
broader: Transgender people
narrower: Non-binary youth
narrower: Non-binary parents
narrower: Non-binary college students
narrower: Pregnant non-binary people
related: Agender people
related: Androgynous people
related: Gender diversity
related: Gender identity
related: Demigirls
related: Demiboys
related: Xenogender identity
related: Xenogender people
related: Non-binary identity
related: Non-binary people in fandom
has top concept: LGBTQ+ people
replaces: nonBinaryPeople
issued: 2019-05-14
modified: 2025-02-23
type: Concept
in scheme: v3
change note: Version 4.1.0

Non-operative
preferred label: No quirúrgico @es
comment: The medical status of individuals who do not plan to undertake a surgical procedure. Commonly used to describe trans people who have not and do not plan to undertake gender affirming surgery.
comment: El estado médico de las personas que no planean someterse a un procedimiento quirúrgico. Se utiliza comúnmente para describir a personas trans que no se han sometido ni planean someterse a una cirugía de afirmación de género. @es
broader: Transitioning status
related: Gender-affirming surgery
related: Herbal treatments
related: No hormone identity
related: Transgender people
related: Transsexual people
has top concept: Transitioning (Gender)
replaces: nonOperative
issued: 2019-05-14
modified: 2025-02-23
type: Concept
in scheme: v3
change note: Version 4.1.0

Nude beaches
preferred label: Playas nudistas @es
comment: Beaches that permit nudity.
comment: Playas que permiten la desnudez. @es
broader: LGBTQ+ beaches
related: Nudism
has top concept: LGBTQ+ meeting places
replaces: nudeBeaches
issued: 2019-05-14
modified: 2025-02-23
type: Concept
in scheme: v3
change note: Version 4.1.0

Nude photographs
preferred label: Fotos nudistas @es
alternative label: Nudes
alternative label: Fotos desnudas @es
alternative label: Desnudos @es
alternative label: Fotografías de desnudos @es
alternative label: Fotos de desnudos @es
comment: Images of naked individuals, including those taken by amateurs or professionals; may be produced for aesthetic or erotic purposes.
comment: Imágenes de personas desnudas, incluidas las tomadas por aficionados o profesionales; pueden producirse con fines estéticos o eróticos. @es
broader: Nude art
related: LGBTQ+ arts
has top concept: Nude art
replaces: nudePhotographs
issued: 2019-05-14
modified: 2025-02-23
type: Concept
in scheme: v3
change note: Version 4.1.0

Nude art
preferred label: Arte desnudo @es
comment: Works of art depicting naked individuals, either for aesthetic or erotic purposes; includes paintings, photographs, sculptures, etc.
comment: Obras de arte que representan a personas desnudas, con fines estéticos o eróticos; incluye pinturas, fotografías, esculturas, etc. @es
narrower: Nude photographs
related: LGBTQ+ arts
related: LGBTQ+ erotic art
replaces: nudes
issued: 2019-05-14
modified: 2025-02-23
type: Concept
in scheme: v3
change note: Version 4.1.0

Official documentation
preferred label: Documentación oficial @es
comment: Legal documents issued by a government or institution to individuals that include identifying information and, typically, grant certain legal or governmental rights and responsibilities (e.g., driver's license, birth certificate, passport).
comment: Documentos legales expedidos por un gobierno o una institución a personas que incluyen información identificativa y, normalmente, conceden ciertos derechos y responsabilidades legales o gubernamentales (por ejemplo, permiso de conducir, certificado de nacimiento, pasaporte). @es
broader: Legal status
narrower: Birth certificates
narrower: Legal name change
narrower: Civil union documents
narrower: Civil union certificates
narrower: Court orders
narrower: Domestic partnership contracts
narrower: Driver's licenses
narrower: Marriage certificates
narrower: Marriage licenses
narrower: Medical practitioners' statements
narrower: Passports
narrower: Social security cards
related: Civil unions
related: Domestic partnerships
related: LGBTQ+ immigration rights
related: LGBTQ+ personal and family law
related: Marriage
related: LGBTQ+ immigrants
related: LGBTQ+ asylum seekers
has top concept: Legal status
replaces: officialDocumentation
issued: 2019-05-14
modified: 2025-03-20
type: Concept
in scheme: v3
change note: Version 4.1.0

Older bisexual people
preferred label: Personas mayores bisexuales @es
alternative label: Personas ancianas bisexuales @es
alternative label: Personas en su tercera edad bisexuales @es
alternative label: Personas de tercera edad bisexuales @es
comment: Bisexual people who are advanced in age, typically over 60 years of age.
comment: Personas bisexuales de edad avanzada, normalmente mayores de 60 años. @es
broader: Bisexual people
broader: LGBTQ+ older people
has top concept: LGBTQ+ people
replaces: olderBisexualPeople
issued: 2019-05-14
modified: 2025-02-23
type: Concept
in scheme: v3
change note: Version 4.1.0

Older gay men
preferred label: Hombres gay mayores @es
alternative label: Hombres gay ancianos @es
alternative label: Hombres en su tercera edad gay @es
alternative label: Hombres de tercera edad gay @es
comment: Gay men who are advanced in age, typically over 60 years of age.
comment: Hombres gay de edad avanzada, normalmente mayores de 60 años. @es
broader: LGBTQ+ older people
broader: Gay men
has top concept: LGBTQ+ people
replaces: olderGayMen
issued: 2019-05-14
modified: 2025-02-23
type: Concept
in scheme: v3
change note: Version 4.1.0

Older lesbians
preferred label: Lesbianas mayores @es
alternative label: Lesbianas ancianas @es
alternative label: Lesbianas en su tercera edad @es
alternative label: Lebianas de tercera edad @es
comment: Lesbians who are advanced in age, typically over 60 years of age.
comment: Lesbianas de edad avanzada, normalmente mayores de 60 años. @es
broader: LGBTQ+ older people
broader: Lesbians
has top concept: LGBTQ+ people
replaces: olderLesbians
issued: 2019-05-14
modified: 2025-02-23
type: Concept
in scheme: v3
change note: Version 4.1.0

Older queer people
preferred label: Personas mayores queer @es
alternative label: Personas ancianas queer @es
alternative label: Personas en su tercera edad queer @es
alternative label: Personas de tercera edad queer @es
comment: Queer people who are advanced in age, typically over 60 years of age.
comment: Personas queer de edad avanzada, normalmente mayores de 60 años. @es
broader: LGBTQ+ older people
has top concept: LGBTQ+ people
replaces: olderQueerPeople
issued: 2019-05-14
modified: 2025-02-23
type: Concept
in scheme: v3
change note: Version 4.1.0

Older transgender people
preferred label: Personas mayores transgénero @es
alternative label: Personas ancianas transgénero @es
alternative label: Personas en su tercera edad transgénero @es
alternative label: Personas de tercera edad transgénero @es
comment: Transgender people who are advanced in age, typically over 60 years of age.
comment: Personas transgénero de edad avanzada, normalmente mayores de 60 años. @es
broader: LGBTQ+ older people
broader: Transgender people
has top concept: LGBTQ+ people
replaces: olderTransgenderPeople
issued: 2019-05-14
modified: 2025-02-23
type: Concept
in scheme: v3
change note: Version 4.1.0

Single parent families
preferred label: Familias monoparentales @es
alternative label: One-parent families
alternative label: Familias de un padre @es
alternative label: Familia de una madre @es
comment: Families headed by a single parent. For single parent families headed by or including LGBTQ+ people, use the term "LGBTQ+ single parent families."
comment: Familias encabezadas por un solo progenitor. Para familias monoparentales encabezadas por personas LGBTQ+ o que las incluyan, utilícese el término "familias monoparentales LGBTQ+". @es
is replaced by: LGBTQ+ single-parent families
replaces: singleParentFamilies
issued: 2019-05-14
modified: 2025-07-16
type: Concept
in scheme: v3
change note: Version 4.1.0

Orchiectomy
preferred label: Orquiectomía @es
comment: Medical procedure to remove one or more testes; often part of gender affirming surgery, though it can be performed for other reasons.
comment: Procedimiento médico para extirpar uno o más testículos; a menudo forma parte de la cirugía de afirmación de género, aunque se puede realizar por otras razones. @es
broader: Castration
broader: Bottom surgery
has top concept: Castration
replaces: orchiectomy
issued: 2019-05-14
modified: 2025-02-23
type: Concept
in scheme: v3
change note: Version 4.1.0

Organizations for sexual research and sexual reform
preferred label: Organizaciones para la investigación y reforma sexual @es
preferred label: Organisations for sexual research and sexual reform
alternative label: Sexual reform organizations
alternative label: Sexual research organizations
alternative label: Organizaciones por la reforma sexual @es
alternative label: Organzaciones por la investigación sexual @es
alternative label: Organizaciones por la investigación y reforma sexual @es
comment: Institutions or groups dedicated to research, education, policy work, and advocacy regarding human sexuality and sexual behavior, particularly to challenge taboos and encourage more open discussion of sex and sexuality within society.
comment: Instituciones o grupos dedicados a la investigación, la educación, el trabajo de políticas y la defensa de la sexualidad humana y el comportamiento sexual, en particular para desafiar los tabúes y fomentar un debate más abierto sobre el sexo y la sexualidad dentro de la sociedad. @es
broader: Sexuality
related: LGBTQ+ clubs and organizations
has top concept: Sexuality
replaces: organisationsForSexualResearchAndSex
issued: 2019-05-14
modified: 2025-02-23
type: Concept
in scheme: v3
change note: Version 4.1.0

Orgasms
preferred label: Orgasmo @es
alternative label: Climaxes
comment: Climaxes of sexual excitement, typically characterized by feelings of pleasure and physical sensations including rapid muscle contractions, higher blood pressure and heart rate, release of endorphins, and ejaculation.
comment: Clímax de la excitación sexual, típicamente caracterizado por sentimientos de placer y sensaciones físicas que incluyen contracciones musculares rápidas, presión arterial y frecuencia cardíaca más altas, liberación de endorfinas y eyaculación. @es
replaces: orgasm
issued: 2019-05-14
modified: 2025-03-20
type: Concept
in scheme: v3
change note: Version 4.1.0

Otters (Gay culture)
preferred label: Nutrias (cultura gay) @es
alternative label: Otter men
alternative label: Otters
alternative label: Chicos nutrias @es
alternative label: Nutrias @es
comment: U.S. slang term term for gay men who blend the physical and social traits of bears and twinks.
comment: Término de la jerga estadounidense para referirse a hombres gay que combinan los rasgos físicos y sociales de los osos y los twinks. @es
broader: Gay culture
broader: Gay men
broader: Gender roles
broader: Sexual identity
related: Bears (Gay culture)
related: Gender expression
related: Pups (Roleplay)
related: Wolves (Gay culture)
has top concept: Subcultures
replaces: otters
issued: 2019-05-14
modified: 2025-02-23
type: Concept
in scheme: v3
change note: Version 4.1.0

Outing (LGBTQ+ culture)
preferred label: Outing (cultura LGBTQ+) @es
alternative label: Outing
alternative label: Sacar del armario @es
alternative label: Sacar del clóset @es
comment: The act of disclosing a person's sexual or gender identity without that person's consent.
comment: El acto de revelar la identidad sexual o de género de una persona sin el consentimiento de esa persona. @es
broader: LGBTQ+ direct action
related: Baby dykes
related: Baby gays
related: Closeted bisexual people
related: Closeted gay men
related: Closeted lesbians
related: Stealth (Transgender)
related: Coming out
related: Deadnaming
related: Secrecy
related: Closeted LGBTQ+ people
related: Closeted transgender people
related: Closeted queer people
related: Closeted intersex people
related: Closeted Two-Spirit people
related: Identification of LGBTQ+ people by police
related: Closeted asexual people
has top concept: LGBTQ+ activism
replaces: outing
issued: 2019-05-14
modified: 2025-02-23
type: Concept
in scheme: v3
change note: Version 4.1.0

Ovo-testes
preferred label: Ovotestículo @es
alternative label: True hermaphroditism
alternative label: "Ovotesticular DSD "
comment: People with this variation are born with both ovarian and testicular tissue. A person can develop one testis and one ovary, or they may develop one or more ovo-testes, which means that a single gonad is made up of both ovarian and testicular cells. The levels of hormones they produce can vary and how their genitals and secondary sex characteristics develop will depend partially on the levels of estrogen and testosterone that their bodies make. In adolescence, people with ovo-testes may develop features associated with either a typical estrogen puberty or a typical testosterone puberty, or they may develop some of each. Sometimes a person with an ovary and a testis or with ovo-testes can produce viable sperm and viable eggs.
comment: Las personas con esta variación nacen con tejido ovárico y testicular. Una persona puede desarrollar un testículo y un ovario, o puede desarrollar uno o más ovotestículos, lo que significa que una sola gónada está formada por células ováricas y testiculares. Los niveles de hormonas que producen pueden variar y la forma en que se desarrollan sus genitales y características sexuales secundarias dependerá en parte de los niveles de estrógeno y testosterona que produzca su cuerpo. En la adolescencia, las personas con ovotestículos pueden desarrollar características asociadas con una pubertad típica de estrógenos o una pubertad típica de testosterona, o pueden desarrollar algunas de cada una. A veces, una persona con un ovario y un testículo o con ovotestículos puede producir espermatozoides y óvulos viables. @es
broader: Intersex variations
has top concept: Sex (Body)
replaces: ovoTestes
issued: 2019-05-14
modified: 2025-02-23
type: Concept
in scheme: v3
change note: Version 4.1.0

Packing (Phallus)
preferred label: Packing @es
alternative label: Abultar @es
comment: The act of wearing padding or a phallic object in the front of the pants or underwear to give the appearance of having a bulge.
comment: El acto de llevar acolchado o un objeto fálico en la parte delantera de los pantalones o la ropa interior de una persona para dar la apariencia de tener un protuberancia. @es
broader: Gender expression
related: Dildo harnesses
related: Penis
related: Packers (Phallus)
has top concept: Gender
replaces: packingPhallus
issued: 2019-05-14
modified: 2025-02-23
type: Concept
in scheme: v3
change note: Version 4.1.0

Spanking paddles
preferred label: Paletas para nalgadas @es
comment: A tool with a short handle at one end and a wide, flat surface at the other that is used to strike the buttocks as a form of impact play.
comment: Herramienta con un mango corto en un extremo y una superficie ancha y plana en el otro que se utiliza para golpear las nalgas como forma de juego de impacto. @es
broader: Sex accessories
related: Spanking
related: Paddling
has top concept: Sex accessories
replaces: spankingPaddles
issued: 2019-05-14
modified: 2025-02-23
type: Concept
in scheme: v3
change note: Version 4.1.0

LGBTQ+ Pagans
preferred label: Paganos LGBTQ+ @es
alternative label: Pagans (LGBTQ)
alternative label: Paganos (LGBTQ) @es
comment: LGBTQ+ people who are members of polytheistic religions or other religions outside of the dominant culture that typically incorporate nature worship and/or the sacred feminine, such as Wicca, Druidry, Heathenry, etc. Use to describe LGBTQ+ people who self-identify as Pagan.
comment: Personas LGBTQ+ que son miembros de religiones politeístas u otras religiones fuera de la cultura dominante que típicamente incorporan el culto a la naturaleza y/o lo sagrado femenino, como la Wicca, el druidismo, el paganismo, etc. Utilícese para describir a las personas LGBTQ+ que se autoidentifiquen como paganas. @es
broader: LGBTQ+ African religions
narrower: Bisexual Pagans
narrower: Gay Pagans
narrower: Lesbian Pagans
narrower: Queer Pagans
narrower: Transgender Pagans
narrower: LGBTQ+ witches
narrower: Intersex Pagans
narrower: Asexual Pagans
related: Goddess movement
has top concept: LGBTQ+ African religions
replaces: pagansLGBTQ
issued: 2019-05-14
modified: 2025-02-23
type: Concept
in scheme: v3
change note: Version 4.1.0

Palao'ana
comment: Chamorro (Mariana Islands) term for third gender people.
comment: Término chamorro (Islas Marianas) para personas del tercer género. @es
broader: Non-Euro-American gender and sexual identities
has top concept: Gender
replaces: palaoana
issued: 2019-05-14
modified: 2025-02-23
type: Concept
in scheme: v3
change note: Version 4.1.0

Pangender identity
preferred label: Identidad pangénero @es
comment: Gender identity that encompasses multiple or all genders.
comment: Identidad de género que abarca múltiples o todos los géneros. @es
broader: Gender identity
related: Pangender people
has top concept: Gender
replaces: pangenderIdentity
issued: 2019-05-14
modified: 2025-02-23
type: Concept
in scheme: v3
change note: Version 4.1.0

Pangender people
preferred label: Personas pangénero @es
comment: People who identify as multiple or all genders.
comment: Personas que se identifican como de múltiples o todos los géneros. @es
broader: Non-Euro-American gender and sexual identities
broader: Transgender people
broader: Gender minorities
related: Pangender identity
has top concept: Gender
replaces: pangenderPeople
issued: 2019-05-14
modified: 2025-02-23
type: Concept
in scheme: v3
change note: Version 4.1.0

Pansexual people
preferred label: Personas pansexuales @es
alternative label: Omnisexual
comment: Individuals who self-identify as pansexual, meaning that they are sexually attracted to people of all genders. Some but not all pansexual people also identify as "gender-blind" because gender is insignificant or irrelevant in determining their attraction.
comment: Personas que se identifican como pansexuales, lo que significa que se sienten atraídas sexualmente por personas de todos los géneros. Algunas personas pansexuales, pero no todas, también se identifican como "ciegas al género", porque el género les es insignificante o irrelevante para determinar su atracción. @es
broader: Bi+ people
broader: LGBTQ+ people
related: Bisexual people
related: Transsexual people
related: Allosexuality
related: Pansexuality
has top concept: LGBTQ+ people
replaces: pansexualPeople
issued: 2019-05-14
modified: 2025-02-23
type: Concept
in scheme: v3
change note: Version 4.1.0

Parental rights
preferred label: Derechos parentales @es
comment: The legal parent-child relationship that may be established by biological relations, at birth, or through adoption. These rights may include child custody and visitation, decision-making authority, and informational access.
comment: La relación legal padres-hijo que puede establecerse por relaciones biológicas, por nacimiento o por adopción. Estos derechos pueden incluir la custodia y el régimen de visitas, la toma de decisiones y el acceso a la información. @es
broader: Legal status
related: LGBTQ+ parenthood
related: LGBTQ+ personal and family law
has top concept: Legal status
replaces: parentalRights
issued: 2019-05-14
modified: 2025-02-23
type: Concept
in scheme: v3
change note: Version 4.1.0

LGBTQ+ parents
preferred label: Madres y padres LGBTQ+ @es
alternative label: Parents (LGBTQ)
alternative label: Padres LGBTQ+ @es
alternative label: Madres LGBTQ+ @es
comment: LGBTQ+ people who are parents.
comment: Personas LGBTQ+ que son padres y/o madres. @es
broader: LGBTQ+ families
broader: Parents
narrower: Bisexual parents
narrower: Gay parents
narrower: Lesbian parents
narrower: LGBTQ+ adoptive parents
narrower: LGBTQ+ biological parents
narrower: LGBTQ+ birth parents
narrower: LGBTQ+ co-parents
narrower: LGBTQ+ foster parents
narrower: LGBTQ+ single parents
narrower: Queer parents
narrower: Transgender parents
narrower: Aromantic parents
narrower: Asexual parents
narrower: Intersex parents
narrower: LGBTQ+ fathers
narrower: LGBTQ+ mothers
narrower: Non-binary parents
related: LGBTQ+ adoption
related: LGBTQ+ adoptive parenthood
related: Conception by LGBTQ+ people
related: LGBTQ+ family planning
related: LGBTQ+ foster families
related: LGBTQ+ parenthood
related: Bothies
related: LGBTQ+ family generations
has top concept: LGBTQ+ families
replaces: parentsLGBTQ
issued: 2019-05-14
modified: 2025-02-23
type: Concept
in scheme: v3
change note: Version 4.1.0

Parents of crossdressers
preferred label: Madres y padres de transformistas @es
alternative label: Madres de transformistas @es
alternative label: Padres de transformistas @es
comment: People who act as parents to one or more crossdresser. Only use to describe the parents of someone who self-identifies as a crossdresser.
comment: Personas que actúan como padres de uno o más transformistas. Utilícese únicamente para describir a los padres de alguien que se autoidentifican como transformistas. @es
broader: Parents
related: Crossdressers
has top concept: Family members
replaces: parentsOfCrossdressers
issued: 2019-05-14
modified: 2025-02-23
type: Concept
in scheme: v3
change note: Version 4.1.0

Parents of queer people
preferred label: Madres y padres de personas queer @es
alternative label: Queer people's parents
alternative label: Madres de personas queer @es
alternative label: Padres de personas queer @es
comment: People who act as parents to one or more queer person. For parents who are themselves queer, use the term "Queer parents."
comment: Personas que actúan como padres de una o más personas queer. Para los padres que son queer, utilice el término "madres y padres queer". @es
broader: Parents of LGBTQ+ people
related: Queer people
has top concept: Family members
replaces: parentsOfQueerPeople
issued: 2019-05-14
modified: 2025-02-23
type: Concept
in scheme: v3
change note: Version 4.1.0

Parents of transgender people
preferred label: Padres y madres de personas transgénero @es
alternative label: Transgender people's parents
alternative label: Padres de personas transgénero @es
alternative label: Madres de personas transgénero @es
comment: People who act as parents to one or more transgender person. For parents who are themselves transgender, use the term "Transgender parents."
comment: Personas que actúan como padres de una o más personas transgénero. Para los padres que son transgénero, utilice el término "madres y padres transgénero". @es
broader: Parents of LGBTQ+ people
related: Transgender people
has top concept: Family members
replaces: parentsOfTransgenderPeople
issued: 2019-05-14
modified: 2025-02-23
type: Concept
in scheme: v3
change note: Version 4.1.0

Partial androgen insensitivity syndrome
preferred label: Síndrome de insensibilidad andrógena parcial @es
alternative label: PAIS
alternative label: SIAP @es
alternative label: Síndrome de insensibilidad androgénica parcial @es
alternative label: Síndrome de insensibilidad parcial a los andrógeno @es
comment: People with partial androgen insensitivity (PAIS) have some response to testosterone, but not as much as is typical for people with XY chromosomes without androgen insensitivity. People with PAIS may be born with testes that are undescended or partially descended and with genital differences such as a vaginal opening that is shallower than typical, a phallus that may be perceived as a large clitoris or a small penis, and variations affecting their urethra. They might also be born with genitals that look more like a penis or like a vulva and vagina. In adolescence, people with PAIS may develop some features that are associated with a typical testosterone puberty and others that are associated with a typical estrogen puberty since their body responds to some of the testosterone that their gonads produce while the rest is converted into estrogen.
comment: Las personas con insensibilidad parcial a los andrógenos (PAIS, por sus siglas en inglés) tienen cierta respuesta a la testosterona, pero no tanta como es típica de las personas con cromosomas XY sin insensibilidad a los andrógenos. Las personas con PAIS pueden nacer con testículos no descendidos o parcialmente descendidos y con diferencias genitales, como una apertura vaginal menos profunda de lo normal, un falo que puede percibirse como un clítoris grande o un pene pequeño y variaciones que afectan la uretra. También pueden nacer con genitales que se parecen más a un pene o a una vulva y vagina. En la adolescencia, las personas con PAIS pueden desarrollar algunas características asociadas con una pubertad típica de testosterona y otras asociadas con una pubertad típica de estrógeno, ya que su cuerpo responde a parte de la testosterona que producen sus gónadas mientras el resto se convierte en estrógeno. @es
broader: Androgen insensitivity syndrome
broader: Intersex variations
has top concept: Sex (Body)
replaces: partialAndrogenInsensitivitySyndrome
issued: 2019-05-14
modified: 2025-02-23
type: Concept
in scheme: v3
change note: Version 4.1.0

Partner notification
preferred label: Notificación a la pareja @es
comment: The practice of notifying the sexual partners of a person who has been newly diagnosed with a sexually transmitted infection to inform them that they have been exposed to the infection.
comment: La práctica de notificar a las parejas sexuales de una persona a la que se le ha diagnosticado recientemente una infección de transmisión sexual para informarles que han estado expuestas a la infección. @es
related: Sexual relationships
related: STDs
related: Significant others
related: Partners
replaces: partnerNotification
issued: 2019-05-14
modified: 2025-02-23
type: Concept
in scheme: v3
change note: Version 4.1.0

Partner preference
preferred label: Preferencia de pareja @es
comment: An enduring pattern of desire for connection and relationships (romantic, sexual, or play) with people of specific identities or within specific relationship orientations (monogamy, polyamory, polygamy).
comment: Un patrón duradero de deseo de conexión y relaciones (románticas, sexuales o de juego) con personas de identidades específicas o dentro de orientaciones relacionales específicas (monogamia, poliamor, poligamia). @es
broader: Sexual preference
narrower: Monogamy
narrower: Polygamy
related: Sexual identity
related: Sexual relationships
related: Significant others
related: Monogamous people
related: Polygamous people
related: Partners
has top concept: Sexual preference
replaces: partnerPreference
issued: 2019-05-14
modified: 2025-02-23
type: Concept
in scheme: v3
change note: Version 4.1.0

Partner rights
preferred label: Derechos de pareja @es
comment: Legal, economic, social, and cultural rights afforded to individuals who are in long-term partnerships (e.g., marriage, domestic partnership, civil union) that can include shared health insurance, life insurance benefits, adoption rights, and the authority to make medical and financial decisions on behalf of one's partner.
comment: Derechos legales, económicos, sociales y culturales otorgados a personas que están en parejas a largo plazo (por ejemplo, matrimonio, pareja de hecho, unión civil) que pueden incluir seguro médico compartido, beneficios de seguro de vida, derechos de adopción y la autoridad para tomar decisiones médicas y financieras en nombre de la pareja. @es
broader: Legal status
related: Significant others
related: Partners
has top concept: Legal status
replaces: partnerRights
issued: 2019-05-14
modified: 2025-02-23
type: Concept
in scheme: v3
change note: Version 4.1.0

LGBTQ+ partners
preferred label: Parejas LGBTQ+ @es
preferred label: LGBTQ+ partners of alcoholics
alternative label: Partners (LGBTQ)
alternative label: LGBTQ partners of alcoholics
comment: Gender-neutral term for sexual, romantic, or play partners who are also LGBTQ+.
comment: Término de género neutro para parejas sexuales, románticas o de juego que también son LGBTQ+. @es
broader: LGBTQ+ families
broader: Partners
broader: LGBTQ+ people
narrower: LGBTQ+ ex-partners
narrower: Lesbian partners
narrower: Gay partners
narrower: Bisexual partners
narrower: Transgender partners
narrower: Queer partners
narrower: Asexual partners
narrower: Intersex partners
related: LGBTQ+ couples
related: LGBTQ+ domestic violence
related: LGBTQ+ lovers
related: Relationship satisfaction
related: Alcoholics
related: LGBTQ+ people in Adult Children of Alcoholics
has top concept: LGBTQ+ families
has top concept: LGBTQ+ people
replaces: partnersLGBTQ
replaces: LGBTQPartnersOfAlcoholics
issued: 2019-05-14
issued: 2020-06-03
modified: 2025-02-23
modified: 2022-08-15
type: Concept
in scheme: v3
change note: Version 4.1.0
is replaced by: homoit0001083

Partners of bisexual people
preferred label: Parejas de personas bisexuales @es
comment: People whose sexual, romantic, or play partner is bisexual.
comment: Personas cuya pareja sexual, romántica o de juego es bisexual. @es
broader: Partners of LGBTQ+ people
has top concept: Partners
replaces: partnersOfBisexualPeople
issued: 2019-05-14
modified: 2025-02-23
type: Concept
in scheme: v3
change note: Version 4.1.0

Partners of crossdressers
preferred label: Parejas de transformistas @es
comment: People whose sexual, romantic, or play partner is a crossdresser. Only use to describe individuals whose partners self-identify as crossdressers.
comment: Personas cuya pareja sexual, romántica o de juego es transformista. Utilícese únicamente para describir personas cuyas parejas se autoidentifiquen como transformistas. @es
broader: Partners
related: Crossdressers
has top concept: Partners
replaces: partnersOfCrossdressers
issued: 2019-05-14
modified: 2025-02-23
type: Concept
in scheme: v3
change note: Version 4.1.0

Partners of gay men
preferred label: Parejas de hombres gay @es
comment: People whose sexual, romantic, or play partner is a gay man.
comment: Personas cuya pareja sexual, romántica o de juego es un hombre gay. @es
broader: Partners of LGBTQ+ people
has top concept: Partners
replaces: partnersOfGayMen
issued: 2019-05-14
modified: 2025-02-23
type: Concept
in scheme: v3
change note: Version 4.1.0

Partners of lesbians
preferred label: Parejas de lesbianas @es
comment: People whose sexual, romantic, or play partner is a lesbian.
comment: Personas cuya pareja sexual, romántica o de juego es lesbiana. @es
broader: Partners of LGBTQ+ people
has top concept: Partners
replaces: partnersOfLesbians
issued: 2019-05-14
modified: 2025-02-23
type: Concept
in scheme: v3
change note: Version 4.1.0

Partners of queer people
preferred label: Parejas de personas queer @es
comment: People whose sexual, romantic, or play partner is queer.
comment: Personas cuya pareja sexual, romántica o de juego es queer. @es
broader: Partners of LGBTQ+ people
has top concept: Partners
replaces: partnersOfQueerPeople
issued: 2019-05-14
modified: 2025-02-23
type: Concept
in scheme: v3
change note: Version 4.1.0

Partners of transgender people
preferred label: Parejas de personas transgénero @es
comment: People whose sexual, romantic, or play partner is transgender.
comment: Personas cuya pareja sexual, romántica o de juego es transgénero. @es
broader: Partners of LGBTQ+ people
related: Transgender people
related: t4t
has top concept: Partners
replaces: partnersOfTransgenderPeople
issued: 2019-05-14
modified: 2025-02-23
type: Concept
in scheme: v3
change note: Version 4.1.0

Passing (Gender)
preferred label: Passing (género) @es
alternative label: Pasando @es
alternative label: Pasar desapercibido @es
comment: An individual's ability to "pass," or be accepted or regarded as a member of the gender they identify with. "Passing" has historically been used to describe an individual's ability to "pass" as a certain race or ethnicity, though the term was later appropriated by the LGBTQ+ community.
comment: La capacidad de una persona para "pasar", ser aceptada o considerada como miembro del género con el que se identifica. "Pasar" se ha utilizado históricamente para describir la capacidad de una persona de "pasar" como una determinada raza o etnia, aunque eventualmente la comunidad LGBTQ+ se apropió del término. @es
related: Stealth (Transgender)
related: Crossdressers
related: Gender
related: Public bathrooms
related: Reading (Gender)
related: Transgender people
related: Clocking (Gender)
related: Passing (Sexuality)
replaces: passingGender
issued: 2019-05-14
modified: 2025-02-23
type: Concept
in scheme: v3
change note: Version 4.1.0

Passive immune therapy
preferred label: Inmunoterapia pasiva @es
comment: A medical treatment in which a person receives laboratory-made antibodies to help fight an infection or disease.
comment: Un tratamiento médico en el que una persona recibe anticuerpos fabricados en laboratorio para ayudar a combatir una infección o enfermedad. @es
broader: Medication
related: HIV/AIDS
has top concept: Medical care
replaces: passiveImmuneTherapy
issued: 2019-05-14
modified: 2025-02-23
type: Concept
in scheme: v3
change note: Version 4.1.0

Passports
preferred label: Pasaportes @es
comment: Official documentation issued by a government that certifies the holder’s identity and citizenship, entitling them to travel under to and from other countries.
comment: Documentación oficial emitida por un gobierno que certifica la identidad y ciudadanía de la persona titular, dándole derecho a viajar hacia y desde otros países. @es
broader: Official documentation
narrower: Gender markers
related: Legal name change
related: LGBTQ+ immigration rights
related: Transitioning (Gender)
related: LGBTQ+ immigrants
related: LGBTQ+ asylum seekers
has top concept: Legal status
replaces: passports
issued: 2019-05-14
modified: 2025-03-20
type: Concept
in scheme: v3
change note: Version 4.1.0

Fatherhood
preferred label: Paternidad @es
alternative label: Paternity
comment: The experience of acting as a father, including the responsibilities involved in fathering and raising children.
comment: La experiencia de actuar como padre, incluidas las responsabilidades que implica la paternidad y la crianza de los hijos. @es
related: Biological parenthood
related: Fathers
related: LGBTQ+ adoptive parenthood
related: LGBTQ+ family planning
related: LGBTQ+ foster parenthood
related: LGBTQ+ parenthood
replaces: fatherhood
issued: 2019-05-14
modified: 2025-02-23
type: Concept
in scheme: v3
change note: Version 4.1.0

Pederasts
preferred label: Pederastas @es
comment: Adult men who have sexual and mentor/protégé relationships with adolescent boys. This term has historically been used to describe gay men. Only use in historical contexts.
comment: Hombres adultos que tienen relaciones sexuales y de mentoría/protección con adolescentes hombres. Este término se ha utilizado históricamente para describir a los hombres gay. Utilícese únicamente en contextos históricos. @es
broader: LGBTQ+ historical terms
broader: Sexual identity
broader: Sexual preference
related: Pederasty
has top concept: LGBTQ+ historical terms
replaces: pederasts
issued: 2019-05-14
modified: 2025-02-23
type: Concept
in scheme: v3
change note: Version 4.1.0

Pederasty
preferred label: Pederastia @es
comment: Term used to describe the practices of adult men who engage in sexual and mentor/protégé relationships with adolescent boys. This term has historically been used to describe the practices of gay men. Only use in historical contexts.
comment: Término utilizado para describir las prácticas de hombres adultos que mantienen relaciones sexuales y de mentor/pupilo con niños adolescentes. Este término se ha utilizado históricamente para describir las prácticas de los hombres gay. Utilícese únicamente en contextos históricos. @es
broader: LGBTQ+ historical terms
related: Pederasts
related: Sexual preference
related: Sodomy
has top concept: LGBTQ+ historical terms
replaces: pederasty
issued: 2019-05-14
modified: 2025-02-23
type: Concept
in scheme: v3
change note: Version 4.1.0

Peep shows
alternative label: Peepshows
comment: Live sex shows or pornographic movies viewed through a small opening or magnifying lens, typically from a coin-operated booth.
comment: Espectáculos de sexo en vivo o películas pornográficas vistas a través de una pequeña apertura o lente de aumento, generalmente desde una cabina que funciona con monedas. @es
broader: Sex industry
has top concept: Sex industry
replaces: peepShows
issued: 2019-05-14
modified: 2025-02-23
type: Concept
in scheme: v3
change note: Version 4.1.0

Penectomy
preferred label: Penectomía @es
comment: Surgical removal of the penis.
comment: Extirpación quirúrgica del pene. @es
broader: Castration
broader: Bottom surgery
has top concept: Castration
replaces: penectomy
issued: 2019-05-14
modified: 2025-02-23
type: Concept
in scheme: v3
change note: Version 4.1.0

Penile plethysmography
preferred label: Pletismografía peneana @es
alternative label: Penile response measurement
alternative label: Phallometry
comment: Assessments of penile tumescence in response to erotic stimuli in order to test an individual's sexual preference or excitement.
comment: Evaluaciones de la tumescencia del pene en respuesta a estímulos eróticos para probar la preferencia o excitación sexual de una persona. @es
related: Penis
replaces: penilePlethysmography
issued: 2019-05-14
modified: 2025-02-23
type: Concept
in scheme: v3
change note: Version 4.1.0

Penis
preferred label: Pene @es
alternative label: Cock
alternative label: Dick
alternative label: Dong
alternative label: Penises
alternative label: Phallus
alternative label: Prick
alternative label: Wang
alternative label: Pito @es
alternative label: Pico @es
alternative label: Polla @es
alternative label: Bicho @es
alternative label: Falo @es
alternative label: Pipi @es
comment: External genital organ.
comment: Órgano genital externo. @es
broader: Erogenous body parts
broader: Genitals
narrower: Neophallus
related: Fellatio
related: Cock rings
related: Dildos
related: Erections
related: Packing (Phallus)
related: Penile plethysmography
related: Sex assigned at birth
related: Strap-on sex
related: Tucking (Phallus)
related: Packers (Phallus)
related: Metoidioplasty
related: Scrotoplasty
related: Phalloplasty
has top concept: Erogenous body parts
replaces: penises
issued: 2019-05-14
modified: 2025-02-23
type: Concept
in scheme: v3
change note: Version 4.1.0

LGBTQ+ people in the military
preferred label: Personas LGBTQ+ en el ejército @es
alternative label: People in the military (LGBTQ)
alternative label: Personas LGBTQ+ en las fuerzas armadas @es
comment: LGBTQ+ people serving in state and national armed forces.
comment: Personas LGBTQ+ que sirven en las fuerzas armadas estatales y nacionales. @es
broader: Legal status
narrower: Bisexual people in the military
narrower: Gay men in the military
narrower: Lesbians in the military
narrower: Queer people in the military
narrower: Transgender people in the military
narrower: Asexual people in the military
narrower: Intersex people in the military
related: LGBTQ+ veterans
related: Two-Spirit people in the military
has top concept: Legal status
replaces: peopleInTheMilitaryLGBTQ
issued: 2019-05-14
modified: 2025-02-23
type: Concept
in scheme: v3
change note: Version 4.1.0

LGBTQ+ people of color
preferred label: Personas LGBTQ+ de color @es
preferred label: LGBTQ+ people of colour
comment: Primarily used in the United States, this term refers to LGBTQ+ people who are not white and who identify as people of color.
comment: Personas LGBTQ+ que no son blancas y que se autoidentifican como personas de color. @es
broader: LGBTQ+ people
narrower: Asian LGBTQ+ people
narrower: Bisexual people of color
narrower: Black LGBTQ+ people
narrower: Gay men of color
narrower: Lesbians of color
narrower: Biracial LGBTQ+ people
narrower: Indigenous LGBTQ+ people
narrower: Multiracial LGBTQ+ people
narrower: Queer people of color
narrower: Transgender people of color
narrower: Pacific Islander American LGBTQ+ people
narrower: Arab LGBTQ+ people
narrower: South Asian LGBTQ+ people
narrower: Assamese LGBTQ+ people
narrower: Awadhi LGBTQ+ people
narrower: Bhojpuri LGBTQ+ people
narrower: Bengali LGBTQ+ people
narrower: Bhil LGBTQ+ people
narrower: Chakma LGBTQ+ people
narrower: Kho LGBTQ+ people
narrower: Maldivian LGBTQ+ people
narrower: Dogra LGBTQ+ people
narrower: Garhwali LGBTQ+ people
narrower: Gujarati LGBTQ+ people
narrower: Haryanvi LGBTQ+ people
narrower: Kalash LGBTQ+ people
narrower: Kashmiri LGBTQ+ people
narrower: Konkan LGBTQ+ people
narrower: Kumaoni LGBTQ+ people
narrower: Kutchi LGBTQ+ people
narrower: Intersex people of color
narrower: Asexual people of color
narrower: Non-binary people of color
related: BIPOC
related: People of color in fandom
related: QTPOC
related: Sex workers of color
has top concept: LGBTQ+ people
replaces: peopleOfColourLGBTQ
issued: 2019-05-14
modified: 2025-02-23
type: Concept
in scheme: v3
change note: Version 4.1.0

LGBTQ+ performance art
preferred label: Arte escénico @es
alternative label: Performance art (LGBTQ)
alternative label: LGBTQ+ live art
alternative label: Live art (LGBTQ)
comment: Art created through actions performed by the artist or other participants, typically for a live audience. Use to refer to performance art created by LGBTQ+ artists and/or engaging with LGBTQ+ issues.
comment: Arte creado a través de acciones realizadas por el artista u otros participantes, generalmente para una audiencia en vivo. @es
replaces: performanceArt
issued: 2019-05-14
modified: 2025-03-20
type: Concept
in scheme: v3
change note: Version 4.1.0

Persecution of bisexual people
preferred label: Persecución de personas bisexuales @es
comment: Systematic mistreatment of bisexual people on the basis of their sexual identity.
comment: Maltrato sistemático a personas bisexuales por su identidad sexual. @es
broader: LGBTQ+ persecutions
related: Bisexual people
has top concept: LGBTQ+ persecutions
replaces: persecutionOfBisexualPeople
issued: 2019-05-14
modified: 2026-02-27
type: Concept
in scheme: v3
change note: Version 4.1.0

Persecution of gay men
preferred label: Persecución de hombres gay @es
comment: Systematic mistreatment of gay men on the basis of their sexual identity.
comment: Maltrato sistemático a hombres gay por su identidad sexual. @es
broader: LGBTQ+ persecutions
related: Gay men
has top concept: LGBTQ+ persecutions
replaces: persecutionOfGayMen
issued: 2019-05-14
modified: 2025-02-23
type: Concept
in scheme: v3
change note: Version 4.1.0

Persecution of lesbians
preferred label: Persecución de lesbianas @es
comment: Systematic mistreatment of lesbians on the basis of their sexual identity.
comment: Maltrato sistemático a lesbianas por su identidad sexual. @es
broader: LGBTQ+ persecutions
related: Lesbians
has top concept: LGBTQ+ persecutions
replaces: persecutionOfLesbians
issued: 2019-05-14
modified: 2025-02-23
type: Concept
in scheme: v3
change note: Version 4.1.0

Persecution of queer people
preferred label: Persecución de personas queer @es
comment: Systematic mistreatment of queer people on the basis of their gender and/or sexual identities.
comment: Maltrato sistemático a personas queer por su género y/o identidad sexual. @es
broader: LGBTQ+ persecutions
related: Queer people
has top concept: LGBTQ+ persecutions
replaces: persecutionOfQueerPeople
issued: 2019-05-14
modified: 2025-02-23
type: Concept
in scheme: v3
change note: Version 4.1.0

Persecution of transgender people
preferred label: Persecución de personas transgénero @es
comment: Systematic mistreatment of transgender people on the basis of their gender identity.
comment: Maltrato sistemático a personas transgénero por su identidad de género. @es
broader: LGBTQ+ persecutions
related: Transgender people
has top concept: LGBTQ+ persecutions
replaces: persecutionOfTransgenderPeople
issued: 2019-05-14
modified: 2025-02-23
type: Concept
in scheme: v3
change note: Version 4.1.0

LGBTQ+ persecutions
preferred label: Persecuciones LGBTQ+ @es
alternative label: Persecutions (LGBTQ)
alternative label: Persecuciones (LGBTQ) @es
comment: Systematic mistreatment of LGBTQ+ people on the basis of their gender or sexual identities.
comment: Maltrato sistemático a personas LGBTQ+ por su género o identidad sexual. @es
narrower: LGBTQ+ defamation campaigns
narrower: Persecution of bisexual people
narrower: Persecution of gay men
narrower: Persecution of lesbians
narrower: Persecution of queer people
narrower: Persecution of transgender people
narrower: Persecution of intersex people
narrower: Persecution of asexual people
related: Anti-LGBTQ+ violence
related: Arrests of LGBTQ+ people
related: LGBTQ+ discrimination
related: Gendercide
related: Lavender Scare
related: LGBTQ+ refugees
related: Undocumented LGBTQ+ residents
related: Slurs
replaces: persecutionsLGBTQ
issued: 2019-05-14
modified: 2025-02-23
type: Concept
in scheme: v3
change note: Version 4.1.0

Phallic sex
preferred label: Sexo fálico @es
comment: Sexual stimulation or sexual practices involving penises or phallic objects (e.g., dildos).
comment: Estimulación sexual o prácticas sexuales que involucran penes u objetos fálicos (por ejemplo, consoladores). @es
broader: Sex (Act)
broader: Sexual practices
narrower: Fellatio
narrower: Fucking
narrower: Wacking off
narrower: Wanking
has top concept: Sex (Act)
replaces: phallicSex
issued: 2019-05-14
modified: 2025-02-23
type: Concept
in scheme: v3
change note: Version 4.1.0

Phone sex
preferred label: Sexo por teléfono @es
alternative label: Telephone sex
alternative label: Sexo telefónico @es
comment: Sexual encounters that take place over the phone, whether in a phone call or on a video call using a smartphone.
comment: Encuentros sexuales que se desarrollan a través del teléfono, ya sea en una llamada telefónica o en una videollamada mediante un smartphone. @es
broader: Sex (Act)
broader: Sexual practices
has top concept: Sex (Act)
replaces: phoneSex
issued: 2019-05-14
modified: 2025-02-23
type: Concept
in scheme: v3
change note: Version 4.1.0

Phone sex workers
preferred label: Trabajadores sexuales por telefono @es
alternative label: Phone sex operators
alternative label: Telephone sex workers
alternative label: Telephone sex operators
alternative label: Operadores de sexo por teléfono @es
comment: People who perform real-time sex work via phone calls, text messaging, or online voice calls. Use "Cam models" for individuals who perform real-time sex work via streaming video or video calls.
broader: Sex workers
related: Phone sex work
has top concept: Sex workers
replaces: phoneSexWorkers
issued: 2019-05-14
modified: 2025-02-23
type: Concept
in scheme: v3
change note: Version 4.1.0

Physical affection
preferred label: Afecto físico @es
alternative label: Cariño físico @es
comment: Touch between two or more people intended to arouse or convey feelings of closeness; can be used to express sexual or non-sexual intimacy and includes actions such as kissing, cuddling, embracing, and holding hands.
comment: Tacto entre dos o más personas destinado a despertar o transmitir sentimientos de cercanía; se puede utilizar para expresar intimidad sexual o no sexual e incluye acciones como besar, abrazar, sostener y tomar de la mano. @es
narrower: Kissing
related: Eroticism
related: Massage
related: Homoeroticism
replaces: physicalAffection
issued: 2019-05-14
modified: 2025-02-23
type: Concept
in scheme: v3
change note: Version 4.1.0

Physical health care for LGBTQ+ people
preferred label: Asistencia médica física para personas LGBTQ+ @es
alternative label: Physical health care for LGBTQ people
alternative label: Asistencia médica física para personas LGBTQ @es
alternative label: Cuidado de la salud física para personas LGBTQ @es
alternative label: Atención médica física para personas LGBTQ @es
comment: Organized measures taken for the maintenance, treatment, or improvement of physical health or conditions of the body; use in reference to physical health care addressing the particular needs of LGBTQ+ individuals or communities.
comment: Medidas organizadas tomadas para el mantenimiento, el tratamiento o la mejora de la salud física o las condiciones del cuerpo; utilícese en referencia a la atención de la salud física que aborda las necesidades particulares de personas o comunidades LGBTQ+. @es
broader: Health care for LGBTQ+ people
has top concept: Health care for LGBTQ+ people
replaces: physicalHealthCareForLGBTQPeople
issued: 2019-05-14
modified: 2025-02-23
type: Concept
in scheme: v3
change note: Version 4.1.0

Piercings
alternative label: Perforación @es
alternative label: Perforaciones @es
comment: Small holes or openings made in parts of the body to insert jewelry or implants, whether for aesthetic purposes, spiritual or religious reasons, or sexual pleasure.
comment: Pequeños agujeros o aperturas realizadas en partes del cuerpo para insertar joyas o implantes, ya sea con fines estéticos, espirituales o religiosos, o por placer sexual. @es
broader: Body adornment
broader: Body modification
narrower: Piercing play
has top concept: Body adornment
replaces: piercings
issued: 2019-05-14
modified: 2025-02-23
type: Concept
in scheme: v3
change note: Version 4.1.0

Pinching (Erotic)
preferred label: Pellizcar @es
comment: Form of manual stimulation involving gripping, pulling, or putting tension on parts of one’s body or another person's body for sexual stimulation, arousal, or pleasure.
comment: Forma de estimulación manual que implica agarrar, jalar, o poner tensión en partes del cuerpo de una misma persona o de otra persona para estimulación, excitación o placer sexual. @es
replaces: pinching
issued: 2019-05-14
modified: 2025-03-20
type: Concept
in scheme: v3
change note: Version 4.1.0

Pink triangles
preferred label: Triángulos rosas @es
alternative label: Triángulos rosados @es
comment: International symbol of gay pride and the gay rights movement that symbolizes the reclamation of the pink triangles used in Nazi Germany to identify gay men (and, later, bisexual men and transgender women) who were sent to concentration camps.
comment: Símbolo internacional del orgullo gay y del movimiento por los derechos gay que simboliza la reclamación de los triángulos rosas utilizados en la Alemania nazi para identificar a los hombres gay (y, eventualmente, a los hombres bisexuales y las mujeres transgénero) que fueron enviados a campos de concentración. @es
broader: LGBTQ+ symbols
has top concept: LGBTQ+ symbols
replaces: pinkTriangles
issued: 2019-05-14
modified: 2025-02-23
type: Concept
in scheme: v3
change note: Version 4.1.0

Pinkwashing
alternative label: Lavado rosa @es
alternative label: Lavado de imagen rosa @es
comment: A variety of marketing and political strategies aimed at promoting products, countries, people, or entities to LGBTQ+ people; using LGBTQ+-related symbols in order to be perceived as progressive, modern, and tolerant; and/or utilizing concern for LGBTQ+ people and rights to justify or deviate attention from settler-colonialism, genocide, invasion, and intervention in other countries.
comment: Una variedad de estrategias políticas y de marketing destinada a promover productos, países, personas o entidades entre personas LGBTQ+ o utilizar símbolos LGBTQ+ para ser percibidos como progresistas, modernos y tolerantes. @es
related: Homonationalism
related: LGBTQ+ friendliness
related: LGBTQ+ marketing
replaces: pinkwashing
issued: 2019-05-14
modified: 2025-02-23
type: Concept
in scheme: v3
change note: Version 4.1.0

LGBTQ+ poetry
preferred label: Poesía LGBTQ+ @es
alternative label: Poetry (LGBTQ)
alternative label: Poesía (LGBTQ) @es
comment: Poetry about LGBTQ+ people or relating to LGBTQ+ issues.
comment: Poesía sobre personas LGBTQ+ o relacionada con temas LGBTQ+. @es
broader: LGBTQ+ literature
narrower: Bisexual poetry
narrower: Gay poetry
narrower: Lesbian poetry
narrower: Queer poetry
narrower: Transgender poetry
narrower: Aromantic poetry
narrower: Intersex poetry
narrower: Asexual poetry
narrower: Demisexual poetry
narrower: Megasexual poetry
narrower: Greyromantic poetry
narrower: Non-binary poetry
related: LGBTQ+ authors
related: Māhū poetry
related: Two-Spirit poetry
has top concept: Subcultures
replaces: poetryLGBTQ
issued: 2019-05-14
modified: 2025-02-23
type: Concept
in scheme: v3
change note: Version 4.1.0

Police
preferred label: Policía @es
alternative label: Cops
comment: A civil force empowered by the state to enforce the law and maintain public order.
comment: Fuerza civil facultada por el Estado para hacer cumplir la ley y mantener el orden público. @es
related: Police entrapment
related: Police raids
related: Defund the police movement
related: Police abolitionist movement
related: White supremacy in policing
replaces: police
issued: 2019-05-14
modified: 2026-02-27
type: Concept
in scheme: v3
change note: Version 4.1.0

Police entrapment
preferred label: Aprisionamiento policial @es
alternative label: Agentes encubiertos @es
comment: A practice in which law enforcement agents or agents of the state coerce an individual to commit a "crime" they would have otherwise been unlikely or unwilling to commit. Legal definitions of entrapment vary widely depending on the jurisdiction, but the term is often used colloquially to refer to police acting dishonestly or in bad faith, as well as policing focused on anticipating and inducing crime, rather than responding to reports of crime.
comment: Práctica en la que los agentes de las fuerzas de seguridad o los agentes del Estado fuerzan a una persona a cometer un "delito" que, de otro modo, probablemente no cometería o no estaría dispuesta a cometer. Las definiciones jurídicas de la trampa varían mucho en función de la jurisdicción, pero el término se utiliza a menudo coloquialmente para referirse a la policía que actúa de forma deshonesta o de mala fe, así como a la actuación policial centrada en anticipar e inducir el delito, en lugar de responder a las denuncias de delitos. @es
broader: Police harassment
narrower: Police entrapment of LGBTQ+ people
related: Arrests of LGBTQ+ people
related: Police
has top concept: Harassment
replaces: policeEntrapment
issued: 2019-05-14
modified: 2025-02-23
type: Concept
in scheme: v3
change note: Version 4.1.0

Police harassment
preferred label: Acoso policial @es
alternative label: Harrassment by police
alternative label: Misconduct by police
alternative label: Mistreatment by police
alternative label: Police misconduct
alternative label: Police mistreatment
comment: Any of various forms of inappropriate conduct, illegal actions, or abuses of power undertaken by law enforcement agents or agents of the state against members of the public. This includes but is not limited to racial, ethnic, and other forms of profiling; unwarranted surveillance, searches, and seizure; selective enforcement; excessive use of force; sexual misconduct; intimidation and witness tampering; falsification of evidence; coerced confessions; false arrests and imprisonment; and bribing or lobbying.
comment: Cualquiera de las diversas formas de conducta inapropiada, acciones ilegales o abusos de poder cometidos por agentes de las fuerzas de seguridad o agentes del Estado contra miembros del público. Esto incluye, entre otros, la elaboración de perfiles raciales, étnicos y de otro tipo; la vigilancia, el registro y la incautación injustificados; la aplicación selectiva de la ley; el uso excesivo de la fuerza; la conducta sexual indebida; la intimidación y la manipulación de testigos; la falsificación de pruebas; las confesiones forzadas; las detenciones y encarcelamientos falsos; y el soborno o el cabildeo. @es
broader: Harassment
narrower: Police entrapment
narrower: Police raids
narrower: Police harassment of LGBTQ+ people
has top concept: Harassment
replaces: policeHarassment
issued: 2019-05-14
modified: 2025-02-23
type: Concept
in scheme: v3
change note: Version 4.1.0

Police raids
preferred label: Redadas policiales @es
alternative label: Dawn raids
alternative label: No-knock raids
comment: Unexpected and unannounced entry into and searches of residences or establishments by law enforcement officers with the aim of using surprise to seize evidence or arrest suspects. Police raids may be undertaken legally using a search warrant or through exigent circumstances, such as probable cause, though the latter is highly subjective and civilians often have little resources to appeal illegal raids.
comment: Entradas y registros inesperados y sin previo aviso en residencias o establecimientos por parte de agentes de las fuerzas policiales con el objetivo de utilizar la sorpresa para incautar pruebas o detener a sospechosos. Las redadas policiales pueden realizarse legalmente mediante una orden de registro o por circunstancias apremiantes, como la causa probable, aunque esta última es muy subjetiva y los civiles suelen tener pocos recursos para apelar a las redadas ilegales. @es
broader: Police harassment
narrower: Police raids on LGBTQ+-related establishments
related: Police
has top concept: Harassment
replaces: policeRaids
issued: 2019-05-14
modified: 2025-02-23
type: Concept
in scheme: v3
change note: Version 4.1.0

Polyamory
preferred label: Poliamor @es
comment: Practice of engaging in romantic, sexual, or play relationships with more than one person simultaneously, with the knowledge and consent of all parties involved.
comment: Práctica de entablar relaciones románticas, sexuales o de juego con más de una persona simultáneamente, con el conocimiento y consentimiento de todas las partes involucradas. @es
broader: Consensual non-monogamy
narrower: Metamours
narrower: Hierarchical non-monogamy
narrower: Paramours
related: Consent
related: Group sex
related: Polygamy
related: Sexual identity
related: Polysexuality
related: Anchor partners
related: Compersion
related: Nesting partners
related: NRE (New Relationship Energy)
related: Polyamorous people
related: Polyfidelity
related: Polygamous people
has top concept: Relationship orientation
replaces: polyamory
issued: 2019-05-14
modified: 2026-02-24
type: Concept
in scheme: v3
change note: Version 4.1.0

Polygamy
preferred label: Poligamia @es
comment: The practice of engaging in romantic, sexual, or play relationships where the dominant partner has multiple spouses, though these marriages are not always recognized by law or within society.
comment: La práctica de entablar relaciones románticas, sexuales o de juego en las que la pareja dominante tiene varios cónyuges, aunque estos matrimonios no siempre son reconocidos por la ley o dentro de la sociedad. @es
broader: Partner preference
broader: Sexual relationships
related: Consent
related: Group sex
related: Polyamory
related: Sexual identity
related: Polygamous people
has top concept: Sexual preference
replaces: polygamy
issued: 2019-05-14
modified: 2025-02-23
type: Concept
in scheme: v3
change note: Version 4.1.0

Poppers
alternative label: Tape head cleaner
comment: A slang term commonly used in LGBTQ+ subcultures to describe alkyl nitrites, a class of drug that produces a high when inhaled. Poppers are often associated with gay nightlife because they can be used to facilitate anal sex by relaxining the anal muscles.
comment: Un término de jerga comúnmente utilizado en subculturas LGBTQ+ para describir los nitritos de alquilo, una clase de droga que produce un efecto estimulador cuando se inhala. Los poppers a menudo se asocian con la vida nocturna gay porque pueden utilizarse para facilitar el sexo anal al relajar los músculos anales. @es
broader: LGBTQ+ slang
related: Cocaine
has top concept: LGBTQ+ slang
replaces: poppers
issued: 2019-05-14
modified: 2025-08-14
type: Concept
in scheme: v3
change note: Version 4.1.0

Porn industry
preferred label: Industria porno @es
alternative label: Porno industry
alternative label: Pornography industry
alternative label: Industria pornográfica @es
comment: Businesses that sell pornography, or materials intended for sexual arousal, including images, videos, literature, etc.
comment: Negocios que venden pornografía o materiales destinados a la excitación sexual, incluyendo imágenes, vídeos, literatura, etc. @es
broader: Sex industry
related: LGBTQ+ porn films
related: LGBTQ+ porn magazines
has top concept: Sex industry
replaces: pornIndustry
issued: 2019-05-14
modified: 2025-02-23
type: Concept
in scheme: v3
change note: Version 4.1.0

Porn stars
preferred label: Estrellas porno @es
alternative label: Pornographic actors
alternative label: Pornstars
alternative label: Porn actresses
alternative label: Adult entertainers
alternative label: Porn actors
alternative label: Pornographic stars
alternative label: Pornographic actresses
alternative label: Adult actors
alternative label: Actores pornográficos @es
alternative label: Actores porno @es
alternative label: Actrices porno @es
alternative label: Actrices pornográficas @es
alternative label: Estrellas de porno @es
comment: Actors in erotic or sexually explicit films.
comment: Actores y actrices en películas eróticas o sexualmente explícitas. @es
broader: Sex workers
narrower: LGBTQ+ porn stars
related: Gay for pay
related: Pornography
has top concept: Sex workers
replaces: pornStars
issued: 2019-05-14
modified: 2025-02-23
type: Concept
in scheme: v3
change note: Version 4.1.0

Pornography
preferred label: Pornografía @es
comment: Printed or visual materials that explicitly depict sexual acts.
comment: La representación de actos sexuales para que otras personas los vean. @es
broader: Sex industry
narrower: Hentai
narrower: LGBTQ+ pornography
related: Erotica
related: Porn stars
related: Sexting
related: Bukkake
has top concept: Sex industry
replaces: pornography
issued: 2019-05-14
modified: 2025-03-20
type: Concept
in scheme: v3
change note: Version 4.1.0

Post-operative
preferred label: Post-quirúrgico @es
alternative label: Post-operatorio @es
alternative label: Post quirúrgico @es
comment: Individuals who have recently undergone a surgical operation; commonly used to describe trans people who have undergone gender affirming surgery.
comment: Personas que recientemente hayan atravesado una operación quirúrgica; se utiliza comúnmente para describir a personas trans que han atravesado una cirugía de afirmación de género. @es
broader: Transitioning status
related: Gender-affirming surgery
related: Transgender people
related: Transsexual people
has top concept: Transitioning (Gender)
replaces: postOperative
issued: 2019-05-14
modified: 2025-02-23
type: Concept
in scheme: v3
change note: Version 4.1.0

PrEP
alternative label: Pre-exposure prophylaxis
alternative label: Profilaxis preexposición @es
comment: Medication taken regularly to reduce the risk of contracting HIV.
comment: Medicamentos tomados para prevenir la contracción del VIH. @es
replaces: prep
issued: 2019-05-14
modified: 2025-03-20
type: Concept
in scheme: v3
change note: Version 4.1.0

Pre-operative
preferred label: Pre-quirúrgico @es
alternative label: Pre-operatorio @es
alternative label: Pre quirúrgico @es
comment: The medical status of individuals who plan to undertake a surgical procedure but have not yet done so. Commonly used to describe trans people who have not yet undergone gender affirming surgery but plan to do so.
comment: El estado médico de las personas que planean someterse a un procedimiento quirúrgico pero aún no lo han hecho. Se utiliza comúnmente para describir a personas trans que aún no se han sometido a una cirugía de afirmación de género pero que planean hacerlo. @es
broader: Transitioning status
related: Gender-affirming surgery
related: Transgender people
related: Transsexual people
has top concept: Transitioning (Gender)
replaces: preOperative
issued: 2019-05-14
modified: 2025-02-23
type: Concept
in scheme: v3
change note: Version 4.1.0

LGBTQ+ press
preferred label: Prensa LGBTQ+ @es
alternative label: Press (LGBTQ)
alternative label: Prensa (LGBTQ) @es
comment: Newspapers, magazines, or other publishing outlets aimed at LGBTQ+ audiences and/or operated by LGBTQ+ people.
comment: Periódicos, revistas u otros medios editoriales dirigidos a audiencias LGBTQ+ y/o operados por personas LGBTQ+. @es
narrower: Bisexual press
narrower: Gay press
narrower: Lesbian press
narrower: LGBTQ+ magazines
narrower: LGBTQ+ porn magazines
narrower: LGBTQ+ zines
narrower: LGBTQ+ newsletters
narrower: LGBTQ+ newspapers
narrower: Queer press
narrower: Transgender press
narrower: Asexual press
narrower: Intersex press
narrower: LGBTQ+ journalism
related: AIDS periodicals
related: LGBTQ+ bookshops
related: LGBTQ+ books
related: LGBTQ+ literature
related: Two-Spirit press
replaces: pressLGBTQ
issued: 2019-05-14
modified: 2025-04-29
type: Concept
in scheme: v3
change note: Version 4.1.0

Social privilege
preferred label: Privilegio social @es
comment: Special rights or immunities granted to specific people or groups that are used to falsely homogenize or discriminate against other people or groups.
comment: Derechos o inmunidades especiales otorgadas a personas o grupos específicos que se utilizan para homogeneizar o discriminar falsamente a otras personas o grupos. @es
related: Anti-feminism
related: White LGBTQ+ people
related: Consent
related: Dutch boys
related: Fag hags
related: Fag stags
related: Goldilocks (Gay culture)
related: Heterosexual feminism
related: Intersectionality
related: Intimate partner violence
related: LGBTQ+ people of shared ethnic or national identities
related: LGBTQ+ dominants
related: Misogyny
related: LGBTQ+ mistresses (BDSM culture)
related: Radical feminism
related: Tops (Sex)
related: Toxic masculinity
related: White feminism
replaces: socialPrivilege
issued: 2019-05-14
modified: 2025-02-23
type: Concept
in scheme: v3
change note: Version 4.1.0

Progestin induced virilization
comment: People born with progestin-induced virilization have XX chromosomes and may have visible genital variations at birth such as a larger-than-typical clitoris, sometimes also with fused or partially fused labia. They usually have a typical uterus, ovaries, and fallopian tubes, though their vagina may or may not have differences. This variation develops in utero as a result of the individual's parent taking progestin medication while pregnant. Being exposed to these additional hormones before birth can change how someone’s genitals develop, but it generally will not change how their own body will produce or respond to hormones later on. This means that someone born with progestin-induced virilization will usually develop features associated with a typical estrogen puberty.
broader: Intersex variations
has top concept: Sex (Body)
replaces: progestinInducedVirilization
issued: 2019-05-14
modified: 2025-02-23
type: Concept
in scheme: v3
change note: Version 4.1.0

Pronouns
preferred label: Pronombres @es
alternative label: Personal pronouns
alternative label: Pronombres personales @es
comment: Words used in place of a noun. Typically used in the context of "personal pronouns," or pronouns used to describe people (e.g., she, he, they, ze).
comment: Palabras utilizadas en lugar de un sustantivo. Normalmente se utiliza en el contexto de "pronombres personales" o pronombres utilizados para describir personas (por ejemplo, ella, él, elle, ellxs). @es
narrower: Ae/Aer/Aerself (Pronouns)
narrower: Co/Co/Coself (Pronouns)
narrower: Cy/Cyb/Cyberself (Pronouns)
narrower: E/Em/Emself (Pronouns)
narrower: Ey/Em/Eirself (Pronouns)
narrower: Fe/Fem/Femself (Pronouns)
narrower: Fae/Faer/Faerself (Pronouns)
narrower: Fey/Fem/Femself (Pronouns)
narrower: He/Him/Himself (Pronouns)
narrower: Hu/Hum/Humself (Pronouns)
narrower: It/It/Itself (Pronouns)
narrower: Jee/Jem/Jemself (Pronouns)
narrower: Kit/Kit/Kitself (Pronouns)
narrower: Ne/Nir/Nemself (Pronouns)
narrower: Ne/Nem/Nis (Pronouns)
narrower: Peh/Pehm/Pehself (Pronouns)
narrower: Per/Per/Perself (Pronouns)
narrower: Sie/Hir/Hirself (Pronouns)
narrower: Se/Ser/Serself (Pronouns)
narrower: She/Her/Herself (Pronouns)
narrower: Shi/Hir/Hirself (Pronouns)
narrower: Si/Hyr/Hyrself (Pronouns)
narrower: They/Them/Themselves (Pronouns)
narrower: They/Them/Themself (Pronouns)
narrower: Thon/Thon/Thonself (Pronouns)
narrower: Ve/Ver/Verself (Pronouns)
narrower: Ve/Vem/Verself (Pronouns)
narrower: Voi/Void/Voidself (Pronouns)
narrower: Vi/Ver/Virself (Pronouns)
narrower: Vi/Vim/Virself (Pronouns)
narrower: Xie/Xer/Xerself (Pronouns)
narrower: Xe/Xyr/Xemself (Pronouns)
narrower: Xey/Xem/Xyr (Pronouns)
narrower: Xey/Xem/Xeir (Pronouns)
narrower: Yo/Yo/Yosself (Pronouns)
narrower: Ze/Zir/Zirself (Pronouns)
narrower: Ze/Hir/Hirself (Pronouns)
narrower: Ze/Zem/Zirself (Pronouns)
narrower: Ze/Mer/Zemself (Pronouns)
narrower: Zee/Zed/Zedself (Pronouns)
narrower: Zie/Zir/Zirself (Pronouns)
narrower: Zie/Zem/Zirself (Pronouns)
narrower: Zie/Hir/Hirself (Pronouns)
narrower: Zme/Zmyr/Zmyrself (Pronouns)
related: Misgendering
related: Neopronouns
related: Gender-neutral language
replaces: pronouns
issued: 2019-05-14
modified: 2025-02-23
type: Concept
in scheme: v3
change note: Version 4.1.0

Prostitution
broader: Sex work
broader: Sexual practices
narrower: Transgender prostitution
related: Sex workers' clients
has top concept: Sex industry
is replaced by: homoit0001276
replaces: prostitution
issued: 2019-05-14
modified: 2025-01-28
type: Concept
in scheme: v3
change note: Version 4.1.0

LGBTQ+ Protestants
preferred label: Protestantes LGBTQ+ @es
alternative label: Protestants (LGBTQ)
alternative label: Protestantes (LGBTQ) @es
comment: LGBTQ+ people who are members of the Protestant Church.
comment: Personas LGBTQ+ que son miembros de la Iglesia protestante. @es
broader: LGBTQ+ Christians
narrower: LGBTQ+ Anglicans
narrower: LGBTQ+ Baptists
narrower: Bisexual Protestants
narrower: LGBTQ+ Calvinists
narrower: Gay Protestants
narrower: Lesbian Protestants
narrower: LGBTQ+ Quakers
narrower: Queer Protestants
narrower: Transgender Protestants
narrower: Intersex Protestants
narrower: Asexual Protestants
has top concept: LGBTQ+ African religions
replaces: protestantsLGBTQ
issued: 2019-05-14
modified: 2025-02-23
type: Concept
in scheme: v3
change note: Version 4.1.0

Puberty blockers
preferred label: Bloqueadores de la pubertad @es
comment: Group of medications used to inhibit puberty.
comment: Grupo de medicamentos utilizados para inhibir la pubertad. @es
broader: Hormone blockers
broader: Medication
related: Transgender children
has top concept: Medical care
replaces: pubertyBlockers
issued: 2019-05-14
modified: 2025-02-23
type: Concept
in scheme: v3
change note: Version 4.1.0

Bathroom bans
alternative label: Changing room bans
alternative label: Locker room bans
alternative label: Restroom bans
comment: Laws or policies instituted to prevent trans and non-binary individuals from using public bathrooms and facilities, such as locker rooms, shower rooms, changing rooms, and other sex-segregated spaces, on the basis of their gender identity.
broader: Anti-transgender legislation
related: Changing rooms
related: Locker rooms
related: Public bathrooms
related: Public facilities
related: Public showers
has top concept: Law
replaces: publicBathroomBills
issued: 2019-05-14
modified: 2025-02-23
type: Concept
in scheme: v3
change note: Version 4.1.0

Public bathrooms
preferred label: Baños públicos @es
alternative label: Public restrooms
alternative label: Toilets
alternative label: Baños|| @es
comment: Rooms or small buildings with one or more toilets (or urinals) available for use by the general public or by customers or employees of a business.
comment: Habitaciones o pequeños edificios con uno o más inodoros (o urinarios) disponibles para el uso del público en general o de clientes o empleados de un negocio. @es
broader: Public facilities
narrower: Glory holes
related: Anti-transgender discrimination
related: Cottages (Gay culture)
related: Passing (Gender)
related: Bathroom bans
related: Tearooms (Gay culture)
has top concept: Public facilities
replaces: publicBathrooms
issued: 2019-05-14
modified: 2025-02-23
type: Concept
in scheme: v3
change note: Version 4.1.0

Public facilities
preferred label: Instalaciones públicas @es
comment: Buildings, recreational areas, and other types of properties that are owned and maintained by state or local government and are thus available for use by the public.
comment: Edificios, áreas recreativas y otros tipos de propiedades que pertenecen a y son mantenidas por el gobierno estatal o local y, por lo tanto, están disponibles para el uso del público. @es
narrower: Changing rooms
narrower: Locker rooms
narrower: Public bathrooms
narrower: Public showers
related: Anti-discrimination law
related: Anti-transgender discrimination
related: Bathroom bans
replaces: publicFacilities
issued: 2019-05-14
modified: 2025-02-23
type: Concept
in scheme: v3
change note: Version 4.1.0

Public sex
preferred label: Sexo en público @es
comment: Sex in public places such as beaches, parks, cottages, etc.
comment: Sexo en lugares públicos, como playas, parques, cabañas, etc. @es
broader: Sexual practices
related: Cottaging (Gay culture)
related: Cruising (LGBTQ+ culture)
related: Exhibitionism
related: Gay saunas
related: LGBTQ+ meeting places
related: Sex locations
related: Voyeurism
related: Sexuality
related: Tearoom sex
has top concept: Sexual practices
replaces: publicSex
issued: 2019-05-14
modified: 2025-02-23
type: Concept
in scheme: v3
change note: Version 4.1.0

Public showers
preferred label: Duchas públicas @es
comment: Public or commercial facilities equipped with showers or places to bathe.
comment: Instalaciones públicas o comerciales equipadas con duchas o lugares para bañarse. @es
broader: Public facilities
related: Bathroom bans
has top concept: Public facilities
replaces: publicShowers
issued: 2019-05-14
modified: 2025-02-23
type: Concept
in scheme: v3
change note: Version 4.1.0

LGBTQ+ publishers
preferred label: Editoriales LGBTQ+ @es
alternative label: Publishers (LGBTQ)
alternative label: Editoriales (LGBTQ)|| @es
comment: Publishers that publish materials for LGBTQ+ communities or materials addressing LGBTQ+ issues.
comment: Empresas y organizaciones que publican materiales para comunidades LGBTQ+ o que abordan asuntos LGBTQ+. @es
narrower: Bisexual publishers
narrower: Gay publishers
narrower: Lesbian publishers
narrower: Queer publishers
narrower: Transgender publishers
narrower: Asexual publishers
narrower: Intersex publishers
related: LGBTQ+ periodicals
related: Two-Spirit publishers
replaces: publishersLGBTQ
issued: 2019-05-14
modified: 2025-02-23
type: Concept
in scheme: v3
change note: Version 4.1.0

Pups (Roleplay)
preferred label: Cachorros (juego de roles) @es
alternative label: Puppers
alternative label: Puppies
alternative label: Cachorros @es
alternative label: Perritos @es
comment: Individuals who take on the pup or puppy role in puppy play, a form of animal roleplay that is often but not always associated with BDSM and kink communities.
comment: Personas que asumen el rol de cachorro o perrito en el juego de cachorros, una forma de juego de roles de animales que a menudo, aunque no siempre, se asocia con el BDSM y las comunidades kink. @es
broader: Gay culture
broader: Gay men
broader: Leather community
broader: Roleplay
broader: Sexual identity
related: Bears (Gay culture)
related: Gender expression
related: Otters (Gay culture)
related: Pup play
related: Leather people
has top concept: Subcultures
replaces: pups
issued: 2019-05-14
modified: 2025-02-23
type: Concept
in scheme: v3
change note: Version 4.1.0

Queer people of color
preferred label: Personas queer de color @es
preferred label: Queer people of colour
alternative label: QPOC
comment: Primarily used in the United States, this term refers to queer people who are not white and who identify as people of color.
comment: Personas queer que no son blancas y que se autoidentifican como personas de color. @es
broader: LGBTQ+ people of color
has top concept: LGBTQ+ people
replaces: queerPeopleOfColour
issued: 2019-05-14
modified: 2025-02-23
type: Concept
in scheme: v3
change note: Version 4.1.0

Quariwarmi
preferred label: Qariwarmi @es
comment: North American Inca term for people assigned male at birth who fulfill a third gender role that is often spiritual in nature.
comment: Término quechua andino para personas asignadas al sexo masculino al nacer que cumplen un rol de tercer género que a menudo es de naturaleza espiritual. @es
broader: Non-Euro-American gender and sexual identities
related: Two-Spirit people
has top concept: Gender
replaces: quariwarmi
issued: 2019-05-14
modified: 2025-02-23
type: Concept
in scheme: v3
change note: Version 4.1.0

Queens (Gay culture)
preferred label: Reinas (Cultura gay) @es
alternative label: Queens
alternative label: Reinas @es
comment: Slang term for effeminate gay men; predominantly used in the United States.
comment: Término de la jerga para hombres gay afeminados; utilizado predominantemente en los Estados Unidos. @es
broader: Gay culture
broader: Gay men
narrower: Drag queens
related: Gender expression
related: Sissies
has top concept: Subcultures
replaces: queens
issued: 2019-05-14
modified: 2025-02-23
type: Concept
in scheme: v3
change note: Version 4.1.0

Queer (Verb)
preferred label: Queer @es
alternative label: Cuir @es
comment: A term commonly used in academic disciplines to describe actions that address sexual and gender normativity, expose systems of oppression, and attempt to undermine those systems.
comment: Un término comúnmente utilizado en disciplinas académicas para describir acciones que abordan la normatividad sexual y de género, exponen sistemas de opresión e intentan socavar esos sistemas. @es
narrower: LGBTQ+ headcanons
related: Gender studies
related: LGBTQ+ literature
related: Queer archives
related: Queer theory
related: Crip
related: Queer gaze
related: Queercrip
replaces: queerVerb
issued: 2019-05-14
modified: 2025-02-23
type: Concept
in scheme: v3
change note: Version 4.1.0

Queer activism
preferred label: Activismo queer @es
comment: Direct action and organizing to achieve political or social change and acceptance for queer people.
comment: Acción directa y organización para lograr el cambio político o social y la aceptación de las personas queer. @es
broader: LGBTQ+ activism
related: Queer political activists
has top concept: LGBTQ+ activism
replaces: queerActivism
issued: 2019-05-14
modified: 2025-02-23
type: Concept
in scheme: v3
change note: Version 4.1.0

African American queer people
preferred label: Personas queer afroamericanas @es
alternative label: Queer African American people
alternative label: Queer African Americans
alternative label: Afroamericanos queer @es
alternative label: Queers afroamericanos @es
alternative label: Afroamericanas queer @es
alternative label: Queers afroamericanas @es
comment: Queer people of African descent born in the United States or queer people born in African countries who live in or have a strong connection to the United States. Use for individuals who self-identity as African American. Follow the individual’s preference for African American or Black whenever possible.
comment: Personas queer de ascendencia africana nacidas en los Estados Unidos o personas queer nacidas en países africanos que viven o tienen una conexión fuerte con los Estados Unidos. Utilícese para personas que se autoidentifiquen como afroamericanas. @es
broader: African American LGBTQ+ people
has top concept: LGBTQ+ people
replaces: queerAfricanAmericans
issued: 2019-05-14
modified: 2025-02-23
type: Concept
in scheme: v3
change note: Version 4.1.0

Afro-Canadian queer people
preferred label: Personas queer afrocanadienses @es
alternative label: Queer Afro-Canadian people
alternative label: Queer Afro-Canadians
alternative label: Personas afrocanadienses queer @es
alternative label: Afrocanadienses queer @es
comment: Queer people of African descent born in Canada or queer people born in African countries who live in or have a strong connection to Canada. Use for individuals who self-identify as Afro-Canadian.
comment: Personas queer de ascendencia africana nacidas en Canadá o personas queer nacidas en países africanos que viven o tienen una conexión fuerte con Canadá. Utilícese para personas que se identifiquen como afrocanadienses. @es
broader: Afro-Canadian LGBTQ+ people
has top concept: LGBTQ+ people
replaces: queerAfroCanadians
issued: 2019-05-14
modified: 2025-02-23
type: Concept
in scheme: v3
change note: Version 4.1.0

Afro-Caribbean queer people
preferred label: Personas queer afrocaribeñas @es
alternative label: Queer Afro-Caribbean people
alternative label: Queer Afro-Caribbeans
alternative label: Personas afrocaribeñas queer @es
alternative label: Afrocaribeños queer @es
alternative label: Afrocaribeñas queer @es
comment: Queer people of African descent born in the Caribbean or queer people born in African countries who live in or have a strong connection to the Caribbean. Only use for individuals who self-identify as Afro-Caribbean.
comment: Personas queer de ascendencia africana nacidas en el Caribe o personas queer nacidas en países africanos que viven o tienen una conexión fuerte con el Caribe. Utilícese únicamente para personas que se identifiquen como afrocaribeñas. @es
broader: Afro-Caribbean LGBTQ+ people
has top concept: LGBTQ+ people
replaces: queerAfroCaribbeans
issued: 2019-05-14
modified: 2025-02-23
type: Concept
in scheme: v3
change note: Version 4.1.0

Afro-European queer people
preferred label: Personas queer afroeuropeas @es
alternative label: Queer Afro-European people
alternative label: Queer Afro-Europeans
alternative label: Personas afroeuropeas queer @es
alternative label: Afroeuropeos queer @es
alternative label: Afroeuropeas queer @es
comment: Queer people of African descent born in European countries or queer people born in African countries who live in or have a strong connection to Europe. Only use for individuals who self-identify as Afro-European.
comment: Personas queer de ascendencia africana nacidas en países europeos o personas queer nacidas en países africanos que viven o tienen una fuerte conexión con Europa. Utilícese únicamente para personas que se identifiquen como afroeuropeas. @es
broader: Afro-European LGBTQ+ people
has top concept: LGBTQ+ people
replaces: queerAfroEuropeans
issued: 2019-05-14
modified: 2025-02-23
type: Concept
in scheme: v3
change note: Version 4.1.0

Afro-Latin American queer people
preferred label: Personas queer afrolatinoamericanas @es
alternative label: Queer Afro-Latin American people
alternative label: Queer Afro-Latin Americans
alternative label: Personas afrolatinoamericanas queer @es
alternative label: Afrolatinoamericanos queer @es
alternative label: Afrolatinoamericanas queer @es
comment: Queer people of African descent born in Latin American countries or queer people born in African countries who live in or have a strong connection to Latin America. Only use for individuals who self-identify as Afro-Latin American.
comment: Personas queer afrodescendientes nacidas en países latinoamericanos o personas queer nacidas en países africanos que viven o tienen una conexión fuerte con América Latina. Utilícese únicamente para personas que se identifiquen como afrolatinoamericanas. @es
broader: Afro-Latin American LGBTQ+ people
has top concept: LGBTQ+ people
replaces: queerAfroLatinAmericans
issued: 2019-05-14
modified: 2025-02-23
type: Concept
in scheme: v3
change note: Version 4.1.0

Queer archives
preferred label: Archivos queer @es
comment: Collections of records and materials relating to queer people or queer communities; can include a variety of organizations and institutions from community to government archives.
comment: Colecciones de registros y materiales relacionados con personas queer o comunidades queer; puede incluir una variedad de organizaciones e instituciones, desde archivos comunitarios hasta gubernamentales. @es
broader: LGBTQ+ archives
related: Queer (Verb)
has top concept: LGBTQ+ cultural heritage institutions
replaces: queerArchives
issued: 2019-05-14
modified: 2025-02-23
type: Concept
in scheme: v3
change note: Version 4.1.0

Queer artists
preferred label: Artistas queer @es
comment: Queer people who practice any of various creative arts.
comment: Artistas conocidos por ser queer. @es
broader: LGBTQ+ artists
has top concept: LGBTQ+ people
replaces: queerArtists
issued: 2019-05-14
modified: 2025-02-23
type: Concept
in scheme: v3
change note: Version 4.1.0

Asian American queer people
preferred label: Personas queer asiático-americanas @es
alternative label: Queer Asian American people
alternative label: Queer Asian Americans
alternative label: Personas asiático-americanas queer @es
alternative label: Asiático-americanos queer @es
alternative label: Asiático-americanas queer @es
comment: Queer people of Asian heritage or descent born in the United States or born in Asian countries who live in or have a strong connection to the United States. Only use for individuals who self-identify as Asian American.
comment: Personas queer de ascendencia asiática nacidas en Estados Unidos o personas queer nacidas en países asiáticos que viven en o tienen una conexión fuerte con los Estados Unidos. Utilícese para personas que se autoidentifiquen como asiático-americanas. @es
broader: Asian American LGBTQ+ people
broader: Asian queer people
has top concept: LGBTQ+ people
replaces: queerAsianAmericans
issued: 2019-05-14
modified: 2025-02-23
type: Concept
in scheme: v3
change note: Version 4.1.0

Asian queer people
preferred label: Personas queer asiáticas @es
alternative label: Queer Asian people
alternative label: Queer Asians
alternative label: Personas asiáticas queer @es
alternative label: Asiáticos queer @es
alternative label: Asiáticas queer @es
comment: Queer people of Asian heritage or descent, living in Asia or part of the Asian diaspora. Only use for people who self-identify as Asian.
comment: Personas queer nacidas o descendientes de países asiáticos. Utilícese únicamente para las personas que se autoidentifiquen como asiáticas. @es
broader: Asian LGBTQ+ people
narrower: Asian American queer people
has top concept: LGBTQ+ people
replaces: queerAsians
issued: 2019-05-14
modified: 2025-02-23
type: Concept
in scheme: v3
change note: Version 4.1.0

Queer atheists
preferred label: Ateos queer @es
comment: Queer people who are atheists.
comment: Personas queer que son ateas. @es
broader: LGBTQ+ atheists
has top concept: LGBTQ+ people
replaces: queerAtheists
issued: 2019-05-14
modified: 2025-02-23
type: Concept
in scheme: v3
change note: Version 4.1.0

Queer bars
preferred label: Bares queer @es
comment: Drinking establishments that primarily cater to queer people.
comment: Establecimientos de bebidas que atienden principalmente a personas queer. @es
broader: LGBTQ+ bars
related: Queer community
has top concept: LGBTQ+ meeting places
replaces: queerBars
issued: 2019-05-14
modified: 2025-02-23
type: Concept
in scheme: v3
change note: Version 4.1.0

Queer beaches
preferred label: Playas queer @es
comment: Beaches set aside for use by queer people or beaches known to be frequented by queer people.
comment: Playas reservadas para el uso de personas queer o playas conocidas por ser frecuentadas por personas queer. @es
broader: LGBTQ+ beaches
has top concept: LGBTQ+ meeting places
replaces: queerBeaches
issued: 2019-05-14
modified: 2025-02-23
type: Concept
in scheme: v3
change note: Version 4.1.0

Black queer people
preferred label: Personas queer negras @es
alternative label: Queer Black people
alternative label: Personas negras queer @es
comment: Black people who are queer. Use only for individuals who self-identity as Black. Follow the individual’s preference for African American or Black whenever possible.
comment: Personas negras que son queer. Utilícese únicamente para personas que seautoidentificancomo negras. Siga la preferencia del individuo para el uso de afroamericanos o negros siempre que sea posible. @es
broader: Black LGBTQ+ people
related: Black queer archives
has top concept: LGBTQ+ people
replaces: queerBlackPeople
issued: 2019-05-14
modified: 2025-02-23
type: Concept
in scheme: v3
change note: Version 4.1.0

Queer bookshops
preferred label: Librerías queer @es
comment: Bookshops that sell materials intended for use by queer people or addressing topics related to queerness.
comment: Librerías que venden materiales destinados a personas queer o que abordan temas relacionados con lo queer. @es
broader: LGBTQ+ bookshops
has top concept: LGBTQ+ bookshops
replaces: queerBookshops
issued: 2019-05-14
modified: 2025-02-23
type: Concept
in scheme: v3
change note: Version 4.1.0

Queer Buddhists
preferred label: Budistas queer @es
comment: Queer people who are Buddhist.
comment: Personas queer que son budistas. @es
broader: LGBTQ+ Buddhists
has top concept: LGBTQ+ African religions
replaces: queerBuddhists
issued: 2019-05-14
modified: 2025-02-23
type: Concept
in scheme: v3
change note: Version 4.1.0

Queer characters
preferred label: Personajes queer @es
comment: Characters in creative works who are queer.
comment: Personajes de obras creativas que son queer. @es
broader: LGBTQ+ characters
related: Queer children
related: Queer people
has top concept: LGBTQ+ characters
replaces: queerCharacters
issued: 2019-05-14
modified: 2025-02-23
type: Concept
in scheme: v3
change note: Version 4.1.0

Queer children
preferred label: Niños queer @es
comment: Queer people who have not yet reached the age of adolescence.
comment: Niños menores de 18 años que se identifican como queer. @es
broader: LGBTQ+ children
broader: Queer youth
related: Queer characters
related: Queer identity
has top concept: Family members
replaces: queerChildren
issued: 2019-05-14
modified: 2025-02-23
type: Concept
in scheme: v3
change note: Version 4.1.0

Queer Christians
preferred label: Cristianos queer @es
comment: Queer people who are Christian.
comment: Personas queer que son cristianas. @es
broader: LGBTQ+ Christians
has top concept: LGBTQ+ African religions
replaces: queerChristians
issued: 2019-05-14
modified: 2025-02-23
type: Concept
in scheme: v3
change note: Version 4.1.0

Queer clergy
preferred label: Clero queer @es
comment: Queer people who are ordained for religious duties, particularly in the Christian Church.
comment: Personas queer que son ordenadas para deberes religiosos, particularmente en la Iglesia cristiana. @es
broader: LGBTQ+ clergy
related: Bisexual clergy
related: Celibacy
related: Gay clergy
related: Lesbian clergy
related: Transgender clergy
has top concept: LGBTQ+ clergy
replaces: queerClergy
issued: 2019-05-14
modified: 2025-02-23
type: Concept
in scheme: v3
change note: Version 4.1.0

Queer community
preferred label: Comunidad queer @es
comment: Groups of people who share the experience of being queer.
comment: Grupos de personas que comparten la experiencia de ser queer. @es
broader: LGBTQ+ communities
related: LGBTQ
related: LGBTQ+
related: LGBTQIA
related: Queer bars
related: 2SLGBTQ+
related: Queer joy
has top concept: LGBTQ+ communities
replaces: queerCommunity
issued: 2019-05-14
modified: 2025-02-23
type: Concept
in scheme: v3
change note: Version 4.1.0

Queer community centers
preferred label: Centros comunitarios queer @es
preferred label: Queer community centres
comment: Spaces in which people from queer communities meet for social, education, recreational, or organizing activities.
comment: Espacios en los que personas de comunidades queer se reúnen para realizar actividades sociales, educativas, recreativas u organizativas. @es
broader: LGBTQ+ community centers
has top concept: LGBTQ+ centers
replaces: queerCommunityCentres
issued: 2019-05-14
modified: 2025-02-23
type: Concept
in scheme: v3
change note: Version 4.1.0

Queer couples
preferred label: Parejas queer @es
comment: Partnerships in which both people are queer.
comment: Relaciones en las que ambas personas son queer. @es
broader: LGBTQ+ couples
has top concept: Relationship satisfaction
replaces: queerCouples
issued: 2019-05-14
modified: 2025-02-23
type: Concept
in scheme: v3
change note: Version 4.1.0

Queer daughters
preferred label: Hijas queer @es
comment: Daughters who identify as queer.
comment: Hijas que se identifican como queer. @es
broader: LGBTQ+ daughters
has top concept: LGBTQ+ people
replaces: queerDaughters
issued: 2019-05-14
modified: 2025-02-23
type: Concept
in scheme: v3
change note: Version 4.1.0

Queer drama
preferred label: Drama queer @es
comment: Works of fiction written to be performed; use in reference to dramatic works focusing on queer characters or themes.
comment: Obras de ficción escritas para ser puestas en escena; utilícese en referencia a obras dramáticas que se centran en personajes o temas queer. @es
broader: LGBTQ+ drama
related: Queer authors
has top concept: Subcultures
replaces: queerDrama
issued: 2019-05-14
modified: 2025-02-23
type: Concept
in scheme: v3
change note: Version 4.1.0

Queer dominatrices
preferred label: Dominatrices queer @es
comment: Women who take a dominant role in BDSM activities; use for dominatrices who identify as queer.
comment: Mujeres que desempeñan un papel dominante en las actividades de BDSM; utilícese para dominatrices que se autoidentifican como queer. @es
broader: LGBTQ+ dominatrices
related: Bisexual dominatrices
related: Lesbian dominatrices
related: Transgender dominatrices
has top concept: Relationship minorities
replaces: queerDominatrices
issued: 2019-05-14
modified: 2025-02-23
type: Concept
in scheme: v3
change note: Version 4.1.0

Queer families
preferred label: Familias queer @es
comment: Families, whether biological, adoptive, or chosen, in which one or more individuals identify as queer.
comment: Familias, ya sean biológicas, adoptivas o elegidas, en las que una o más personas se autoidentifican como queer. @es
broader: LGBTQ+ families
related: Children of queer people
related: LGBTQ+ parenthood
related: Queer people
related: Queerspawn
related: Culturally queer
has top concept: LGBTQ+ families
replaces: queerFamilies
issued: 2019-05-14
modified: 2025-02-23
type: Concept
in scheme: v3
change note: Version 4.1.0

Queer fiction
preferred label: Ficción queer @es
comment: Written works that describe imagined events or people; use in reference to fictional works focusing on queer characters or themes.
comment: Obras escritas que describen eventos o personas imaginadas; utilícese en referencia a obras de ficción que se centran en personajes o temas queer. @es
broader: LGBTQ+ fiction
related: Queer authors
related: Intersex fiction
related: Aromantic fiction
related: Asexual fiction
related: Queer people in fandom
has top concept: Subcultures
replaces: queerFiction
issued: 2019-05-14
modified: 2026-02-23
type: Concept
in scheme: v3
change note: Version 4.1.0

Queer identity
preferred label: Identidad queer @es
comment: Identity term that can be used to describe several not-necessarily-mutually-exclusive understandings of queerness. Queerness can describe identities that exist outside of or between different identities, and also identities that actively resist normative understandings of sexuality and/or gender. This term should only be used for those who self-identify as queer.
comment: Término identitario que se puede utilizar para describir varias interpretaciones de lo queer, no necesariamente mutuamente excluyentes. Lo queer puede describir identidades que existen fuera de o entre diferentes identidades, y también identidades que se resisten activamente a entendimientos normativos de la sexualidad y/o el género. Utilícese únicamente para quienes se autoidentifiquen como queer. @es
broader: Sexual identity
related: Queer children
related: Queer people
has top concept: Sexual identity
replaces: queerIdentity
issued: 2019-05-14
modified: 2025-02-23
type: Concept
in scheme: v3
change note: Version 4.1.0

Queer information centers
preferred label: Centros de información queer @es
preferred label: Queer information centres
comment: Institutions that provide education, support, and information about queerness and queer communities to queer people.
comment: Instituciones que brindan educación, apoyo e información sobre lo queer y comunidades queer a personas queer. @es
broader: LGBTQ+ information centers
related: Queer movement
has top concept: LGBTQ+ centers
replaces: queerInformationCentres
issued: 2019-05-14
modified: 2025-02-23
type: Concept
in scheme: v3
change note: Version 4.1.0

Jewish queer people
preferred label: Personas queer judías @es
alternative label: Jewish queers
alternative label: Queer Jews
alternative label: Judíos queer @es
comment: Queer people who are Jewish.
comment: Personas queer que son judías. @es
broader: Jewish LGBTQ+ people
has top concept: LGBTQ+ people
replaces: queerJews
issued: 2019-05-14
modified: 2025-02-23
type: Concept
in scheme: v3
change note: Version 4.1.0

Latino/a/x queer people
preferred label: Personas queer Latinx @es
alternative label: Latina queer people
alternative label: Latine queer people
alternative label: Latino queer people
alternative label: Latinx queer people
alternative label: Queer Latinas
alternative label: Queer Latine people
alternative label: Queer Latinos
alternative label: Queer Latinx people
comment: Latin American people who are queer; only use to describe individuals who self-identify as Latino, Latina, or Latinx. Do not conflate with Chicano/a/x or Hispanic.
comment: Personas latinoamericanas que son queer; utilícese únicamente para describir a personas que se autoidentifican como latinos, latinas o latinxs. No debe confundirse con chicano/a/x o hispano/a/x. @es
broader: Latino/a/x LGBTQ+ people
has top concept: LGBTQ+ people
replaces: queerLatinx
issued: 2019-05-14
modified: 2025-02-23
type: Concept
in scheme: v3
change note: Version 4.1.0

Queer libraries
preferred label: Bibliotecas queer @es
comment: Libraries that hold materials primarily pertaining to queer people or intended for use by queer people.
comment: Bibliotecas que contienen materiales principalmente relacionados con personas queer o destinados a ser utilizados por personas queer. @es
broader: LGBTQ+ libraries
has top concept: LGBTQ+ cultural heritage institutions
replaces: queerLibraries
issued: 2019-05-14
modified: 2025-02-23
type: Concept
in scheme: v3
change note: Version 4.1.0

Queer literature
preferred label: Literatura queer @es
comment: Written literary works about queerness, queer characters, or queer themes.
comment: Obras literarias escritas sobre lo queer, personajes queer o temas queer. @es
broader: LGBTQ+ literature
related: Queer authors
related: Queer people in literature
has top concept: Subcultures
replaces: queerLiterature
issued: 2019-05-14
modified: 2025-04-23
type: Concept
in scheme: v3
change note: Version 4.1.0

Queer dominants
preferred label: Dominantes queer @es
alternative label: Queer masters
alternative label: Amos queer @es
comment: Queer people who are part of the BDSM scene and assume the dominant role in sexual relationships with a dominant/submissive dynamic.
comment: Personas queer que forman parte de la escena BDSM y asumen el rol dominante en las relaciones sexuales con una dinámica dominante/sumisa. @es
broader: LGBTQ+ dominants
has top concept: Sexual identity
replaces: queerMasters
issued: 2019-05-14
modified: 2025-02-23
type: Concept
in scheme: v3
change note: Version 4.1.0

Queer men
preferred label: Hombres queer @es
comment: Men who identify as queer.
comment: Hombres que se identifican como queer. @es
broader: Queer people
related: Bisexual men
related: Gay men
has top concept: LGBTQ+ people
replaces: queerMen
issued: 2019-05-14
modified: 2025-02-23
type: Concept
in scheme: v3
change note: Version 4.1.0

Queer mistresses
preferred label: Amas queer @es
comment: Queer women who are part of the BDSM scene and assume the mistress role in sexual relationships with a mistress/submissive dynamic.
comment: Mujeres queer que forman parte de la escena BDSM y asumen el rol de ama en las relaciones sexuales con una dinámica ama/esclava. @es
broader: LGBTQ+ mistresses (BDSM culture)
related: Bisexual mistresses
related: Lesbian mistresses
related: Transgender mistresses
has top concept: Sexual identity
replaces: queerMistresses
issued: 2019-05-14
modified: 2026-02-24
type: Concept
in scheme: v3
change note: Version 4.1.0

Queer movement
preferred label: Movimiento queer @es
comment: Umbrella term for activism focused on the rights of queer people and issues faced by queer communities.
comment: Término general para el activismo centrado en los derechos de las personas queer y los problemas que enfrentan las comunidades queer. @es
broader: LGBTQ+ movement
related: Queer information centers
related: Queer demonstrations
has top concept: Social movements
replaces: queerMovement
issued: 2019-05-14
modified: 2025-04-23
type: Concept
in scheme: v3
change note: Version 4.1.0

Queer museums
preferred label: Museos queer @es
comment: Institutions dedicated to the storage, exhibition, conservation, and preservation of materials relating to queerness, queer people, or queer history.
comment: Instituciones dedicadas al almacenamiento, la exhibición, la conservación y la preservación de materiales relacionados con lo queer, las personas queer o la historia queer. @es
broader: LGBTQ+ museums
has top concept: LGBTQ+ cultural heritage institutions
replaces: queerMuseums
issued: 2019-05-14
modified: 2025-02-23
type: Concept
in scheme: v3
change note: Version 4.1.0

Queer Muslims
preferred label: Musulmanes queer @es
comment: Queer people who are Muslim.
comment: Personas queer que son musulmanas. @es
broader: LGBTQ+ Muslims
has top concept: LGBTQ+ African religions
replaces: queerMuslims
issued: 2019-05-14
modified: 2025-02-23
type: Concept
in scheme: v3
change note: Version 4.1.0

Native American queer people
preferred label: Personas queer nativoamericanas @es
alternative label: American Indian queer people
alternative label: Queer American Indians
alternative label: Queer Native Americans
alternative label: Personas nativoamericanas queer @es
comment: People who are part of the Native peoples of the continental United States and Canada (excluding Inuit people) and self-identity as queer. Use more specific terms when available.
comment: Personas queer que son nativoamericanas o parte de los pueblos indígenas de Norteamérica; utilícese únicamente para personas que se autoidentifiquen como nativoamericanas y queer. @es
broader: Native American LGBTQ+ people
has top concept: LGBTQ+ people
replaces: queerNativeAmericans
issued: 2019-05-14
modified: 2025-02-23
type: Concept
in scheme: v3
change note: Version 4.1.0

Queer newsletters
preferred label: Boletines queer @es
comment: Serialized print or digital periodicals created by or for queer people, often with the purpose of sharing news and information related to queer communities and queer issues.
comment: Publicaciones periódicas impresas o digitales serializadas creadas por o para personas queer, a menudo con el propósito de compartir noticias e información relacionadas con comunidades y temas queer. @es
broader: LGBTQ+ newsletters
has top concept: LGBTQ+ press
replaces: queerNewsletters
issued: 2019-05-14
modified: 2025-02-23
type: Concept
in scheme: v3
change note: Version 4.1.0

Queer newspapers
preferred label: Periódicos queer @es
alternative label: Diarios queer @es
comment: Serialized print or digital publications about queer people or queer issues (and typically produced by queer people or queer organizations) that contain news, articles, columns, correspondence, and advertisements.
comment: Publicaciones impresas o digitales serializadas sobre personas queer o temas queer (y generalmente producidas por personas queer u organizaciones queer) que contienen noticias, artículos, columnas, correspondencia y anuncios. @es
broader: LGBTQ+ newspapers
has top concept: LGBTQ+ press
replaces: queerNewspapers
issued: 2019-05-14
modified: 2025-02-23
type: Concept
in scheme: v3
change note: Version 4.1.0

Queer Pagans
preferred label: Paganos queer @es
comment: Queer people who are members of polytheistic religions or other religions outside of the dominant culture that typically incorporate nature worship and/or the sacred feminine, such as Wicca, Druidry, Heathenry, etc. Use to describe queer people who self-identify as Pagan.
comment: Personas queer que son miembros de religiones politeístas u otras religiones fuera de la cultura dominante que típicamente incorporan el culto a la naturaleza y/o lo sagrado femenino, como la Wicca, el druidismo, el paganismo, etc. Utilícese para describir a las personas queer que se autoidentifiquen como paganas. @es
broader: LGBTQ+ Pagans
related: Queer witches
has top concept: LGBTQ+ African religions
replaces: queerPagans
issued: 2019-05-14
modified: 2025-02-23
type: Concept
in scheme: v3
change note: Version 4.1.0

Queer parents
preferred label: Madres y padres queer @es
alternative label: Madres queer @es
alternative label: Padres queer @es
comment: Queer people who are parents.
comment: Personas queer que son padres y/o madres. @es
broader: LGBTQ+ parents
related: Children of queer people
related: Queer people
related: Queerspawn
has top concept: LGBTQ+ families
replaces: queerParents
issued: 2019-05-14
modified: 2025-02-23
type: Concept
in scheme: v3
change note: Version 4.1.0

Queer people
preferred label: Personas queer @es
comment: Individuals who identify with non-normative gender and/or sexual identities, typically people who are not heterosexual and/or are not cisgender. Only use for people who identify as queer.
comment: Personas que se identifican con identidades sexuales y/o de género no normativas, generalmente personas que no son heterosexuales y/o cisgénero. Utilícese únicamente para personas que se autoidentifiquen como queer. @es
broader: Bi+ people
broader: LGBTQ+ people
broader: Reclaimed terms
narrower: Genderqueer people
narrower: Queer men
narrower: Queer youth
narrower: Queer transgender people
narrower: Queer women
narrower: Closeted queer people
narrower: Indigiqueer people
narrower: Queer college students
related: Parents of queer people
related: Persecution of queer people
related: Queer characters
related: Queer families
related: Queer identity
related: Queer parents
related: Queerphobia
related: Genderqueer identity
related: Queer people in fandom
related: Queercrip
related: Culturally queer
related: Queer bodies
has top concept: LGBTQ+ people
replaces: queerPeople
issued: 2019-05-14
modified: 2025-02-23
type: Concept
in scheme: v3
change note: Version 4.1.0

Queer people in the military
preferred label: Personas queer en el ejército @es
alternative label: Personas queer en las fuerzas armadas @es
comment: Queer people serving in state and national armed forces.
comment: Personas queer que sirven en las fuerzas armadas estatales y nacionales. @es
broader: LGBTQ+ people in the military
has top concept: Legal status
replaces: queerPeopleInTheMilitary
issued: 2019-05-14
modified: 2025-02-23
type: Concept
in scheme: v3
change note: Version 4.1.0

Queer poetry
preferred label: Poesía queer @es
comment: Literary works, typically written in verse, that focus on queer characters, themes, or identity.
comment: Obras literarias, normalmente escritas en verso, que se centran en personajes, temas o identidades queer. @es
broader: LGBTQ+ poetry
related: Queer authors
has top concept: Subcultures
replaces: queerPoetry
issued: 2019-05-14
modified: 2025-02-23
type: Concept
in scheme: v3
change note: Version 4.1.0

Queer political activists
preferred label: Activistas políticos queer @es
comment: Queer people working to bring about political or social change through public organizing.
comment: Personas queer que trabajan para lograr cambios políticos o sociales a través de la organización pública. @es
broader: LGBTQ+ political activists
related: Queer activism
has top concept: LGBTQ+ people
replaces: queerPoliticalActivists
issued: 2019-05-14
modified: 2025-02-23
type: Concept
in scheme: v3
change note: Version 4.1.0

Queer porn films
preferred label: Películas porno queer @es
alternative label: Películas pornográficas queer @es
comment: Erotic or sexually explicit films featuring queer people.
comment: Películas eróticas o sexualmente explícitas protagonizadas por personas queer. @es
broader: LGBTQ+ porn films
broader: Queer erotic art
related: Queer erotic films
has top concept: Subcultures
replaces: queerPornFilms
issued: 2019-05-14
modified: 2025-02-23
type: Concept
in scheme: v3
change note: Version 4.1.0

Queer press
preferred label: Prensa queer @es
comment: Newspapers, magazines, or other publishing outlets aimed at queer audiences and/or operated by queer people.
comment: Periódicos, revistas u otros medios editoriales dirigidos a audiencias queer y/o operados por personas queer. @es
broader: LGBTQ+ press
narrower: Queer zines
has top concept: LGBTQ+ press
replaces: queerPress
issued: 2019-05-14
modified: 2025-02-23
type: Concept
in scheme: v3
change note: Version 4.1.0

Queer sex workers
preferred label: Trabajadores sexuales queer @es
alternative label: Queer prostitutes
alternative label: Queer prostitution
alternative label: Queer sex work
alternative label: Prostitutxs queer @es
alternative label: Prostitutos queer @es
alternative label: Prostitutas queer @es
alternative label: Trabajo sexual queer @es
comment: Queer people who receive money or goods in exchange for sexual services, performances, or companionship. Use to describe queer people working across the broad spectrum of sex work.
comment: Personas queer que reciben dinero o bienes a cambio de servicios o actuaciones sexuales. Se utiliza para describir a las personas queer que trabajan en el amplio espectro del trabajo sexual. @es
broader: LGBTQ+ sex workers
has top concept: Sex workers
replaces: queerProstitutes
issued: 2019-05-14
modified: 2025-02-23
type: Concept
in scheme: v3
change note: Version 4.1.0

Queer Protestants
preferred label: Protestantes queer @es
comment: Queer people who are members of the Protestant Church.
comment: Personas queer que son miembros de la Iglesia protestante. @es
broader: LGBTQ+ Protestants
has top concept: LGBTQ+ African religions
replaces: queerProtestants
issued: 2019-05-14
modified: 2025-02-23
type: Concept
in scheme: v3
change note: Version 4.1.0

Queer publishers
preferred label: Editoriales queer @es
comment: Companies and organizations that publish materials for queer communities or addressing queer issues.
comment: Empresas y organizaciones que publican materiales para comunidades queer o que abordan asuntos queer. @es
broader: LGBTQ+ publishers
has top concept: LGBTQ+ publishers
replaces: queerPublishers
issued: 2019-05-14
modified: 2025-02-23
type: Concept
in scheme: v3
change note: Version 4.1.0

Queer radio
preferred label: Radio queer @es
comment: Auditory content broadcast on the radio (analog or digital) about queer people and queer issues.
comment: Contenido auditivos difundido por radio (analógica o digital) sobre personas y asuntos queer. @es
broader: LGBTQ+ radio
has top concept: LGBTQ+ radio
replaces: queerRadio
issued: 2019-05-14
modified: 2026-02-23
type: Concept
in scheme: v3
change note: Version 4.1.0

Queer relationships
preferred label: Relaciones queer @es
comment: Ongoing connections (romantic, sexual, or platonic) between two or more queer people.
comment: Conexiones continuas (románticas, sexuales o platónicas) entre dos o más personas queer. @es
broader: Relationship satisfaction
related: Bisexual relationships
related: Gay relationships
related: Lesbian relationships
related: Transgender relationships
related: Queer desire
has top concept: Relationship satisfaction
replaces: queerRelationships
issued: 2019-05-14
modified: 2025-02-23
type: Concept
in scheme: v3
change note: Version 4.1.0

Queer rights
preferred label: Derechos queer @es
comment: Legal, social, or ethical principles of freedom or entitlement held by queer people.
comment: Principios legales, sociales o éticos de libertad o derechos que tienen las personas queer. @es
broader: LGBTQ+ civil rights
has top concept: Human rights
replaces: queerRights
issued: 2019-05-14
modified: 2025-02-23
type: Concept
in scheme: v3
change note: Version 4.1.0

Queer Roman Catholics
preferred label: Personas católico romanas queer @es
alternative label: Católicos romanos queer @es
comment: Queer people who are members of the Roman Catholic Church.
comment: Personas queer que son miembros de la Iglesia católica romana. @es
broader: LGBTQ+ Roman Catholics
has top concept: LGBTQ+ African religions
replaces: queerRomanCatholics
issued: 2019-05-14
modified: 2025-02-23
type: Concept
in scheme: v3
change note: Version 4.1.0

Queer slang
preferred label: Jerga queer @es
alternative label: Argot queer @es
comment: Colloquial or informal language related to queer people or used by queer people.
comment: Lenguaje coloquial o informal relacionado con personas queer o utilizado por personas queer. @es
broader: LGBTQ+ slang
related: Reclaimed terms
has top concept: LGBTQ+ slang
replaces: queerSlang
issued: 2019-05-14
modified: 2025-02-23
type: Concept
in scheme: v3
change note: Version 4.1.0

Queer sons
preferred label: Hijos queer @es
comment: Sons who identify as queer.
comment: Hijos que se identifican como queer. @es
broader: LGBTQ+ sons
has top concept: LGBTQ+ people
replaces: queerSons
issued: 2019-05-14
modified: 2025-02-23
type: Concept
in scheme: v3
change note: Version 4.1.0

Queer studies
preferred label: Estudios queer @es
comment: Academic field of research and study about queer people, queer identity, and queer communities.
comment: Campo académico de investigación y estudio sobre personas queer, la identidad queer y comunidades queer. @es
related: Bisexual studies
related: Gay studies
related: Gender studies
related: Lesbian studies
related: Queer theory
related: Transgender studies
related: Feminist theory
related: Two-Spirit studies
related: Asexual studies
related: Intersex studies
replaces: queerStudies
issued: 2019-05-14
modified: 2026-02-24
type: Concept
in scheme: v3
change note: Version 4.1.0

Queer survivors of hate crimes
preferred label: Sobrevivientes queer de crímenes de odio @es
comment: Queer people who have experienced and survived hate crimes; follow the individual's preference for "victims" or "survivors" whenever possible.
comment: Personas queer que han sufrido y sobrevivido crímenes de odio; siga la preferencia de la persona sobre el uso de "víctimas" o "sobrevivientes" siempre que sea posible. @es
broader: Queer victims of hate crimes
broader: LGBTQ+ survivors of hate crimes
has top concept: LGBTQ+ people
replaces: queerSurvivorsOfHateCrimes
issued: 2019-05-14
modified: 2025-02-23
type: Concept
in scheme: v3
change note: Version 4.1.0

Queer survivors of rape
preferred label: Sobrevivientes queer de violación @es
comment: Queer people who have experienced and survived rape; follow the individual's preference for "victims" or "survivors" whenever possible.
comment: Personas queer que han sufrido y sobrevivido una violación; siga la preferencia de la persona sobre el uso de "víctimas" o "sobrevivientes" siempre que sea posible. @es
broader: Queer victims of rape
broader: LGBTQ+ survivors of rape
has top concept: LGBTQ+ people
replaces: queerSurvivorsOfRape
issued: 2019-05-14
modified: 2025-02-23
type: Concept
in scheme: v3
change note: Version 4.1.0

Queer survivors of sexual abuse
preferred label: Sobrevivientes queer de abuso sexual @es
comment: Queer people who have experienced and survived sexual abuse; follow the individual's preference for "victims" or "survivors" whenever possible.
comment: Personas queer que han sufrido y sobrevivido abuso sexual; siga la preferencia de la persona sobre el uso de "víctimas" o "sobrevivientes" siempre que sea posible. @es
broader: Queer victims of sexual abuse
broader: LGBTQ+ survivors of sexual abuse
has top concept: LGBTQ+ people
replaces: queerSurvivorsOfSexualAbuse
issued: 2019-05-14
modified: 2025-02-23
type: Concept
in scheme: v3
change note: Version 4.1.0

Queer survivors of war
preferred label: Sobrevivientes queer de guerra @es
comment: Queer people who have experienced and survived war; follow the individual's preference for "victims" or "survivors" whenever possible.
comment: Personas queer que han sufrido y sobrevivido la guerra; siga la preferencia de la persona sobre el uso de "víctimas" o "sobrevivientes" siempre que sea posible. @es
broader: Queer victims of war
broader: LGBTQ+ survivors of war
has top concept: LGBTQ+ people
replaces: queerSurvivorsOfWar
issued: 2019-05-14
modified: 2025-02-23
type: Concept
in scheme: v3
change note: Version 4.1.0

Queer youth
preferred label: Juventud queer @es
alternative label: Queer teenagers
alternative label: Queer adolescents
alternative label: Queer teens
alternative label: Adolescentes queer @es
alternative label: Jóvenes queer @es
comment: Queer people who are between the ages of childhood and adulthood.
comment: Personas queer que se encuentran entre las edades de la niñez y la edad adulta. @es
broader: Queer people
broader: LGBTQ+ youth
narrower: Queer children
related: Queer youth literature
has top concept: LGBTQ+ people
replaces: queerYouth
issued: 2019-05-14
modified: 2025-02-23
type: Concept
in scheme: v3
change note: Version 4.1.0

Queer television
preferred label: Televisión queer @es
comment: Television shows featuring queer people or queer themes.
comment: Programas de televisión que presentan a personas queer o temas queer. @es
broader: LGBTQ+ television
has top concept: LGBTQ+ television
replaces: queerTelevision
issued: 2019-05-14
modified: 2025-02-23
type: Concept
in scheme: v3
change note: Version 4.1.0

Queer theater
preferred label: Teatro queer @es
preferred label: Queer theatre
alternative label: Drama queer @es
comment: Works in the performance arts that focus on queer characters, communities, or issues.
comment: Obras en las artes escénicas que se centran en personajes, comunidades o cuestiones queer. @es
broader: LGBTQ+ theater
has top concept: LGBTQ+ theater
replaces: queerTheatre
issued: 2019-05-14
modified: 2025-02-23
type: Concept
in scheme: v3
change note: Version 4.1.0

Queer theology
preferred label: Teología queer @es
alternative label: Gay theology
alternative label: LGBTQ+ theology
alternative label: Lesbian theology
alternative label: Teología gay @es
alternative label: Teología LGBTQ+ @es
alternative label: Teología lesbiana @es
comment: A theological method that developed out of queer theory. Queer theology, which encompasses the previously commonly used terms gay theology and lesbian theology, can variously be understood as (1) theology done by, with, and for LGBTQ+ people according to their needs; (2) theology that purposefully opposes social and cultural norms surrounding gender and sexuality; and (3) theology that broadly challenges and deconstructs harmful historical boundaries.
comment: Un método teológico que se desarrolló a partir de la teoría queer. La teología queer, que abarca los términos previa y comúnmente utilizados de teología gay y teología lesbiana, puede entenderse de diversas formas, como (1) teología realizada por, con y para personas LGBTQ+ de acuerdo a sus necesidades; (2) teología que se opone deliberadamente a las normas sociales y culturales con respecto al género y la sexualidad; y (3) teología que desafía y deconstruye de forma abarcadora fronteras históricas dañinas. @es
related: LGBTQ+ African religions
related: LGBTQ+ spiritual people
related: Queer theory
replaces: queerTheology
issued: 2019-05-14
modified: 2025-02-23
type: Concept
in scheme: v3
change note: Version 4.1.0

Queer theory
preferred label: Teoría queer @es
comment: Field of critical theory that emerged in the 1990s out of queer studies and women's studies. Queer theory involves the study and theorization of gender and sexual practices and identities that exist outside of heterosexuality and which challenge heteronormativity and essentialism.
comment: Campo de la teoría crítica que surgió en la década de 1990 a partir de los estudios queer y los estudios de la mujer. La teoría queer implica el estudio y la teorización de las prácticas e identidades sexuales y de género que existen fuera de la heterosexualidad y que desafían la heteronormatividad y el esencialismo. @es
broader: Theories
narrower: Queer gaze
narrower: Queer architecture
narrower: Queer ecology
narrower: Decolonial queer theory
narrower: Queer bodies
narrower: Queer desire
narrower: Queer time
related: Essentialism
related: Gender studies
related: Queer (Verb)
related: Queer studies
related: Queer theology
related: Social constructionism
has top concept: Theories
replaces: queerTheory
issued: 2019-05-14
modified: 2025-04-23
type: Concept
in scheme: v3
change note: Version 4.1.0

Queer transgender people
preferred label: Personas transgénero queer @es
comment: Queer people who identify as transgender.
comment: Personas queer que se identifican como transgénero. @es
broader: Queer people
has top concept: LGBTQ+ people
replaces: queerTransgenderPeople
issued: 2019-05-14
modified: 2025-02-23
type: Concept
in scheme: v3
change note: Version 4.1.0

Queer victims of hate crimes
preferred label: Víctimas queer de crímenes odio @es
comment: Queer people who have experienced hate crimes and may or may not have survived; follow the individual's preference for "victims" or "survivors" whenever possible.
comment: Personas queer que han sufrido crímenes de odio y pueden o no haber sobrevivido; siga la preferencia de la persona sobre el uso de "víctimas" o "sobrevivientes" siempre que sea posible. @es
broader: LGBTQ+ victims of hate crimes
narrower: Queer survivors of hate crimes
has top concept: LGBTQ+ people
replaces: queerVictimsOfHateCrimes
issued: 2019-05-14
modified: 2025-02-23
type: Concept
in scheme: v3
change note: Version 4.1.0

Queer victims of rape
preferred label: Víctimas queer de violación @es
comment: Queer people who have experienced rape and may or may not have survived; follow the individual's preference for "victims" or "survivors" whenever possible.
comment: Personas queer que han sufrido una violación y pueden o no haber sobrevivido; siga la preferencia de la persona sobre el uso de "víctimas" o "sobrevivientes" siempre que sea posible. @es
broader: LGBTQ+ victims of rape
narrower: Queer survivors of rape
has top concept: LGBTQ+ people
replaces: queerVictimsOfRape
issued: 2019-05-14
modified: 2025-02-23
type: Concept
in scheme: v3
change note: Version 4.1.0

Queer victims of sexual abuse
preferred label: Víctimas queer de abuso sexual @es
comment: Queer people who have experienced sexual abuse and may or may not have survived; follow the individual's preference for "victims" or "survivors" whenever possible.
comment: Personas queer que han sufrido abuso sexual y pueden o no haber sobrevivido; siga la preferencia de la persona sobre el uso de "víctimas" o "sobrevivientes" siempre que sea posible. @es
broader: LGBTQ+ victims of sexual abuse
narrower: Queer survivors of sexual abuse
has top concept: LGBTQ+ people
replaces: queerVictimsOfSexualAbuse
issued: 2019-05-14
modified: 2025-02-23
type: Concept
in scheme: v3
change note: Version 4.1.0

Queer victims of war
preferred label: Víctimas queer de guerra @es
comment: Queer people who have experienced war and may or may not have survived; follow the individual's preference for "victims" or "survivors" whenever possible.
comment: Personas queer que han sufrido la guerra y que pueden haber sobrevivido o no; siga la preferencia de la persona sobre el uso de "víctimas" o "sobrevivientes" siempre que sea posible. @es
broader: LGBTQ+ victims of war
narrower: Queer survivors of war
has top concept: LGBTQ+ people
replaces: queerVictimsOfWar
issued: 2019-05-14
modified: 2025-02-23
type: Concept
in scheme: v3
change note: Version 4.1.0

Queer victims' rights
preferred label: Derechos de víctimas queer @es
comment: Queer people’s legal rights to be informed, present, and heard within the criminal justice system after having been harmed or injured as the result of a crime, accident, or other event.
comment: Los derechos legales de las personas queer a estar informadas, estar presentes y ser escuchadas dentro del sistema de justicia penal después de haber sido perjudicadas o lesionadas como resultado de un delito, accidente u otro evento. @es
broader: LGBTQ+ victims' rights
has top concept: Law
replaces: queerVictimsRights
issued: 2019-05-14
modified: 2025-02-23
type: Concept
in scheme: v3
change note: Version 4.1.0

White queer people
preferred label: Personas queer blancas @es
alternative label: Caucasian queer people
alternative label: Queer Caucasian people
alternative label: Queer white people
alternative label: Personas caucásicas queer @es
alternative label: Personas queer caucásicas @es
alternative label: Personas blancas queer @es
comment: Queer people who are white.
comment: Personas queer que son blancas. @es
broader: White LGBTQ+ people
has top concept: White LGBTQ+ people
replaces: queerWhitePeople
issued: 2019-05-14
modified: 2025-02-23
type: Concept
in scheme: v3
change note: Version 4.1.0

Queer women
preferred label: Mujeres queer @es
comment: Women who identify as queer.
comment: Mujeres que se identifican como queer. @es
broader: Queer people
related: Lesbians
has top concept: LGBTQ+ people
replaces: queerWomen
issued: 2019-05-14
modified: 2025-02-23
type: Concept
in scheme: v3
change note: Version 4.1.0

Queer youth literature
preferred label: Literatura juvenil queer @es
comment: Written literary works for an audience of readers from 12-18 years of age, also known as young adult literature or YA; use in reference to youth literature focusing on queer characters or themes.
comment: Obras literarias escritas para una audiencia de lectores de 12 a 18 años de edad, también conocidas como literatura para adultos jóvenes o YA (por sus siglas en inglés); utilícese en referencia a la literatura juvenil que se centra en personajes o temas queer. @es
broader: LGBTQ+ youth literature
related: Queer youth
has top concept: Subcultures
replaces: queerYouthLiterature
issued: 2019-05-14
modified: 2025-02-23
type: Concept
in scheme: v3
change note: Version 4.1.0

Queerphobia
preferred label: Queerfobia @es
comment: Antagonism or disgust directed towards queerness as an identity or queer people due to their identity, perceived or actual. Queerphobia can include denial of the existence of queerness, stereotypes, verbal harassment, and physical violence.
comment: Antagonismo o disgusto dirigido hacia lo queer como identidad o hacia las personas queer debido a su identidad, percibida o real. La queerfobia puede incluir la negación de la existencia de lo queer, estereotipos, acoso verbal y violencia física. @es
broader: LGBTQ+ phobia
narrower: Internalized queerphobia
related: Anti-queer discrimination
related: Anti-queer violence
related: Heterosexism
related: Queer people
has top concept: LGBTQ+ phobia
replaces: queerphobia
issued: 2019-05-14
modified: 2025-02-23
type: Concept
in scheme: v3
change note: Version 4.1.0

Radical feminism
preferred label: Feminismo radical @es
comment: Perspective within feminism that calls for a radical reordering of society in which male supremacy is eliminated in all social and economic contexts.
comment: Perspectiva dentro del feminismo que exige un reordenamiento radical de la sociedad en la que se elimine la supremacía masculina en todos los contextos sociales y económicos. @es
broader: Feminism
related: Social privilege
related: Womyn
related: Radical feminists
has top concept: Feminism
replaces: radicalFeminism
issued: 2019-05-14
modified: 2025-02-23
type: Concept
in scheme: v3
change note: Version 4.1.0

LGBTQ+ radio
preferred label: Radio LGBTQ+ @es
alternative label: Radio (LGBTQ)
comment: Auditory content broadcast on the radio (analog or digital) about LGBTQ+ people and/or LGBTQ+ issues.
comment: Contenido auditivo emitido en radio (analógica o digital) sobre personas LGBTQ+ y/o asuntos LGBTQ+. @es
narrower: Bisexual radio
narrower: Gay radio
narrower: Lesbian radio
narrower: Queer radio
narrower: Transgender radio
narrower: Asexual radio
narrower: Intersex radio
related: Two-Spirit radio
replaces: radioLGBTQ
issued: 2019-05-14
modified: 2026-02-23
type: Concept
in scheme: v3
change note: Version 4.1.0

Rainbow flags
preferred label: Banderas arcoíris @es
alternative label: Baker flags
comment: Rainbow-striped flags that symbolize LGBTQ+ pride and LGBTQ+ social movements. The first rainbow pride flag, which had eight colors, was created by Gilbert Baker, Lynn Segerblom, and others in San Francisco, California in 1978. Due to difficulties obtaining hot pink fabric and a desire for an even number of stripes, Baker modified his design in 1979 to contain six colors. The six-color version of the flag has been the most popular design since then.
comment: Banderas con franjas arcoíris que simbolizan el orgullo LGBTQ+ y los movimientos sociales LGBTQ+. La primera bandera arcoíris de orgullo fue creada por Gilbert Baker en 1978. @es
broader: LGBTQ+ pride flags
has top concept: LGBTQ+ symbols
replaces: rainbowFlags
issued: 2019-05-14
modified: 2025-02-23
type: Concept
in scheme: v3
change note: Version 4.1.0

Reading (Gender)
preferred label: Lectura (género) @es
alternative label: Reading (Transgender)
alternative label: Lectura (transgénero) @es
alternative label: Reading (género) @es
comment: Slang term for the act of identifying (or reading) someone in public as trans, non-binary, crossdressing, or in drag. Unlike Clocking (Gender), which is typically understood as a threat (of violence or outing) against the person being clocked or read, Reading (Gender) refers to shared identification or recognized kinship between two individuals who are both gender minorities.
comment: Término del argot para el acto de identificar (o leer) a alguien en público como trans, no binario, transformista o en drag. A diferencia del fichaje (género), que normalmente se entiende como una amenaza (de violencia o sacar del armario) contra la persona que está siendo fichada o leída, la lectura (género) se refiere a la identificación compartida o el vínculo reconocido entre dos personas que pertenecen a minorías de género. @es
related: Crossdressing
related: Passing (Gender)
related: Transgender people
related: Reading (LGBTQ+ culture)
related: Queer coding
replaces: readingTransgender
issued: 2019-05-14
modified: 2025-02-23
type: Concept
in scheme: v3
change note: Version 4.1.0

Reciprocal in vitro fertilization
preferred label: Fertilización in vitro recíproca @es
preferred label: Reciprocal in vitro fertilisation
alternative label: Shared motherhood
alternative label: Maternidad compartida @es
comment: A medical procedure in which the egg of one partner is fertilized with donor sperm and then transferred to the uterus of the other partner to bring to term.
comment: Un procedimiento médico en el que el óvulo de una pareja se fertiliza con esperma de un donante y luego se transfiere al útero de la otra pareja para llevarlo a término. @es
broader: In vitro fertilization
has top concept: LGBTQ+ family planning
replaces: reciprocalInVitroFertilisation
issued: 2019-05-14
modified: 2025-02-23
type: Concept
in scheme: v3
change note: Version 4.1.0

Relationship satisfaction
preferred label: LGBTQ+ relationships
preferred label: Relaciones LGBTQ+ @es
is replaced by: homoit0001237
replaces: relationshipSatisfaction
replaces: relationshipsLGBTQ
issued: 2019-05-14
modified: 2022-10-13
modified: 2025-02-23
type: Concept
in scheme: v3
change note: Version 4.1.0
alternative label: Relationships (LGBTQ)
alternative label: Relaciones (LGBTQ) @es
comment: Ongoing connections (romantic, sexual, or platonic) between two or more LGBTQ+ people.
comment: Conexiones continuas (románticas, sexuales o platónicas) entre dos o más personas LGBTQ+. @es
narrower: Bisexual relationships
narrower: Butch-femme relationships
narrower: LGBTQ+ couples
narrower: Cross-cultural relationships
narrower: Friendships
narrower: Gay relationships
narrower: Heterosociality
narrower: Intergenerational relationships
narrower: Lesbian relationships
narrower: Queer relationships
narrower: Sexual relationships
narrower: Transgender relationships
narrower: Romantic relationships
narrower: Asexual relationships
narrower: Intersex relationships
narrower: Queerplatonic relationships
narrower: LGBTQ+ dating
related: Aromantic people
related: Domestic partnerships
related: Being in love
related: LGBTQ+ separation
related: LGBTQ+ partners
related: Significant others
related: Relationship orientation
related: Pairings in fandom
related: Two-Spirit relationships

Restraints
preferred label: Restricciones @es
comment: Binding tools, devices, and accessories such as handcuffs, legcuffs, ropes, chains, straps, or straitjackets.
comment: Objetos para atar como esposas, esposas, cuerdas, cadenas, correas o camisas de fuerza. @es
broader: Sex accessories
narrower: Straitjacket
narrower: Cuffs
related: Bondage
related: Leashes
related: Kink accessories
related: Mummification (Erotic)
related: Rope bondage
related: Gags
related: Hogtie
has top concept: Sex accessories
replaces: restraints
issued: 2019-05-14
modified: 2025-03-20
type: Concept
in scheme: v3
change note: Version 4.1.0

Risk behaviors
preferred label: Conductas de riesgo @es
preferred label: Risk behaviours
comment: Behaviors that may put someone at increased risk of contracting HIV or STIs.
comment: Comportamientos que pueden poner a alguien en mayor riesgo de contraer VIH o ITS. @es
narrower: Barebacking
narrower: Bugchasing
related: Safer sex
related: Sexual behavior change
replaces: riskBehaviours
issued: 2019-05-14
modified: 2025-02-23
type: Concept
in scheme: v3
change note: Version 4.1.0

Ritual homosexuality
preferred label: Homosexualidad ritual @es
comment: Non-reciprocal genital contact, typically fellatio, between younger and older men that takes place during initiation rituals practiced by the Sambari people of Papua New Guinea. This term was developed by Western outsiders and has been strongly criticized by the affected community.
comment: Contacto genital no recíproco, típicamente felación, entre hombres jóvenes y mayores que ocurre durante los rituales de iniciación practicados por el pueblo simbari de Papúa Nueva Guinea. Este término fue desarrollado por extranjeros occidentales y ha sido fuertemente criticado por la comunidad afectada. @es
broader: Homosexuality
broader: Sexual practices
related: Indigenous LGBTQ+ people
has top concept: Sexual orientation
replaces: ritualHomosexuality
issued: 2019-05-14
modified: 2025-02-23
type: Concept
in scheme: v3
change note: Version 4.1.0

Role behavior
preferred label: Comportamiento de rol @es
preferred label: Role behaviour
comment: Behavior determining one's response to a social situation, as influenced by social norms; internal and external expectations; and social sanctions and rewards.
comment: Comportamiento que determina la respuesta de cada persona a una situación social, influenciado por las normas sociales; expectativas internas y externas; y sanciones y recompensas sociales. @es
narrower: Gender roles
narrower: Sexual roles
related: Butch-femme relationships
related: Roleplay
related: Sexual identity
related: Social norms
related: Furries
related: Fursonas
related: Fursuits
related: Slash roleplay
replaces: roleBehaviour
issued: 2019-05-14
modified: 2025-02-23
type: Concept
in scheme: v3
change note: Version 4.1.0

Roleplay
preferred label: Juego de roles @es
comment: Practice in which one or more people take on a different identity or role to fulfill a desire or fantasy.
comment: Práctica en la que una o más personas asumen una identidad o rol diferente para cumplir un deseo o una fantasía. @es
broader: Sex (Act)
broader: Mind play
narrower: Age play
narrower: Gender swapping
narrower: Pups (Roleplay)
narrower: Medical play
narrower: Animal roleplay
related: Bootblacking
related: Role behavior
related: Sexual identity
related: Sexual roles
related: Furries
related: Fursuits
related: Slash roleplay
related: Power exchange
related: Uniform fetish
related: Rope bondage
related: Edge play
related: Abduction play
related: Consent play
has top concept: Sex (Act)
replaces: roleplay
issued: 2019-05-14
modified: 2025-02-23
type: Concept
in scheme: v3
change note: Version 4.1.0

Rope play
preferred label: Juego de cuerda @es
alternative label: Shibari
comment: Bondage involving the use of rope for sexual stimulation.
comment: Bondage que implica el uso de cuerdas para la estimulación sexual. @es
broader: Sex accessories
has top concept: Sex accessories
replaces: ropePlay
issued: 2019-05-14
modified: 2025-02-23
type: Concept
in scheme: v3
change note: Version 4.1.0

LGBTQ+ Roman Catholics
preferred label: Personas católico romanas LGBTQ+ @es
alternative label: Roman Catholics (LGBTQ)
alternative label: Católicos romanos (LGBTQ) @es
comment: LGBTQ+ people who are members of the Roman Catholic Church.
comment: Personas LGBTQ+ que son miembros de la Iglesia católica romana. @es
broader: LGBTQ+ Christians
narrower: Bisexual Roman Catholics
narrower: Gay Roman Catholics
narrower: Lesbian Roman Catholics
narrower: Queer Roman Catholics
narrower: Transgender Roman Catholics
narrower: Asexual Roman Catholics
narrower: Intersex Roman Catholics
has top concept: LGBTQ+ African religions
replaces: romanCatholicsLGBTQ
issued: 2019-05-14
modified: 2025-02-23
type: Concept
in scheme: v3
change note: Version 4.1.0

Romantic friendships
preferred label: Amistades románticas @es
comment: Very close but non-sexual relationships between friends, often involving a degree of physical closeness beyond that which is common in modern Western societies; this may include, for example, friends holding hands, cuddling, kissing, and/or sharing a bed.
comment: Relaciones muy estrechas pero no sexuales entre amigos, que a menudo implican un grado de cercanía física más allá de lo que es común en las sociedades occidentales modernas; esto puede incluir, por ejemplo, amigos tomados de la mano, abrazándose, besándose y/o compartiendo cama. @es
broader: Friendships
has top concept: Relationship satisfaction
replaces: romanticFriendships
issued: 2019-05-14
modified: 2025-02-23
type: Concept
in scheme: v3
change note: Version 4.1.0

Rubber and latex fetish
preferred label: Fetiche de goma y látex @es
alternative label: Rubber and latex sex
alternative label: Rubber sex
alternative label: Rubbersex
alternative label: Fetiche de goma @es
alternative label: Sexo de goma y látex| @es
comment: Eroticization of rubber, latex, and related materials.
comment: Erotización de la goma, el látex y materiales afines. @es
broader: BDSM
broader: Rubber and latex community
broader: Sex (Act)
broader: Sexual practices
broader: LGBTQ+ fashion
related: Inflation (Erotic)
related: Dollification
has top concept: Eroticism
replaces: rubberSex
issued: 2019-05-14
modified: 2025-02-23
type: Concept
in scheme: v3
change note: Version 4.1.0

Rubber and latex community
preferred label: Comunidad de goma y látex @es
alternative label: Rubber subculture
alternative label: Subcultura de goma @es
comment: Communities of people with an interest in rubber or latex materials for fashion and kink.
comment: Comunidades de personas interesadas en materiales de goma o látex para moda y kink. @es
broader: LGBTQ+ communities
broader: Subcultures
narrower: Rubber and latex fetish
narrower: Rubbermen
narrower: Rubberwomen
related: Leather community
related: Balloon kink
has top concept: LGBTQ+ communities
replaces: rubberSubculture
issued: 2019-05-14
modified: 2025-02-23
type: Concept
in scheme: v3
change note: Version 4.1.0

Rubbermen
comment: Men who have fetishes for or engage in fetish activities involving rubber and belong to the rubber community; frequently associated with U.S. LGBTQ+ subcultures.
comment: Hombres que tienen fetiches con o participan de actividades fetichistas relacionadas con la goma y pertenecen a la comunidad de la goma; frecuentemente asociados con las subculturas LGBTQ+ de EE. UU. @es
broader: Rubber and latex community
related: Rubberwomen
has top concept: LGBTQ+ communities
replaces: rubbermen
issued: 2019-05-14
modified: 2025-02-23
type: Concept
in scheme: v3
change note: Version 4.1.0

Rubberwomen
comment: Women who have fetishes for or engage in fetish activities involving rubber and belong to the rubber community; frequently associated with U.S. LGBTQ+ subcultures.
comment: Mujeres que tienen fetiches con o participan de actividades fetichistas relacionadas con la goma y pertenecen a la comunidad de la goma; frecuentemente asociadas con las subculturas LGBTQ+ de EE. UU. @es
broader: Rubber and latex community
related: Rubbermen
has top concept: LGBTQ+ communities
replaces: rubberwomen
issued: 2019-05-14
modified: 2025-02-23
type: Concept
in scheme: v3
change note: Version 4.1.0

Sadism
preferred label: Sadismo @es
comment: Erotic or sexual enjoyment of the application of pain or intense sensations. Derived from the literary works of the Marquis de Sade.
comment: Preferencia sexual o fetiche relacionado con la dominación o con diversas prácticas de BDSM, incluido el dolor, la humillación y el sufrimiento. Derivado de las obras literarias del Marqués de Sade. @es
broader: Sadomasochism
broader: Sexual preference
related: Masochism
related: Sexual identity
has top concept: Eroticism
replaces: sadism
issued: 2019-05-14
modified: 2025-02-23
type: Concept
in scheme: v3
change note: Version 4.1.0

Safer sex
preferred label: Sexo más seguro @es
comment: A set of practices aimed to minimize the risk of STI transmission, including but not limited to using condoms and dental dams, taking PrEP, and participating in regular STI testing.
comment: Un conjunto de prácticas destinadas a minimizar el riesgo de transmisión de ITS, que incluye, entre otras, el uso de condones y protectores dentales, la toma de PrEP y la participación en pruebas periódicas de ITS. @es
broader: Sex (Act)
broader: Sexual practices
related: AIDS education
related: Condoms
related: Dental dams
related: Latex gloves
related: Risk behaviors
related: Safer sex parties
related: Sexual behavior change
has top concept: Sex (Act)
replaces: saferSex
issued: 2019-05-14
modified: 2025-02-23
type: Concept
in scheme: v3
change note: Version 4.1.0

Safer sex parties
preferred label: Fiestas de sexo más seguro @es
comment: Social gatherings or events originating from Black lesbian communities in the Southern United States in the 1990s. Safer sex parties are typically held at private locations where organizers and participants discuss safer sex practices, sexuality, and sexual experiences.
comment: Encuentros o eventos sociales originados en comunidades de lesbianas negras en el sur de los Estados Unidos en la década de 1990. Las fiestas de sexo más seguro generalmente se llevan a cabo en lugares privados donde quienes organizan y participan discuten prácticas sexuales más seguras, la sexualidad y las experiencias sexuales. @es
broader: Sex parties
related: Safer sex
has top concept: Sex locations
replaces: saferSexParties
issued: 2019-05-14
modified: 2025-02-23
type: Concept
in scheme: v3
change note: Version 4.1.0

Sak veng
comment: Term used in Cambodia for people assigned male at birth who identify as women; translates to "long hairs."
comment: Término utilizado en Camboya para las personas asignadas al sexo masculino al nacer y que se autoidentifican como mujeres; se traduce como "cabellos largos". @es
broader: Non-Euro-American gender and sexual identities
related: Khteuy
related: Srey sros
has top concept: Gender
replaces: sakVeng
issued: 2019-05-14
modified: 2025-02-23
type: Concept
in scheme: v3
change note: Version 4.1.0

Same-gender-loving
preferred label: Amor del mismo género @es
alternative label: SGL
comment: Culturally affirming term for sexual identity that is often used to describe African American homosexual people.
comment: Término culturalmente afirmativo para la identidad sexual que se utiliza a menudo para describir a las personas homosexuales afroamericanas. @es
broader: Sexual identity
related: African American LGBTQ+ people
related: Men who have sex with men
related: Women who have sex with women
related: MLM (Men Loving Men)
related: WLW (Women Loving Women)
has top concept: Sexual identity
replaces: sameGenderLoving
issued: 2019-05-14
modified: 2025-02-23
type: Concept
in scheme: v3
change note: Version 4.1.0

Same-sex divorce
preferred label: Divorcio entre personas del mismo sexo @es
comment: A legal proceeding undertaken to dissolve a marriage between two individuals of the same sex.
comment: Procedimiento legal emprendido para disolver un matrimonio entre dos personas del mismo sexo. @es
broader: LGBTQ+ divorce
has top concept: Living arrangements
replaces: sameSexDivorce
issued: 2019-05-14
modified: 2025-02-23
type: Concept
in scheme: v3
change note: Version 4.1.0

Saris
comment: In Jewish culture, this term is used to refer to individuals who were assigned male at birth but later developed feminine characteristics.
comment: En la cultura judía, este término se utiliza para referirse a personas a quienes se les asignó al sexo masculino al nacer pero que luego desarrollaron características femeninas. @es
replaces: saris
issued: 2019-05-14
modified: 2025-03-13
type: Concept
in scheme: v3
change note: Version 4.1.0

Voyeurism
preferred label: Voyerismo @es
alternative label: Scopophilia
alternative label: Scoptophilia
alternative label: Voyeurismo @es
alternative label: Escopofilia @es
comment: Practice of watching or listening to others, typically without their awareness or consent. In consensual sexual encounters, voyeurism involves watching or listening to someone undress or engage in sexual activity without actively participating.
comment: Práctica de observar o escuchar a otras personas, generalmente sin su conocimiento o consentimiento. En los encuentros sexuales consensuales, el voyeurismo implica mirar o escuchar a alguien desvestirse o participar de una actividad sexual sin participar activamente. @es
broader: BDSM
broader: Sex (Act)
related: Exhibitionism
related: Public sex
has top concept: Eroticism
replaces: voyeurism
issued: 2019-05-14
modified: 2025-02-23
type: Concept
in scheme: v3
change note: Version 4.1.0

Sea queens
alternative label: Reinas del mar @es
comment: Term used before the 1960s to describe gay men who worked aboard ships, mainly merchant vessels.
comment: Término utilizado antes de la década de 1960 para describir a los hombres gay que trabajaban a bordo de barcos, principalmente buques mercantes. @es
broader: LGBTQ+ historical terms
related: Gay men
has top concept: LGBTQ+ historical terms
replaces: seaQueens
issued: 2019-05-14
modified: 2025-02-23
type: Concept
in scheme: v3
change note: Version 4.1.0

Secondary sex characteristics
preferred label: Características sexuales secundarias @es
comment: Features that appear during puberty that are not directly related to reproduction, like changes in the voice and the development of body hair.
comment: Características que aparecen durante la pubertad que no están directamente relacionadas con la reproducción, como cambios en la voz y el desarrollo del vello corporal. @es
broader: Sex (Body)
narrower: Breast
narrower: Fat distribution
narrower: Hair
narrower: Stature
narrower: Voice
has top concept: Sex (Body)
replaces: secondarySexCharacteristics
issued: 2019-05-14
modified: 2025-02-23
type: Concept
in scheme: v3
change note: Version 4.1.0

Second-wave feminism
preferred label: Feminismo de segunda ola @es
alternative label: Second wave feminism
comment: Period of feminist political activity (also referred to as women’s liberation) beginning in the early 1960s that critiqued male-dominated institutions and cultural practices in society.
comment: Período de actividad política feminista (también conocido como liberación de la mujer) que comenzó a principios de la década de 1960 y que criticó las instituciones y prácticas culturales dominadas por los hombres en la sociedad. @es
broader: Feminism
related: Trans-exclusionary radical feminism
related: Second-wave feminists
has top concept: Feminism
replaces: secondWaveFeminism
issued: 2019-05-14
modified: 2025-02-23
type: Concept
in scheme: v3
change note: Version 4.1.0

Secrecy
preferred label: Discreción @es
alternative label: Secretismo @es
comment: The state of being intentionally withheld, concealed, or kept secret; use in reference to LGBTQ+ individuals who conceal their (or others’) identities, whether out of preference or for safety reasons.
comment: El estado retener(se), ocultar(se) o mantener(se) en secreto intencionalmente; utilícese en referencia a personas LGBTQ+ que ocultan sus identidades (o las de otras personas), ya sea por preferencia o por razones de seguridad. @es
related: Closeted bisexual people
related: Closeted gay men
related: Closeted lesbians
related: Stealth (Transgender)
related: Coming out
related: Down-low
related: Outing (LGBTQ+ culture)
related: Closeted LGBTQ+ people
related: Closeted transgender people
related: Closeted queer people
related: Closeted intersex people
related: Closeted Two-Spirit people
related: Beards (Gay culture)
related: Closeted asexual people
replaces: secrecy
issued: 2019-05-14
modified: 2025-02-23
type: Concept
in scheme: v3
change note: Version 4.1.0

Seduction
preferred label: Seducción @es
alternative label: Temptation
alternative label: Tentación @es
comment: Enticing or tempting someone into something, typically sexual attraction or activity, through the use of persuasion, flattery, and/or promises.
comment: Atraer o tentar a alguien a algo, generalmente atracción o actividad sexual, mediante el uso de persuasión, halagos y/o promesas. @es
related: Sexuality
replaces: seduction
issued: 2019-05-14
modified: 2025-02-23
type: Concept
in scheme: v3
change note: Version 4.1.0

Sekhet
alternative label: Sht @egy
comment: Egyptian term that refers to a range of people of non-normative gender and sexual identities, including gay people, eunuchs, trans people, etc. Only use to describe people who self-identify as sekhet.
comment: Término egipcio que se refiere a una variedad de personas con identidades sexuales y de género no normativas, incluidos hombres gay, eunucos, personas trans, etc. Utilícese únicamente para describir a personas que se autoidentifiquen como sekhet. @es
broader: Non-Euro-American gender and sexual identities
has top concept: Gender
replaces: sekhet
issued: 2019-05-14
modified: 2025-02-23
type: Concept
in scheme: v3
change note: Version 4.1.0

Sekrata
comment: In Madagascar, this term refers to people of a third gender who were assigned male at birth and present feminine characteristics.
comment: En Madagascar, este término se refiere a las personas de un tercer género a las que se les asignó al sexo masculino al nacer y presentan características femeninas. @es
broader: Non-Euro-American gender and sexual identities
has top concept: Gender
replaces: sekrata
issued: 2019-05-14
modified: 2025-02-23
type: Concept
in scheme: v3
change note: Version 4.1.0

Self-insemination
preferred label: Autoinseminación @es
comment: The practice of using collected sperm to induce one's own pregnancy outside of a clinical environment.
comment: La práctica de utilizar esperma recolectado para inducir el propio embarazo fuera de un entorno clínico. @es
broader: Insemination
broader: Conception by LGBTQ+ people
broader: Assisted reproduction
has top concept: LGBTQ+ family planning
replaces: self-insemination
issued: 2019-05-14
modified: 2025-02-23
type: Concept
in scheme: v3
change note: Version 4.1.0

Sex accessories
preferred label: Accesorios sexuales @es
comment: Objects, devices, or articles of clothing used for sexual stimulation or to enhance sexual pleasure and experiences.
comment: Objetos, dispositivos o prendas de vestir utilizadas para la estimulación sexual o para mejorar el placer y las experiencias sexuales. @es
narrower: Anal beads
narrower: Ballgags
narrower: Blindfolds
narrower: Sex dolls
narrower: Butt plugs
narrower: Clit rings
narrower: Cock rings
narrower: Enemas
narrower: Collars
narrower: Condoms
narrower: Dental dams
narrower: Dildo harnesses
narrower: Dildos
narrower: Floggers
narrower: Harnesses
narrower: Latex gloves
narrower: Leashes
narrower: Lingerie
narrower: Lubricants
narrower: Nipple clamps
narrower: Spanking paddles
narrower: Restraints
narrower: Rope play
narrower: Vibrators
narrower: Whips
narrower: Violet wands
narrower: Jockstraps
narrower: Sex swings
narrower: Gloves (Erotic)
narrower: Gas masks (Erotic)
narrower: Body bags (Erotic)
narrower: Clamps (Erotic)
narrower: Clothespins (Erotic)
narrower: Hoods (Erotic)
narrower: Masks (Erotic)
related: Sex shops
related: Sex (Act)
related: Sexual practices
related: Sexuality
related: Kink accessories
replaces: sexAccessories
issued: 2019-05-14
modified: 2025-03-20
type: Concept
in scheme: v3
change note: Version 4.1.0

Sex (Act)
preferred label: Sexo (acto) @es
comment: The act of engaging in a physical and/or mental interaction with another person or object with the specific intent to elicit sexual arousal or climax.
comment: El acto de participar en una interacción física y/o mental con otra persona u objeto con la intención específica de provocar excitación sexual o clímax. @es
narrower: Anal sex
narrower: Rimming
narrower: Autoerotic asphyxiation
narrower: Anal play
narrower: Fellatio
narrower: Cunnilingus
narrower: Clitoral sex
narrower: Enemas
narrower: Cottaging (Gay culture)
narrower: Cruising (LGBTQ+ culture)
narrower: Erotic massage
narrower: Frottage
narrower: Fucking
narrower: Getting laid
narrower: Oral sex
narrower: Urine play
narrower: Sexual intercourse
narrower: Kissing
narrower: Manual sex
narrower: Masturbation
narrower: Mud sex
narrower: Mutual masturbation
narrower: Tantric sex
narrower: Nipple play
narrower: Phallic sex
narrower: Phone sex
narrower: Roleplay
narrower: Rubber and latex fetish
narrower: Safer sex
narrower: Voyeurism
narrower: Sexting
narrower: Sexual abstinence
narrower: Strap-on sex
narrower: Vaginal sex
narrower: Scissoring
narrower: Tribadism
narrower: Chemsex
narrower: Orgasm control
narrower: Douching
narrower: Breast play
narrower: Chest play
related: Consent
related: BDSM
related: Handkerchief codes
related: Libido
related: Sex locations
related: Sex accessories
related: Sexual excitement
related: Sexual function
related: Sexuality
related: Situational sexual behavior
related: Sodomy
related: Yiff
replaces: sexAct
issued: 2019-05-14
modified: 2025-03-20
type: Concept
in scheme: v3
change note: Version 4.1.0

Sex assigned at birth
preferred label: Sexo asignado al nacer @es
alternative label: Birth sex
alternative label: Birth-assigned sex
alternative label: Natal sex
alternative label: Sex at birth
alternative label: Sex reported at birth
alternative label: ASAB
alternative label: SAAB
alternative label: Asignación de sexo @es
alternative label: Sexo al nacer @es
comment: The process of determining an individual’s sex relatively shortly after birth, usually documented on official records, such as a birth certificate. Determination is usually based on the appearance of external genitalia but may use other methodologies. In practice, sex assigned at birth is often culturally variable; the term “gender assigned at birth” is often more applicable or accurate.
comment: El proceso de determinar el sexo de una persona relativamente poco después del nacimiento, generalmente documentado en registros oficiales, como un certificado de nacimiento. La determinación suele basarse en la apariencia de los genitales externos, pero puede utilizar otras metodologías. En la práctica, el sexo asignado al nacer suele variar culturalmente; el término “género asignado al nacer” suele ser más aplicable o preciso. @es
broader: Assigned sex
narrower: Assigned female at birth
narrower: Assigned male at birth
narrower: Assigned X at birth
related: Gender assigned at birth
related: Genitals
related: Gonads
related: Intersex children
related: Intersex variations
related: Intersex genital mutilation
related: Medicalization
related: Penis
related: Vagina
related: Endosex
related: Endosex people
has top concept: Sex (Body)
replaces: sexAssignedAtBirth
issued: 2019-05-14
modified: 2025-02-23
type: Concept
in scheme: v3
change note: Version 4.1.0

Sex (Body)
preferred label: Sexo (cuerpo) @es
comment: The category assigned to an individual to describe their body and its role in sexual reproduction, usually based on external anatomy, but also including chromosomes, gene expression, hormones, and internal and external reproductive/sexual organs. Although sex is often described as binary, it exists as a spectrum with significant variation in the biological attributes that comprise sex and the way it is defined in different cultural contexts.
comment: La categoría asignada a una persona para describir su cuerpo y su papel en la reproducción sexual, generalmente basada en la anatomía externa, pero que también incluye cromosomas, expresión genética, hormonas y órganos reproductivos/sexuales internos y externos. Aunque el sexo a menudo se describe como binario, existe como un espectro con variaciones significativas en los atributos biológicos que lo componen y la forma en que se define en diferentes contextos culturales. @es
narrower: Chromosomes
narrower: Intersex
narrower: Genitals
narrower: Gonads
narrower: Hormones
narrower: Secondary sex characteristics
narrower: Assigned sex
narrower: Endosex
related: Gender
replaces: sexBody
issued: 2019-05-14
modified: 2025-02-23
type: Concept
in scheme: v3
change note: Version 4.1.0

Sex clubs
preferred label: Clubs de sexo @es
alternative label: Clubes sexuales @es
comment: Establishments where patrons can engage in sex with other patrons, as well as formal or informal groups that organize sex-related activities.
comment: Establecimientos en los que los clientes pueden mantener relaciones sexuales con otros clientes, así como grupos formales o informales que organizan actividades relacionadas con el sexo. @es
broader: Sex industry
related: Dark rooms
related: Gay saunas
related: Sex parties
related: Play spaces
has top concept: Sex industry
replaces: sexClubs
issued: 2019-05-14
modified: 2025-02-23
type: Concept
in scheme: v3
change note: Version 4.1.0

Sex education
preferred label: Educación sexual @es
comment: Instruction about sexual health and sexuality, including topics such as consent, safer sex, transmission of STIs, and reproduction.
comment: Instrucción sobre la salud sexual y la sexualidad, incluyendo temas como consentimiento, sexo más seguro, transmisión de ITS y reproducción. @es
broader: Information provision
related: AIDS education
has top concept: Information provision
replaces: sexEducation
issued: 2019-05-14
modified: 2025-02-23
type: Concept
in scheme: v3
change note: Version 4.1.0

Sex parties
preferred label: Fiestas sexuales @es
comment: Social gatherings or events, typically held in private residences or at sex clubs, in which participants engage in or observe group sexual activities.
comment: Encuentros o eventos sociales, generalmente celebrados en residencias privadas o en clubes sexuales, donde quienes participan forman parte de u observan actividades sexuales grupales. @es
broader: Sex locations
narrower: Safer sex parties
related: Dark rooms
related: Casual sex
related: Group sex
related: Sex clubs
related: Sexuality
related: Leather and kink conventions
has top concept: Sex locations
replaces: sexParties
issued: 2019-05-14
modified: 2025-02-23
type: Concept
in scheme: v3
change note: Version 4.1.0

Sex scandals
preferred label: Escándalos sexuales @es
alternative label: Sexual scandals
alternative label: Escándalos de sexo @es
comment: Public scandals surrounding sensational cases of sexual indecency or sex crimes.
comment: Escándalos públicos en torno a casos sensacionales de indecencia sexual o delitos sexuales. @es
related: LGBTQ+ social processes
replaces: sexScandals
issued: 2019-05-14
modified: 2025-02-23
type: Concept
in scheme: v3
change note: Version 4.1.0

Sex therapy
preferred label: Terapia sexual @es
comment: A form of counseling intended to address sexual dysfunction and other sex-related issues.
comment: Una forma de consejería destinada a abordar la disfunción sexual y otras cuestiones relacionados con el sexo. @es
broader: Therapies
related: Sexual dysfunction
has top concept: Medical care
replaces: sexTherapy
issued: 2019-05-14
modified: 2025-02-23
type: Concept
in scheme: v3
change note: Version 4.1.0

Sex tourism
preferred label: Turismo sexual @es
comment: The practice of traveling with the intention of soliciting sex work, typically to countries where sex work is legal, decriminalized, or less stigmatized. Sex tourism often presents ethical concerns, such as the economic gap between tourists and residents, differences in age of consent laws globally, and the selective enforcement of anti-sex work laws by police.
comment: La práctica de viajar con la intención de solicitar trabajo sexual, normalmente a países donde el trabajo sexual es legal, está despenalizado o menos estigmatizado. El turismo sexual suele plantear problemas éticos, como la brecha económica entre turistas y residentes, las diferencias en las leyes sobre la edad de consentimiento en todo el mundo y la aplicación selectiva de las leyes contra el trabajo sexual por parte de la policía. @es
broader: Sex industry
narrower: LGBTQ+ sex tourism
related: Sex work
has top concept: Sex industry
replaces: sexTourism
issued: 2019-05-14
modified: 2025-02-23
type: Concept
in scheme: v3
change note: Version 4.1.0

Sex work
preferred label: Trabajo sexual @es
alternative label: Prostitution
comment: The exchange of sexual services, performances, or companionship for money or goods. Use to describe the broad spectrum of sex work, and use more specific terms if possible. For individuals who perform sex work, use "Sex workers" or narrower terms. For sex work undertaken by individuals who cannot or have not consented, use "Sex trafficking."
comment: El intercambio de servicios, actuaciones o productos sexuales a cambio de una compensación material; incluye actividades que implican contacto físico directo entre quienes compran y quienes venden, así como estimulación sexual indirecta. @es
broader: Sex industry
narrower: Escort services
narrower: Phone sex work
narrower: Stripping
narrower: Cam modeling
narrower: Street sex work
narrower: Survival sex work
narrower: Sugaring
narrower: Gay for pay
related: Sex tourism
related: Sex trafficking
related: Sex workers
has top concept: Sex industry
replaces: sexWork
issued: 2019-05-14
modified: 2025-02-23
type: Concept
in scheme: v3
change note: Version 4.1.0

LGBTQ+ sex workers
preferred label: Trabajadores sexuales LGBTQ+ @es
alternative label: LGBTQ+ prostitutes
alternative label: LGBTQ+ prostitution
alternative label: LGBTQ+ sex work
alternative label: Prostitutes (LGBTQ)
alternative label: Prostitution (LGBTQ)
alternative label: Sex work (LGBTQ)
alternative label: Trabajadores sexuales LGBTQ @es
alternative label: Prostitutos LGBTQ+ @es
alternative label: Prostitutas LGBTQ+ @es
alternative label: Prostitutxs LGBTQ+ @es
alternative label: Trabajo sexual LGBTQ+ @es
comment: LGBTQ+ people who receive money or goods in exchange for sexual services, performances, or companionship. Use to describe LGBTQ+ people working across the broad spectrum of sex work.
comment: Personas LGBTQ+ que reciben dinero o bienes a cambio de servicios o actuaciones sexuales. Utilícese para describir a las personas LGBTQ+ que trabajan en el amplio espectro del trabajo sexual. @es
broader: Sex workers
broader: LGBTQ+ people
narrower: Bisexual sex workers
narrower: Gay sex workers
narrower: Lesbian sex workers
narrower: Queer sex workers
narrower: Transgender sex workers
narrower: Intersex sex workers
narrower: Non-binary sex workers
narrower: LGBTQ+ strippers
narrower: LGBTQ+ porn stars
related: LGBTQ+ sex tourism
related: Two-Spirit sex workers
related: Māhū sex workers
has top concept: Sex workers
replaces: sexWorkersLGBTQ
issued: 2019-05-14
modified: 2025-02-23
type: Concept
in scheme: v3
change note: Version 4.1.0

Sexism
preferred label: Sexismo @es
comment: Discrimination, prejudice, or bias directed against a particular sex or gender based on the assumption that this sex or gender is intrinsically inferior to another.
comment: Discriminación, prejuicio o predisposición dirigida contra un sexo o género en particular basado en el supuesto de que ese sexo o género es intrínsecamente inferior a otro. @es
related: Genderism
related: Heterosexism
related: Sexual harassment
related: Misogyny in fandom
related: Gender-neutral language
related: Patriarchy
replaces: sexism
issued: 2019-05-14
modified: 2025-02-23
type: Concept
in scheme: v3
change note: Version 4.1.0

Sexologists
preferred label: Sexólogos @es
comment: People who professionally study sexology, or human sexual behavior and sexual relationships.
comment: Personas que estudian profesionalmente la sexología, o el comportamiento sexual humano y las relaciones sexuales. @es
related: Sexology
replaces: sexologists
issued: 2019-05-14
modified: 2025-02-23
type: Concept
in scheme: v3
change note: Version 4.1.0

Sexology
preferred label: Sexología @es
comment: Scientific study of human sexuality including sexual interests, behaviors, and functions that utilizes tools from other academic fields like anthropology, biology, medicine, and psychology.
comment: Estudio científico de la sexualidad humana, incluidos los intereses, comportamientos y funciones sexuales, y que utiliza herramientas de otras áreas académicas como la antropología, la biología, la medicina y la psicología. @es
related: Sexologists
related: Sexuality
related: Sexual studies
replaces: sexology
issued: 2019-05-14
modified: 2025-04-24
type: Concept
in scheme: v3
change note: Version 4.1.0

Sexting
preferred label: Sextear @es
comment: Act of sending sexually explicit messages or photographs, primarily between mobile phones.
comment: Acto de enviar mensajes o fotografías sexualmente explícitas, principalmente entre teléfonos móviles. @es
broader: Sex (Act)
related: Pornography
related: Sexuality
has top concept: Sex (Act)
replaces: sexting
issued: 2019-05-14
modified: 2025-02-23
type: Concept
in scheme: v3
change note: Version 4.1.0

Sexual abstinence
preferred label: Abstinencia sexual @es
comment: Practice of abstaining or not participating in some or all forms of sexual activity, whether for medical, psychological, social, moral, or religious reasons. Sexual abstinence may be voluntary or involuntary.
comment: Práctica de abstenerse o no participar en algunas o todas las formas de actividad sexual, ya sea por razones médicas, psicológicas, sociales, morales o religiosas. La abstinencia sexual puede ser voluntaria o involuntaria. @es
broader: Sex (Act)
narrower: Virginity
related: Asexuality
related: Celibacy
related: Sexuality
has top concept: Sex (Act)
replaces: sexualAbstinence
issued: 2019-05-14
modified: 2025-02-23
type: Concept
in scheme: v3
change note: Version 4.1.0

LGBTQ+ people with sexual addictions
preferred label: Personas LGBTQ+ con adicciones sexuales @es
alternative label: LGBTQ+ people with sex addictions
comment: LGBTQ+ people experiencing addiction to or dependency upon sexual activities. Only use to refer to individuals who describe themselves as having sexual addictions, not individuals whose sexual practices are perceived as promiscuous or unsafe by others.
comment: Personas LGBTQ+ que experimentan una adicción o dependencia a actividades sexuales. Utilícese únicamente para referirse a personas que se describen a sí mismas como adictas sexuales, no a personas cuyas prácticas sexuales son percibidas como promiscuas o inseguras por otras personas. @es
broader: LGBTQ+ people with addictions
narrower: LGBTQ+ people with internet sex addictions
related: Exhibitionism
related: Hypersexuality
related: Erotomania
has top concept: LGBTQ+ people
replaces: sexualAddiction
issued: 2019-05-14
modified: 2025-02-23
type: Concept
in scheme: v3
change note: Version 4.1.0

Sexual excitement
preferred label: Excitación sexual @es
alternative label: Sexual arousal
comment: Term describing the physiological and psychological response to sexual stimulation.
comment: Término que describe la respuesta fisiológica y psicológica a la estimulación sexual. @es
broader: Hypersexuality
related: Cum
related: Eroticism
related: Getting off
related: Happy endings
related: Jizz
related: Libido
related: Sex (Act)
related: Sexual climax
related: Sexual dysfunction
related: Sexual function
related: Sexuality
related: Homoeroticism
has top concept: Hypersexuality
replaces: sexualExcitement
issued: 2019-05-14
modified: 2025-03-20
type: Concept
in scheme: v3
change note: Version 4.1.0

Sexual assault
preferred label: Agresión sexual @es
comment: Sexual behavior or contact targeting an individual who has not consented; includes nonconsensual sex acts that may not be illegal or punishable by law in the given location or time period.
comment: Comportamiento o contacto sexual dirigido a una persona que no ha dado su consentimiento; incluye actos sexuales no consensuales que pueden no ser ilegales o punibles por la ley en un lugar o período de tiempo determinados. @es
broader: Sexual violence
related: LGBTQ+ domestic violence
related: Rape culture
has top concept: Sexual violence
replaces: sexualAssault
issued: 2019-05-14
modified: 2025-02-23
type: Concept
in scheme: v3
change note: Version 4.1.0

Sexual autonomy
preferred label: Autonomía sexual @es
comment: One’s ability or prerogative to freely choose when, with whom, and under what circumstances they engage in sexual activity or relationships.
comment: La capacidad o prerrogativa de una persona para elegir libremente cuándo, con quién y bajo qué circunstancias participar en actividades o relaciones sexuales. @es
related: Sexual preference
related: Sexuality
replaces: sexualAutonomy
issued: 2019-05-14
modified: 2025-02-23
type: Concept
in scheme: v3
change note: Version 4.1.0

Sexual behavior change
preferred label: Cambio de comportamiento sexual @es
preferred label: Sexual behaviour change
comment: Term used to describe changes in behavior related to safer sexual practices (e.g., condom use, STI testing).
comment: Término utilizado para describir cambios en el comportamiento relacionados con prácticas sexuales más seguras (por ejemplo, uso de condones, pruebas de ITS). @es
related: Risk behaviors
related: Safer sex
related: Sexual preference
replaces: sexualBehaviourChange
issued: 2019-05-14
modified: 2025-02-23
type: Concept
in scheme: v3
change note: Version 4.1.0

Sexual climax
preferred label: Clímax sexual @es
comment: The most intense or highest point of pleasure in sexual activities; the peak of an orgasm.
comment: El punto de placer más intenso o más alto en las actividades sexuales; el pico de un orgasmo. @es
related: Cum
related: Getting off
related: Happy endings
related: Jizz
related: Sexual excitement
replaces: sexualClimax
issued: 2019-05-14
modified: 2025-03-20
type: Concept
in scheme: v3
change note: Version 4.1.0

Sexual offenses laws
preferred label: Leyes sobre delitos sexuales @es
alternative label: Sexual criminal codes
alternative label: Códigos criminales sexuales @es
comment: Legislation determining the kinds of sexual behaviors and activities that are legally permissible. Laws vary by jurisdiction but typically address crimes like sexual coercion, sexual assault, incest, and sex trafficking. Historically and in the present day, sexual offenses laws have also served to criminalize consensual but non-normative sexual practices, such as anal sex and homosexuality.
comment: Legislación que determina los tipos de conductas y actividades sexuales que están legalmente permitidas. Las leyes varían según la jurisdicción, pero normalmente abordan delitos como la coerción sexual, la agresión sexual, el incesto y el tráfico sexual. Históricamente y en la actualidad, las leyes sobre delitos sexuales también han servido para criminalizar prácticas sexuales consensuales pero no normativas, como el sexo anal y la homosexualidad. @es
broader: Criminal law
narrower: Sodomy laws
related: Age of consent
related: Police interactions with LGBTQ+ people
has top concept: Law
replaces: sexualOffencesLaws
issued: 2019-05-14
modified: 2025-02-23
type: Concept
in scheme: v3
change note: Version 4.1.0

Sexual diversity
preferred label: Diversidad sexual @es
comment: Diversity of sexual orientation or sexuality among members of a group or within a given society.
comment: Diversidad de orientación sexual o sexualidad entre miembros de un grupo o dentro de una sociedad determinada. @es
broader: Diversity
narrower: Polysexuality
related: LGBTQ+
related: Sexual function
related: Sexual identity
related: Sexual orientation
related: Sexual preference
related: Monosexuality
has top concept: Diversity
replaces: sexualDiversity
issued: 2019-05-14
modified: 2025-02-23
type: Concept
in scheme: v3
change note: Version 4.1.0

Sexual dysfunction
preferred label: Disfunción sexual @es
alternative label: Sexual malfunction
alternative label: Disfuncionalidad sexual @es
comment: Recurring problems or difficulties with sexual response, desire, or pleasure. Includes dysfunction occurring at any time in the sexual response cycle that causes distress or prevents one’s typical sexual function.
comment: Problemas o dificultades recurrentes con la respuesta, el deseo o el placer sexual. Incluye la disfunción que ocurre en cualquier momento del ciclo de respuesta sexual y que causa angustia o impide la función sexual típica. @es
narrower: Erectile dysfunction
narrower: Vaginismus
related: Sex therapy
related: Sexual excitement
related: Sexual function
related: Sexual health
related: Sexuality
replaces: sexualDysfunction
issued: 2019-05-14
modified: 2025-02-23
type: Concept
in scheme: v3
change note: Version 4.1.0

Sexual function
preferred label: Función sexual @es
comment: The process by which an individual's body experiences and reacts to sexual stimuli.
comment: El proceso por el cual el cuerpo de una persona experimenta y reacciona a estímulos sexuales. @es
broader: Sexual orientation
related: Libido
related: Sex (Act)
related: Sexual excitement
related: Sexual diversity
related: Sexual dysfunction
related: Sexual health
related: Sexuality
has top concept: Sexual orientation
replaces: sexualFunction
issued: 2019-05-14
modified: 2025-02-23
type: Concept
in scheme: v3
change note: Version 4.1.0

Sexual harassment
preferred label: Acoso sexual @es
comment: Unwelcome behavior of a sexual nature, including unwanted advances or requests for sexual favors.
comment: Comportamiento no deseado de naturaleza sexual, incluidos insinuaciones no deseadas o pedidos de favores sexuales. @es
broader: Harassment
related: Anti-LGBTQ+ violence
related: Intimate partner violence
related: Sexism
has top concept: Harassment
replaces: sexualHarassment
issued: 2019-05-14
modified: 2025-02-23
type: Concept
in scheme: v3
change note: Version 4.1.0

Sexual health
preferred label: Salud sexual @es
comment: State of physical, emotional, mental, and social well being in relation to sexuality. This includes one’s ability to have responsible, satisfying, and safer sex free of violence or coercion.
comment: Estado de bienestar físico, emocional, mental y social en relación con la sexualidad. Esto incluye la capacidad de tener relaciones sexuales responsables, satisfactorias y seguras, libres de violencia o coerción. @es
related: AIDS education
related: Sexual dysfunction
related: Sexual function
replaces: sexualHealth
issued: 2019-05-14
modified: 2025-02-23
type: Concept
in scheme: v3
change note: Version 4.1.0

Sexual identity
preferred label: Identidad sexual @es
comment: How an individual understands their identity in relation to their romantic or sexual attraction to other people.
comment: Cómo una persona entiende su identidad en relación con su atracción romántica o sexual hacia otras personas. @es
narrower: Banjees
narrower: Bears (Gay culture)
narrower: Bisexual identity
narrower: Bottoms (Sex)
narrower: Butches
narrower: Chubs (Gay culture)
narrower: Dandies
narrower: Demisexual people
narrower: Femmes
narrower: Gay identity
narrower: Heterosexual identity
narrower: Lesbian identity
narrower: LGBTQ+ dominants
narrower: LGBTQ+ mistresses (BDSM culture)
narrower: Otters (Gay culture)
narrower: Pederasts
narrower: Pups (Roleplay)
narrower: Queer identity
narrower: Same-gender-loving
narrower: LGBTQ+ submissives
narrower: Soft butches
narrower: Stone butches
narrower: Switches (Sex)
narrower: Tops (Sex)
narrower: Twinks (Gay culture)
narrower: Wolves (Gay culture)
narrower: Polysexuality
narrower: Megasexuality
narrower: Vers (Sex)
narrower: Pansexuality
narrower: Sapphic identity
narrower: Kinky people
narrower: Ky-ky (Gender role)
related: Sadomasochism
related: Ball culture
related: Essentialism
related: Butch-femme relationships
related: Cross-cultural relationships
related: Non-Euro-American gender and sexual identities
related: Decadence
related: Lesbian culture
related: BDSM
related: Fuck buddies
related: Gay culture
related: Gender identity
related: Intergenerational relationships
related: Masochism
related: Monogamy
related: Partner preference
related: Polyamory
related: Polygamy
related: Role behavior
related: Roleplay
related: Sadism
related: Sexual diversity
related: Sexual orientation
related: Sexual preference
related: Sexual roles
related: Transgender culture
related: Monosexuality
related: Passing (Sexuality)
related: Monosexual people
replaces: sexualIdentity
issued: 2019-05-14
modified: 2025-03-20
type: Concept
in scheme: v3
change note: Version 4.1.0

Sexual inversion
preferred label: Inversión sexual @es
comment: Historical term for homosexuality used by sexologists to refer to an inborn reversal of gender traits or roles. Only use in historical contexts.
comment: Término histórico para la homosexualidad utilizado por sexólogos para referirse a una inversión innata de rasgos o roles de género. Utilícese únicamente en contextos históricos. @es
broader: LGBTQ+ historical terms
broader: Medicalization
related: Eonism
related: Inverts
related: Sexual preference
related: Uranism
has top concept: LGBTQ+ historical terms
replaces: sexualInversion
issued: 2019-05-14
modified: 2025-02-23
type: Concept
in scheme: v3
change note: Version 4.1.0

Sexual minorities
preferred label: Minorías sexuales @es
comment: People whose sexual practices differ from those of the dominant culture.
comment: Personas cuyas prácticas sexuales difieren de las de la cultura dominante. @es
narrower: Asexual people
narrower: Bisexual people
narrower: Demisexual people
narrower: Gay men
narrower: Lesbians
narrower: Katoey
narrower: Takatāpui
narrower: Tongzhi
narrower: Two-Spirit people
narrower: Greysexual people
narrower: Megasexual people
narrower: Sapphics
narrower: MLM (Men Loving Men)
narrower: WLW (Women Loving Women)
narrower: Kinky people
related: Bi+ people
related: Sodomites
related: BDSM
related: Homophiles
related: Homosexuals
related: Inverts
related: LGBTI
related: LGBTQ+ people
related: Men who have sex with men
related: Sexual orientation
related: Sexual preference
related: Sexuality
related: Uranians
related: Women who have sex with women
related: Relationship minorities
related: Gender minorities
related: Romantic minorities
replaces: sexualMinorities
issued: 2019-05-14
modified: 2025-02-23
type: Concept
in scheme: v3
change note: Version 4.1.0

Sexual orientation
preferred label: Orientación sexual @es
comment: The direction of an individual's sexual attraction towards other individuals of the same, opposite, or multiple sexes; commonly understood to be biologically and physiologically dictated, rather than sociologically determined.
comment: La dirección de la atracción sexual de una persona hacia otras personas del mismo sexo, del sexo opuesto o de múltiples sexos; comúnmente se entiende que está dictaminada por la biología y la fisiología, en lugar de estar determinada sociológicamente. @es
narrower: Asexuality
narrower: Bisexuality
narrower: Demisexuality
narrower: Heterosexuality
narrower: Homosexuality
narrower: Lesbianism
narrower: Sexual function
narrower: Allosexuality
narrower: Monosexuality
narrower: Polysexuality
narrower: Greysexuality
narrower: Megasexuality
narrower: Pansexuality
related: Conversion therapy
related: Denial of sexual orientation
related: Gaydar
related: Sexual diversity
related: Sexual identity
related: Sexual minorities
related: Sexual preference
related: Relationship orientation
related: Romantic orientation
related: Monosexual people
replaces: sexualOrientation
issued: 2019-05-14
modified: 2025-02-23
type: Concept
in scheme: v3
change note: Version 4.1.0

Sexual practices
preferred label: Prácticas sexuales @es
comment: Activities associated with physical and/or mental sexual stimuli, including but not limited to intercourse and sexual pleasure.
comment: Actividades asociadas con estímulos sexuales físicos y/o mentales, que incluyen, entre otros, las relaciones sexuales y el placer sexual. @es
narrower: Anal sex
narrower: Rimming
narrower: Anonymous sex
narrower: Autoerotic asphyxiation
narrower: Anal play
narrower: Fellatio
narrower: Cunnilingus
narrower: Casual sex
narrower: Clitoral sex
narrower: Enemas
narrower: Cottaging (Gay culture)
narrower: Cruising (LGBTQ+ culture)
narrower: Erotic massage
narrower: Exhibitionism
narrower: Fisting
narrower: Frottage
narrower: Getting laid
narrower: Oral sex
narrower: Urine play
narrower: Group sex
narrower: Sexual intercourse
narrower: Kissing
narrower: Manual sex
narrower: Masturbation
narrower: Mud sex
narrower: Mutual masturbation
narrower: Tantric sex
narrower: Nipple play
narrower: Phallic sex
narrower: Phone sex
narrower: Public sex
narrower: Ritual homosexuality
narrower: Rubber and latex fetish
narrower: Safer sex
narrower: Striptease
narrower: Tearoom sex
narrower: Vaginal sex
narrower: Hard swap
narrower: Soft swap
narrower: Body worship
narrower: Breath control
narrower: Douching
narrower: Breast play
narrower: Chest play
narrower: Sensation play
related: Consent
related: BDSM
related: Glory holes
related: Handkerchief codes
related: Sex accessories
related: Sexuality
related: Situational sexual behavior
related: Sodomy
related: Swinging
replaces: sexualPractices
issued: 2019-05-14
modified: 2025-03-20
type: Concept
in scheme: v3
change note: Version 4.1.0

Sexual preference
preferred label: Preferencias sexuales @es
comment: An enduring pattern of sexual attraction towards a certain sex or multiple sexes, as well as characterizations, objects, situational fantasies, or behaviors; generally understood to be either or both biologically determined and culturally and/or sociologically dictated.
comment: Patrón duradero de atracción sexual hacia un sexo determinado o múltiples sexos, así como hacia caracterizaciones, objetos, fantasías situacionales o comportamientos; generalmente se entiende que está determinado tanto biológicamente como cultural y/o sociológicamente. @es
narrower: Sadomasochism
narrower: Demisexual people
narrower: BDSM
narrower: Masochism
narrower: Partner preference
narrower: Pederasts
narrower: Sadism
narrower: Sexual roles
narrower: Polysexuality
narrower: Chasers
related: Casual sex
related: Conversion therapy
related: Pederasty
related: Sexual autonomy
related: Sexual behavior change
related: Sexual diversity
related: Sexual identity
related: Sexual inversion
related: Sexual minorities
related: Sexual orientation
related: Sexual relationships
related: Significant others
related: Situational sexual behavior
related: Virginity
related: Monosexuality
related: Monosexual people
related: Allosexual people
related: Sexual fluidity
replaces: sexualPreference
issued: 2019-05-14
modified: 2025-02-23
type: Concept
in scheme: v3
change note: Version 4.1.0

Sexual reform
preferred label: Reforma sexual @es
comment: Term used to describe the European movements for sexual reform in the 20th century.
comment: Término utilizado para describir los movimientos europeos por la reforma sexual en el siglo XX. @es
related: LGBTQ+ social processes
related: Sexuality
replaces: sexualReform
issued: 2019-05-14
modified: 2025-02-23
type: Concept
in scheme: v3
change note: Version 4.1.0

Sexual relationships
preferred label: Relaciones sexuales @es
comment: Ongoing connections between two or more individuals involving sexual behaviors or activities.
comment: Conexiones continuas entre dos o más personas que involucran comportamientos o actividades sexuales. @es
broader: Relationship satisfaction
narrower: Casual sex
narrower: Love triangles
narrower: Monogamy
narrower: Polygamy
related: Anonymous sex
related: Demisexual people
related: Fuck buddies
related: LGBTQ+ lovers
related: Partner notification
related: Partner preference
related: Sexual preference
related: Megasexuality
related: Megasexual people
related: Relationship orientation
related: Monogamous people
related: Allosexual people
has top concept: Relationship satisfaction
replaces: sexualRelationships
issued: 2019-05-14
modified: 2025-02-23
type: Concept
in scheme: v3
change note: Version 4.1.0

Sexual revolution
preferred label: Revolución sexual @es
comment: Social perspective from the 1960s into the 1970s that challenged traditional codes of behavior related to sexuality and interpersonal relationships throughout the Western world.
comment: Perspectiva social desde la década de 1960 hasta la de 1970 que desafió los códigos tradicionales de comportamiento relacionados con la sexualidad y las relaciones interpersonales en todo el mundo occidental. @es
related: LGBTQ+ social processes
replaces: sexualRevolution
issued: 2019-05-14
modified: 2025-02-23
type: Concept
in scheme: v3
change note: Version 4.1.0

Sexual roles
preferred label: Roles sexuales @es
comment: An erotic identity an individual assumes during sexual play with one or more people; this identity can either be restricted to the bedroom or extended into day-to-day life.
comment: Una identidad erótica que asume una persona durante el juego sexual con una o más personas; esta identidad puede restringirse al ámbito del dormitorio o extenderse a la vida cotidiana. @es
broader: Role behavior
broader: Sexual preference
narrower: Bottoms (Sex)
narrower: Butches
narrower: Femmes
narrower: LGBTQ+ dominants
narrower: LGBTQ+ mistresses (BDSM culture)
narrower: Switches (Sex)
narrower: Tops (Sex)
narrower: Vers (Sex)
narrower: Power exchange
narrower: Ky-ky (Gender role)
related: Handkerchief codes
related: Roleplay
related: Sexual identity
related: Sexuality
has top concept: Role behavior
replaces: sexualRoles
issued: 2019-05-14
modified: 2025-03-20
type: Concept
in scheme: v3
change note: Version 4.1.0

Sexual violence
preferred label: Violencia sexual @es
comment: Sexual acts or attempts to coerce sexual acts that involve the use of non-consensual violence. This term encompasses sexual assault, rape, and sexual abuse.
comment: Actos sexuales o intentos de coercer a actos sexuales que impliquen el uso de violencia no consentida. Este término abarca la agresión sexual, la violación y el abuso sexual. @es
narrower: Corrective rape
narrower: LGBTQ+ domestic violence
narrower: LGBTQ+ sexual abuse
narrower: LGBTQ+ victims of rape
narrower: Sexual assault
narrower: Child sexual abuse content
related: Anti-LGBTQ+ violence
related: Rape/non-con (Content warning)
related: Rape culture
replaces: sexualViolence
issued: 2019-05-14
modified: 2025-02-23
type: Concept
in scheme: v3
change note: Version 4.1.0

Sexuality
preferred label: Sexualidad @es
comment: Term used to describe the ways in which individuals experience and express themselves sexually, including the types of people and practices they are sexually interested in.
comment: Término utilizado para describir las formas en que las personas experimentan y se expresan sexualmente, incluidos los tipos de personas y prácticas que les interesan sexualmente. @es
narrower: Children's sexuality
narrower: Organizations for sexual research and sexual reform
narrower: Women's sexuality
related: Anonymous sex
related: Casual sex
related: Cybersex
related: Eroticism
related: Gender studies
related: Group sex
related: Hypersexuality
related: Libido
related: Sex locations
related: Public sex
related: Seduction
related: Sex accessories
related: Sex (Act)
related: Sex parties
related: Sexology
related: Sexting
related: Sexual abstinence
related: Sexual excitement
related: Sexual autonomy
related: Sexual dysfunction
related: Sexual function
related: Sexual minorities
related: Sexual practices
related: Sexual reform
related: Sexual roles
related: Situational sexual behavior
related: Homoeroticism
related: Passing (Sexuality)
related: Sexual fluidity
related: Sexual studies
replaces: sexuality
issued: 2019-05-14
modified: 2025-04-24
type: Concept
in scheme: v3
change note: Version 4.1.0

Sexually abused LGBTQ+ children
preferred label: Niños LGBTQ+ abusados sexualmente @es
alternative label: Sexually abused LGBTQ children
alternative label: Niños LGBTQ abusados sexualmente @es
comment: LGBTQ+ children younger than 18 years of age who are currently experiencing or have experienced sexual abuse.
comment: Niños LGBTQ+ menores de 18 años que actualmente sufren o han sufrido abuso sexual. @es
broader: LGBTQ+ children
broader: LGBTQ+ victims of sexual abuse
related: LGBTQ+ victims of rape
has top concept: Family members
replaces: sexuallyAbusedLGBTQChildren
issued: 2019-05-14
modified: 2025-02-23
type: Concept
in scheme: v3
change note: Version 4.1.0

STDs
preferred label: ETS @es
alternative label: Sexually transmitted diseases
alternative label: VD
alternative label: Venereal diseases
alternative label: STIs
alternative label: Sexually transmitted infections
alternative label: Enfermedades de transmisión sexual @es
alternative label: ITS @es
alternative label: Infecciones de transmisión sexual @es
alternative label: Enfermedades venéreas @es
comment: Diseases or infections that are transmitted via sexual contact or activity.
comment: Enfermedades o infecciones que se transmiten por contacto o actividad sexual. @es
narrower: HIV/AIDS
related: Partner notification
replaces: STDs
issued: 2019-05-14
modified: 2025-02-23
type: Concept
in scheme: v3
change note: Version 4.1.0

Shiv-Shakthis
comment: Term used in the Andhra Pradesh region of India to describe transgender people who are considered to be married to the gods (particularly Shiva). They often serve as astrologers and spiritual healers and their community is guarded by gurus who induct disciples and train them.
comment: Término utilizado en la región de Andhra Pradesh en India para describir a las personas transgénero que se consideran estar casadas con los dioses (particularmente Shiva). A menudo sirven como astrólogos y sanadores espirituales y su comunidad está custodiada por gurús que inician a sus discípulos y los entrenan. @es
broader: Non-Euro-American gender and sexual identities
has top concept: Gender
replaces: shivShakthis
issued: 2019-05-14
modified: 2025-02-23
type: Concept
in scheme: v3
change note: Version 4.1.0

Siblings
preferred label: Hermanos @es
alternative label: Hermanas @es
alternative label: Hermanxs @es
comment: Individuals who share the same parent or parents.
comment: Personas que comparten el mismo padre(s) y o madre(s). @es
broader: Family members
narrower: LGBTQ+ siblings
narrower: Siblings of LGBTQ+ people
narrower: Donor siblings
narrower: Half-siblings
related: LGBTQ+ families
has top concept: Family members
replaces: siblings
issued: 2019-05-14
modified: 2025-02-23
type: Concept
in scheme: v3
change note: Version 4.1.0

Significant others
preferred label: Parejas @es
comment: An individual's partner or partners in an established, ongoing romantic or sexual relationship.
comment: La pareja o las parejas de una persona en una relación romántica o sexual establecida y en curso. @es
related: Domestic partnerships
related: Intimate partner violence
related: LGBTQ+ domestic violence
related: LGBTQ+ lovers
related: Partner notification
related: Partner preference
related: Partner rights
related: Relationship satisfaction
related: Sexual preference
related: Partners
replaces: significantOthers
issued: 2019-05-14
modified: 2025-02-23
type: Concept
in scheme: v3
change note: Version 4.1.0

Single people
preferred label: Personas solteras @es
alternative label: Singles
alternative label: Solteros @es
alternative label: Solteras @es
comment: People who are not involved in any committed sexual or romantic relationships, including marriages, civil unions, or other established partnerships.
comment: Personas que no están involucradas en ninguna relación sexual o romántica comprometida, incluidos matrimonios, uniones civiles u otras relaciones establecidas. @es
broader: Marital status
narrower: LGBTQ+ single parents
related: Divorced people
has top concept: Living arrangements
replaces: singlePeople
issued: 2019-05-14
modified: 2025-02-23
type: Concept
in scheme: v3
change note: Version 4.1.0

Sissies
preferred label: Maricas @es
alternative label: Sissy boys
alternative label: Maricón @es
alternative label: Niños marica @es
comment: Pejorative term applied to boys or men who are perceived to be effeminate or do not conform to traditional masculine roles.
comment: Término peyorativo que se aplica a niños u hombres que son percibidos como afeminados o que no se ajustan a los roles masculinos tradicionales. @es
broader: Boys
broader: Gender roles
related: Queens (Gay culture)
has top concept: Family members
replaces: sissies
issued: 2019-05-14
modified: 2025-02-23
type: Concept
in scheme: v3
change note: Version 4.1.0

Sistergirls
alternative label: Sistagirls
comment: Indigenous Australian term for people who transition from male to female.
comment: Término indígena australiano para las personas que hacen la transición de hombre a mujer. @es
broader: Non-Euro-American gender and sexual identities
related: Aboriginal Australian LGBTQ+ people
related: Brotherboys
has top concept: Gender
replaces: sistergirls
issued: 2019-05-14
modified: 2025-02-23
type: Concept
in scheme: v3
change note: Version 4.1.0

Situational sexual behavior
preferred label: Comportamiento sexual situacional @es
preferred label: Situational sexual behaviour
alternative label: Situational homosexuality
alternative label: Homosexualidad situacional @es
comment: Sexual behaviors that depart from an individual's typical behaviors or preferences as a result of social pressures that permit, encourage, or compel certain behaviors.
comment: Comportamientos sexuales que se desvían de los comportamientos o las preferencias típicas de una persona como resultado de presiones sociales que permiten, alientan u obligan a ciertos comportamientos. @es
related: Sex (Act)
related: Sexual practices
related: Sexual preference
related: Sexuality
related: Sexual fluidity
replaces: situationalSexualBehaviour
issued: 2019-05-14
modified: 2025-02-23
type: Concept
in scheme: v3
change note: Version 4.1.0

Skoptsy
alternative label: Eunucos @es
alternative label: Castrados @es
alternative label: Blancas Palomas @es
comment: A sect within the larger Spiritual Christianity movement in the Russian Empire that emerged in the 18th century. This sect is most commonly known for conducting castrations and mastectomies in order to suppress sexual desire.
comment: Una secta dentro del movimiento más amplio del cristianismo espiritual en el Imperio ruso que surgió en el siglo XVIII. Esta secta es más conocida por realizar castraciones y mastectomías para suprimir el deseo sexual. @es
broader: Non-Euro-American gender and sexual identities
has top concept: Gender
replaces: skoptsy
issued: 2019-05-14
modified: 2025-02-23
type: Concept
in scheme: v3
change note: Version 4.1.0

LGBTQ+ slang
preferred label: Jerga LGBTQ+ @es
alternative label: Slang (LGBTQ)
alternative label: Jerga LGBTQ @es
alternative label: Argot LGBTQ @es
comment: Colloquial or informal language related to LGBTQ+ people or used by LGBTQ+ people.
comment: Lenguaje coloquial o informal relacionado con personas LGBTQ+ o utilizado por personas LGBTQ+. @es
narrower: Bisexual slang
narrower: Gay slang
narrower: Lesbian slang
narrower: Poppers
narrower: Queer slang
narrower: Transgender slang
narrower: Reclaimed terms
narrower: Queerspawn
narrower: Bothies
narrower: Asexual slang
narrower: Intersex slang
narrower: Kiki (Social Gathering)
related: Slurs
related: Fandom terminology
related: Slash terminology
related: Two-Spirit slang
related: Lavender linguistics
related: Queer linguistics
replaces: slangLGBTQ
issued: 2019-05-14
modified: 2026-02-23
type: Concept
in scheme: v3
change note: Version 4.1.0

LGBTQ+ submissives
preferred label: Sumisos LGBTQ+ @es
alternative label: LGBTQ+ S-type
alternative label: LGBTQ+ Slaves
alternative label: LGBTQ+ Subs
comment: The person who takes on the position of submission or service in a power exchange relationship or during kink activities.
comment: La persona que asume la posición de sumisión o servicio en una relación de intercambio de poder o durante actividades kink. @es
broader: Sexual identity
broader: Relationship minorities
broader: Kinky people
related: Sadomasochism
related: Bottoms (Sex)
related: LGBTQ+ dominatrices
related: Leather community
related: LGBTQ+ dominants
related: LGBTQ+ mistresses (BDSM culture)
related: Tops (Sex)
related: Power exchange
has top concept: Sexual identity
replaces: slaves
issued: 2019-05-14
modified: 2025-02-23
type: Concept
in scheme: v3
change note: Version 4.1.0

Leather and kink activism
preferred label: Activismo leather y kink @es
comment: Organizing and activism focused on increasing awareness and acceptance of kinks, fetishes, sadomasochism, leather and related subcultures, closely associated with LGBTQ+ activism and the sex-positive feminist movement.
comment: Organización y activismo centrados en aumentar la concienciación y la aceptación de las subculturas kinks, fetichistas, sadomasoquistas, de cuero y afines, estrechamente relacionadas con el activismo LGBTQ+ y el movimiento feminista del sexo positivo. @es
broader: Social movements
related: LGBTQ+ activism
related: Sadomasochism
related: Sex-positive feminism
has top concept: Social movements
replaces: SMMovement
issued: 2019-05-14
modified: 2025-02-23
type: Concept
in scheme: v3
change note: Version 4.1.0

Social constructionism
preferred label: Construccionismo social @es
comment: Belief or theory that categories of gender, sexual orientation, and ethnicity are cultural constructs rather than intrinsic categories of nature.
comment: Creencia o teoría de que las categorías de género, orientación sexual y etnicidad son construcciones culturales y no categorías intrínsecas de la naturaleza. @es
broader: Theories
related: Essentialism
related: Medicalization
related: Queer theory
has top concept: Theories
replaces: socialConstructionism
issued: 2019-05-14
modified: 2025-02-23
type: Concept
in scheme: v3
change note: Version 4.1.0

Social media
preferred label: Redes sociales @es
alternative label: RR.SS. @es
comment: Web-based and mobile technologies used to turn communication into interactive dialogues.
comment: Tecnologías móviles y basadas en la web utilizadas para convertir la comunicación en diálogos interactivos. @es
related: LGBTQ+ victims of cyberbullying
related: LGBTQ+ social media
is replaced by: LGBTQ+ social media
replaces: socialMedia
issued: 2019-05-14
modified: 2025-07-16
type: Concept
in scheme: v3
change note: Version 4.1.0

Social movements
preferred label: Movimientos sociales @es
comment: Organized efforts by groups of people to achieve certain political, social, economic, or cultural goals. Social movements are often intended to carry out, resist, or undo social changes.
comment: Esfuerzos organizados por grupos de personas para lograr ciertos objetivos políticos, sociales, económicos o culturales. Los movimientos sociales a menudo tienen como objetivo llevar a cabo, resistir o deshacer cambios sociales. @es
narrower: Ex-gay movement
narrower: Women's movement
narrower: Men's movement
narrower: LGBTQ+ movement
narrower: Leather and kink activism
narrower: Defund the police movement
narrower: Police abolitionist movement
narrower: Black Lives Matter movement
narrower: Anti-gender movement
related: Intersex movement
replaces: socialMovements
issued: 2019-05-14
modified: 2025-02-23
type: Concept
in scheme: v3
change note: Version 4.1.0

Social norms
preferred label: Normas sociales @es
comment: Group-held beliefs about how members of that group should behave in a given context.
comment: Creencias grupales sobre cómo deberían comportarse los miembros de tal grupo en un contexto determinado. @es
narrower: Heteronormativity
narrower: Homonormativity
narrower: Amatonormativity
narrower: Compulsory sexuality
narrower: Mononormativity
narrower: Chrononormativity
narrower: Compulsory heterosexuality
related: Normalization
related: Homonationalism
related: Role behavior
replaces: socialNorms
issued: 2019-05-14
modified: 2025-04-23
type: Concept
in scheme: v3
change note: Version 4.1.0

Social security cards
preferred label: Tarjetas de seguro social @es
comment: Official documents issued by governments that ascribe unique numeral identifiers to citizens to track their income and determine retirement benefits.
comment: Documentos oficiales emitidos por gobiernos que atribuyen identificadores numéricos únicos a los ciudadanos para realizar un seguimiento de sus ingresos y determinar los beneficios de jubilación. @es
broader: Official documentation
related: Birth certificates
related: Legal name change
related: Driver's licenses
related: Gender markers
related: Transitioning (Gender)
has top concept: Legal status
replaces: socialSecurityCards
issued: 2019-05-14
modified: 2025-02-23
type: Concept
in scheme: v3
change note: Version 4.1.0

Sodomy
preferred label: Sodomía @es
comment: Historical term for "unnatural" sexual acts unrelated to procreation, including oral sex and anal sex.
comment: Término histórico para actos sexuales "antinaturales" no relacionados con la procreación, incluido el sexo oral y el sexo anal. @es
broader: LGBTQ+ historical terms
related: Sodomites
related: Pederasty
related: Sex (Act)
related: Sexual practices
related: Sodomy laws
has top concept: LGBTQ+ historical terms
replaces: sodomy
issued: 2019-05-14
modified: 2025-02-23
type: Concept
in scheme: v3
change note: Version 4.1.0

Sodomy laws
preferred label: Leyes de sodomía @es
alternative label: Leyes sobre sodomía @es
comment: Laws and regulations regarding the legality of sodomy, particularly in the United States, Great Britain, and/or former British colonies.
comment: Leyes y regulaciones relativas a la legalidad de la sodomía, particularmente en los Estados Unidos, Gran Bretaña y/o antiguas colonias británicas. @es
broader: Sexual offenses laws
related: Sodomy
related: Police interactions with LGBTQ+ people
related: Criminalization of homosexuality
has top concept: Law
replaces: sodomyLaws
issued: 2019-05-14
modified: 2025-02-23
type: Concept
in scheme: v3
change note: Version 4.1.0

Soft butches
preferred label: Marimachas suaves @es
comment: People who are somewhat or slightly masculine in their appearance; commonly used in lesbian communities.
comment: Personas que tienen una apariencia algo o ligeramente masculina; comúnmente utilizado en comunidades de lesbianas. @es
broader: Sexual identity
related: Butches
related: Femmes
related: Lesbians
related: Masculine of center
has top concept: Sexual identity
replaces: softButches
issued: 2019-05-14
modified: 2025-02-23
type: Concept
in scheme: v3
change note: Version 4.1.0

Solo sex
preferred label: Sexo en solitario @es
comment: Sexual acts involving only one person, such as masturbation, as opposed to sex with a partner.
comment: Actos sexuales que involucran a una sola persona, como la masturbación, a diferencia del sexo con una pareja. @es
related: Masturbation
replaces: soloSex
issued: 2019-05-14
modified: 2025-02-23
type: Concept
in scheme: v3
change note: Version 4.1.0

LGBTQ+ sons
preferred label: Hijos LGBTQ+ @es
alternative label: Sons (LGBTQ)
alternative label: Hijos LGBTQ @es
comment: Sons who identify as LGBTQ+.
comment: Hijos que se identifican como LGBTQ+. @es
broader: LGBTQ+ people
broader: Sons
narrower: Bisexual sons
narrower: Gay sons
narrower: Queer sons
narrower: Transgender sons
narrower: Asexual sons
narrower: Intersex sons
has top concept: LGBTQ+ people
replaces: sonsLGBTQ
issued: 2019-05-14
modified: 2025-02-23
type: Concept
in scheme: v3
change note: Version 4.1.0

Sons of bisexual people
preferred label: Hijos de personas bisexuales @es
comment: Sons who have one or more bisexual parent. For sons who are themselves bisexual, use the term "Bisexual sons."
comment: Hijos que tienen uno o más padres bisexuales. Para los hijos que son bisexuales, utilice el término "hijos bisexuales". @es
broader: Children of bisexual people
broader: Sons of LGBTQ+ people
has top concept: Family members
replaces: sonsOfBisexualPeople
issued: 2019-05-14
modified: 2025-02-23
type: Concept
in scheme: v3
change note: Version 4.1.0

Sons of gay men
preferred label: Hijos de hombres gay @es
comment: Sons who have one or more gay parent. For sons who are themselves gay, use the term "Gay sons."
comment: Hijos que tienen uno o más padres gay. Para los hijos que son gay, utilice el término "hijos gay". @es
broader: Children of gay men
broader: Sons of LGBTQ+ people
has top concept: Family members
replaces: sonsOfGayMen
issued: 2019-05-14
modified: 2025-02-23
type: Concept
in scheme: v3
change note: Version 4.1.0

Sons of lesbians
preferred label: Hijos de lesbianas @es
comment: Sons who have one or more lesbian parent.
comment: Hijos que tienen uno o más madres lesbianas. @es
broader: Children of lesbians
broader: Sons of LGBTQ+ people
has top concept: Family members
replaces: sonsOfLesbians
issued: 2019-05-14
modified: 2025-02-23
type: Concept
in scheme: v3
change note: Version 4.1.0

Sons of transgender people
preferred label: Hijos de personas transgénero @es
comment: Sons who have one or more transgender parent. For sons who are themselves transgender, use the term "Transgender sons."
comment: Hijos que tienen uno o más padres transgénero. Para los hijos que son transgénero, utilice el término "hijos transgénero". @es
broader: Children of transgender people
broader: Sons of LGBTQ+ people
has top concept: Family members
replaces: sonsOfTransgenderPeople
issued: 2019-05-14
modified: 2025-02-23
type: Concept
in scheme: v3
change note: Version 4.1.0

Sons of queer people
preferred label: Hijos de personas queer @es
comment: Sons who have one or more queer parent. For sons who are themselves queer, use the term "Queer sons."
comment: Hijos que tienen uno o más padres queer. Para los hijos que son queer, utilice el término "hijos queer". @es
broader: Children of queer people
broader: Sons of LGBTQ+ people
has top concept: Family members
replaces: sonsOfQueerPeople
issued: 2019-05-14
modified: 2025-02-23
type: Concept
in scheme: v3
change note: Version 4.1.0

Spanking
preferred label: Nalgada @es
alternative label: Azotainas @es
alternative label: Zurras eróticas @es
alternative label: Disciplina inglesa @es
alternative label: Palmada @es
comment: Striking the buttocks, usually with the hand or paddle, as a form of impact play.
comment: Golpear las nalgas, normalmente con la mano o con una paleta, como forma de juego de impacto. @es
broader: Impact play
related: Anal play
related: Butt
related: Spanking paddles
has top concept: Eroticism
replaces: spanking
issued: 2019-05-14
modified: 2025-02-23
type: Concept
in scheme: v3
change note: Version 4.1.0

Sperm donors
preferred label: Donantes de esperma @es
comment: Individuals of any gender who donate their own sperm for the purpose of inducing pregnancy.
comment: Personas de cualquier género que donan su propio esperma con el fin de inducir el embarazo. @es
broader: Donors
broader: Donor insemination
related: Insemination
related: LGBTQ+ family planning
related: Artificial insemination
related: Sperm donation
has top concept: Donors
replaces: spermDonors
issued: 2019-05-14
modified: 2025-02-23
type: Concept
in scheme: v3
change note: Version 4.1.0

Spreader bars
preferred label: Barra separadora @es
alternative label: Barra de expansión @es
alternative label: Spreader bar @es
comment: Bondage devices consisting of wooden or metal bars with cuffs at either end that are used to keep an individual's arms or legs apart.
comment: Equipo de bondage que consiste en barras de madera o metal con esposas en cada extremo que se utilizan para mantener separados los brazos o las piernas de la persona, generalmente durante actividades sexuales o para estimulación sexual. @es
replaces: spreaderBars
issued: 2019-05-14
modified: 2025-03-20
type: Concept
in scheme: v3
change note: Version 4.1.0

Srey sros
comment: Term used in Cambodia for people assigned male at birth who identify as women; translates to "charming girls."
comment: Término utilizado en Camboya para las personas asignadas al sexo masculino al nacer y que se autoidentifican como mujeres; se traduce como "chicas encantadoras". @es
broader: Non-Euro-American gender and sexual identities
related: Khteuy
related: Sak veng
has top concept: Gender
replaces: sreySros
issued: 2019-05-14
modified: 2025-02-23
type: Concept
in scheme: v3
change note: Version 4.1.0

Stature
preferred label: Estatura @es
comment: A person’s natural height in an upright position.
comment: La altura natural de una persona en posición erguida. @es
broader: Secondary sex characteristics
has top concept: Sex (Body)
replaces: stature
issued: 2019-05-14
modified: 2025-02-23
type: Concept
in scheme: v3
change note: Version 4.1.0

Stone butches
preferred label: Marimachas fuertes @es
comment: Individuals whose gender expression and/or identity is masculine-presenting and who usually do not like to be sexually touched, though they will still provide their partners with sexual pleasure; commonly used in lesbian communities.
comment: Personas cuya expresión y/o identidad de género es de presentación masculina y a quienes generalmente no les gusta que les toquen sexualmente, aunque sí brindarán placer sexual a sus parejas; comúnmente utilizado en comunidades de lesbianas. @es
broader: Sexual identity
related: Butch-femme relationships
related: Butches
related: Femmes
related: Lesbians
has top concept: Sexual identity
replaces: stoneButches
issued: 2019-05-14
modified: 2025-02-23
type: Concept
in scheme: v3
change note: Version 4.1.0

Stonewall riots
preferred label: Revueltas de Stonewall @es
alternative label: Stonewall uprising
alternative label: Disturbios de Stonewall @es
comment: The series of spontaneous demonstrations and protests against the police raid that took place on June 28, 1969 at the Stonewall Inn in the Greenwich Village neighborhood of New York City.
comment: La serie de manifestaciones y protestas espontáneas contra la redada policial que tuvo lugar el 28 de junio de 1969 en el Stonewall Inn en el barrio de Greenwich Village de la ciudad de Nueva York. @es
broader: LGBTQ+ riots
related: Gay liberation
has top concept: LGBTQ+ riots
replaces: stonewallRiots
issued: 2019-05-14
modified: 2025-02-23
type: Concept
in scheme: v3
change note: Version 4.1.0

Strap-on sex
preferred label: Sexo con arnés @es
comment: Sexual intercourse in which a dildo attached to a harness is used for either vaginal or anal penetration.
comment: Relaciones sexuales en las que se utiliza un consolador sujeto a un arnés para la penetración vaginal o anal. @es
broader: Sex (Act)
related: Dildo harnesses
related: Dildos
related: Sexual intercourse
related: Penis
related: Women who have sex with women
has top concept: Sex (Act)
replaces: strapOnSex
issued: 2019-05-14
modified: 2025-02-23
type: Concept
in scheme: v3
change note: Version 4.1.0

Strippers
alternative label: Stripteasers
alternative label: Peelers
alternative label: Pole-dancers
alternative label: Pole dancers
alternative label: Exotic dancers
comment: Sex workers who undress to music while using a pole to perform dance moves, whether in a venue like a strip club or by hire at private parties. For stripping performed by amateurs in private settings, use "Stripping."
comment: Personas trabajadoras sexuales que se desnudan al ritmo de la música mientras utilizan una barra para realizar movimientos de baile, ya sea en un local como un club de striptease o por encargo en fiestas privadas. Para el striptease realizado por gente aficionada en entornos privados, utilice «Stripping». @es
broader: Sex workers
related: Stripping
has top concept: Sex workers
replaces: strippers
issued: 2019-05-14
modified: 2025-02-23
type: Concept
in scheme: v3
change note: Version 4.1.0

Striptease
preferred label: Estriptís @es
comment: A form of erotic dance during which the performer gradually undresses in a seductive and sexually suggestive manner.
comment: Una forma de danza erótica durante la cual la persona que lo interpreta se desnuda gradualmente de una manera seductora y sexualmente sugerente. @es
broader: Sexual practices
broader: LGBTQ+ theater
has top concept: Sexual practices
replaces: striptease
issued: 2019-05-14
modified: 2025-02-23
type: Concept
in scheme: v3
change note: Version 4.1.0

Subcultures
preferred label: Subculturas @es
comment: Groups of people belonging to cultures that differentiate them from the larger culture to which they belong. Subcultures develop their own norms and values regarding cultural, political, and sexual matters.
comment: Grupos de personas pertenecientes a culturas que las diferencian de la cultura más amplia a la que pertenecen. Las subculturas desarrollan sus propias normas y valores en materia cultural, política y sexual. @es
narrower: Ball culture
narrower: Dandyism
narrower: Decadence
narrower: Leather community
narrower: Rubber and latex community
narrower: Gym subculture
narrower: LGBTQ+ culture
narrower: Fandom
narrower: Furry culture
replaces: subcultures
issued: 2019-05-14
modified: 2025-02-23
type: Concept
in scheme: v3
change note: Version 4.1.0

Suffragettes
preferred label: Sufragistas @es
comment: Women who seek the right to vote, often through organized protest; typically used to describe members of political movements in the late 1800s and early 1900s focusing on women’s right to vote in the U.S. and Britain.
comment: Mujeres que buscan el derecho al voto, a menudo mediante protestas organizadas; normalmente se utiliza para describir a miembros de movimientos políticos de finales del siglo XIX y principios del XX que se centraban en el derecho de las mujeres al voto en Estados Unidos y Gran Bretaña. @es
broader: Feminists
has top concept: Feminists
replaces: suffragettes
issued: 2019-05-14
modified: 2025-02-23
type: Concept
in scheme: v3
change note: Version 4.1.0

Surrogacy
preferred label: Gestación subrogada @es
alternative label: Vientre de alquiler @es
comment: A method or agreement whereby a person consents to carry a pregnancy for another person or people who will become the child's parent(s) after birth.
comment: Un método o acuerdo mediante el cual una persona consiente a llevar a cabo un embarazo para otra persona o personas que se convertirán en los padres del niño después del nacimiento. @es
broader: Gestational parenthood
broader: Conception by LGBTQ+ people
broader: Assisted reproduction
narrower: Gestational surrogacy
related: Egg donors
has top concept: LGBTQ+ families
replaces: surrogacy
issued: 2019-05-14
modified: 2025-02-23
type: Concept
in scheme: v3
change note: Version 4.1.0

Survivors of anti-LGBTQ+ violence
preferred label: Sobrevivientes de violencia anti-LGBTQ+ @es
alternative label: Survivors of anti-LGBTQ violence
alternative label: Sobrevivientes de violencia anti-LGBTQ @es
comment: People who have experienced and survived anti-LGBTQ+ violence; follow individuals’ preference for “victims” or “survivors” whenever possible.
comment: Personas que han sufrido y sobrevivido la violencia anti-LGBTQ+; siga la preferencia de la persona sobre el uso de "víctimas" o "sobrevivientes" siempre que sea posible @es
related: Anti-LGBTQ+ violence
replaces: survivorsOfAntiLGBTQViolence
issued: 2019-05-14
modified: 2025-02-23
type: Concept
in scheme: v3
change note: Version 4.1.0

LGBTQ+ survivors of hate crimes
preferred label: Sobrevivientes LGBTQ+ de crímenes de odio @es
alternative label: Survivors of hate crimes (LGBTQ)
alternative label: Sobrevientes de crimines de odio (LGBTQ) @es
comment: LGBTQ+ people who have experienced and survived hate crimes; follow the individual's preference for "victims" or "survivors" whenever possible.
comment: Personas LGBTQ+ que han sufrido y sobrevivido crímenes de odio; siga la preferencia de la persona sobre el uso de "víctimas" o "sobrevivientes" siempre que sea posible. @es
broader: LGBTQ+ victims of hate crimes
narrower: Bisexual survivors of hate crimes
narrower: Gay survivors of hate crimes
narrower: Lesbian survivors of hate crimes
narrower: Queer survivors of hate crimes
narrower: Transgender survivors of hate crimes
narrower: Asexual survivors of hate crimes
narrower: Intersex survivors of hate crimes
related: Police interactions with LGBTQ+ people
related: Two-Spirit survivors of hate crimes
has top concept: LGBTQ+ people
replaces: survivorsOfHateCrimesLGBTQ
issued: 2019-05-14
modified: 2025-02-23
type: Concept
in scheme: v3
change note: Version 4.1.0

LGBTQ+ survivors of rape
preferred label: Sobrevivientes LGBTQ+ de violación @es
alternative label: Survivors of rape (LGBTQ)
alternative label: Sobrevivientes de violacion (LGBTQ) @es
comment: LGBTQ+ people who have experienced and survived rape; follow the individual's preference for "victims" or "survivors" whenever possible.
comment: Personas LGBTQ+ que han sufrido y sobrevivido la violación; siga la preferencia de la persona sobre el uso de "víctimas" o "sobrevivientes" siempre que sea posible. @es
broader: LGBTQ+ victims of rape
narrower: Bisexual survivors of rape
narrower: Gay survivors of rape
narrower: Lesbian survivors of rape
narrower: Queer survivors of rape
narrower: Transgender survivors of rape
narrower: Asexual survivors of rape
narrower: Intersex survivors of rape
related: Rape/non-con (Content warning)
related: Two-Spirit survivors of rape
has top concept: LGBTQ+ people
replaces: survivorsOfRapeLGBTQ
issued: 2019-05-14
modified: 2025-02-23
type: Concept
in scheme: v3
change note: Version 4.1.0

LGBTQ+ survivors of sexual abuse
preferred label: Sobrevivientes LGBTQ+ de abuso sexual @es
alternative label: Survivors of sexual abuse (LGBTQ)
alternative label: Sobrevivientes de abuso sexual (LGBTQ) @es
comment: LGBTQ+ people who have experienced and survived sexual abuse; follow the individual's preference for "victims" or "survivors" whenever possible.
comment: Personas LGBTQ+ que han sufrido y sobrevivido abusos sexuales; siga la preferencia de la persona sobre el uso de "víctimas" o "sobrevivientes" siempre que sea posible. @es
broader: LGBTQ+ victims of sexual abuse
narrower: Bisexual survivors of sexual abuse
narrower: Gay survivors of sexual abuse
narrower: Lesbian survivors of sexual abuse
narrower: Queer survivors of sexual abuse
narrower: Transgender survivors of sexual abuse
narrower: Asexual survivors of sexual abuse
narrower: Intersex survivors of sexual abuse
related: LGBTQ+ domestic violence
related: LGBTQ+ sexual abuse
related: Rape/non-con (Content warning)
related: Two-Spirit survivors of sexual abuse
has top concept: LGBTQ+ people
replaces: survivorsOfSexualAbuseLGBTQ
issued: 2019-05-14
modified: 2025-02-23
type: Concept
in scheme: v3
change note: Version 4.1.0

LGBTQ+ survivors of war
preferred label: Sobrevivientes LGBTQ+ de guerra @es
alternative label: Survivors of war (LGBTQ)
alternative label: Sobrevivientes de guerra (LGBTQ) @es
comment: LGBTQ+ people who have experienced and survived war; follow the individual's preference for "victims" or "survivors" whenever possible.
comment: Personas LGBTQ+ que han sufrido y sobrevivido la guerra; siga la preferencia de la persona sobre el uso de "víctimas" o "sobrevivientes" siempre que sea posible. @es
broader: LGBTQ+ people
narrower: Bisexual survivors of war
narrower: Gay survivors of war
narrower: Lesbian survivors of war
narrower: Queer survivors of war
narrower: Transgender survivors of war
narrower: Asexual survivors of war
narrower: Intersex survivors of war
related: LGBTQ+ victims of war
related: Two-Spirit survivors of war
has top concept: LGBTQ+ people
replaces: survivorsOfWarLGBTQ
issued: 2019-05-14
modified: 2025-02-23
type: Concept
in scheme: v3
change note: Version 4.1.0

Switches (Sex)
preferred label: Versátiles @es
alternative label: Switches
alternative label: Vers @es
alternative label: Switch @es
comment: Slang term for individuals who alternate between being the giving partner and the receiving partner in sexual encounters; typically used as a noun (e.g., "They're a switch").
comment: Término de la jerga para personas que alternan entre ser la pareja que da y la que recibe en encuentros sexuales; normalmente se utiliza como sustantivo (por ejemplo, "Él es versátil"). @es
broader: Sexual identity
broader: Sexual roles
related: Kink community
related: Bottoms (Sex)
related: Tops (Sex)
related: Vers (Sex)
has top concept: Sexual identity
replaces: switches
issued: 2019-05-14
modified: 2025-02-23
type: Concept
in scheme: v3
change note: Version 4.1.0

Swyer syndrome
preferred label: Síndrome de Swyer @es
alternative label: XY Gonadal dysgenesis
alternative label: Disgenesia gonadal 46XY pura @es
comment: Swyer syndrome occurs when a person is born with XY chromosomes, but their gonads have not developed into testes. It is a form of gonadal dysgenesis, meaning that a person with this variation will have streak gonads that do not produce hormones. Since they do not produce testosterone, their body does not develop a penis and usually develops a vulva and vagina instead. Since they do not produce another hormone known as anti-Müllerian hormone (AMH), people with Swyer syndrome often develop a uterus and fallopian tubes as well. They will not usually start puberty or begin menstruating, but some people with Swyer syndrome do menstruate (without ovulating) if they receive estrogen therapy.
comment: El síndrome de Swyer ocurre cuando una persona nace con cromosomas XY, pero sus gónadas no se han convertido en testículos. Es una forma de disgenesia gonadal, lo que significa que una persona con esta variación tendrá gónadas en franjas que no producen hormonas. Como no producen testosterona, su cuerpo no desarrolla un pene y, por lo general, desarrolla una vulva y una vagina. Dado que no producen otra hormona conocida como hormona antimülleriana (AMH, por sus siglas en inglés), las personas con síndrome de Swyer a menudo también desarrollan útero y trompas de Falopio. Por lo general, no comienzan la pubertad ni comienzan a menstruar, pero algunas personas con síndrome de Swyer menstrúan (sin ovular) si reciben terapia con estrógenos. @es
broader: Intersex variations
has top concept: Sex (Body)
replaces: swyerSyndrome
issued: 2019-05-14
modified: 2025-02-23
type: Concept
in scheme: v3
change note: Version 4.1.0

Tattoos
preferred label: Tatuajes @es
comment: Body modifications in which permanent ink is inserted into the skin to form a design.
comment: Modificaciones corporales en las que se inserta tinta permanente en la piel para formar un diseño. @es
broader: Body adornment
broader: Body modification
has top concept: Body adornment
replaces: tattoos
issued: 2019-05-14
modified: 2025-02-23
type: Concept
in scheme: v3
change note: Version 4.1.0

Tearoom sex
comment: U.S. slang term that refers to anonymous sex in a public bathroom or the practice of cruising for sexual partners in public bathrooms.
comment: Término de la jerga estadounidense que se refiere al sexo anónimo en un baño público o la práctica de buscar parejas sexuales en baños públicos. @es
broader: Sexual practices
related: Anonymous sex
related: Cottaging (Gay culture)
related: Cruising (LGBTQ+ culture)
related: Public sex
related: Tearooms (Gay culture)
has top concept: Sexual practices
replaces: tearoomSex
issued: 2019-05-14
modified: 2025-02-23
type: Concept
in scheme: v3
change note: Version 4.1.0

Tearooms (Gay culture)
preferred label: Tearooms (Cultura gay) @es
alternative label: Tearooms
alternative label: Salones de té @es
comment: U.S. slang term for public bathrooms that are used as locations for sexual encounters.
comment: Término de la jerga estadounidense para los baños públicos que se utilizan como lugar para encuentros sexuales. @es
broader: Sex locations
narrower: Glory holes
related: Cottages (Gay culture)
related: Public bathrooms
related: Tearoom sex
has top concept: Sex locations
replaces: tearooms
issued: 2019-05-14
modified: 2025-02-23
type: Concept
in scheme: v3
change note: Version 4.1.0

LGBTQ+ television
preferred label: Televisión LGBTQ+ @es
alternative label: Television (LGBTQ)
alternative label: Televisión (LGBTQ) @es
comment: Television shows featuring LGBTQ+ characters or themes.
comment: Programas de televisión con personajes o temas LGBTQ+. @es
narrower: Bisexual television
narrower: Gay television
narrower: Lesbian television
narrower: Queer television
narrower: Transgender television
narrower: Asexual television
narrower: Intersex television
related: LGBTQ+ characters
related: Two-Spirit television
related: Drag television programs
replaces: televisionLGBTQ
issued: 2019-05-14
modified: 2025-02-23
type: Concept
in scheme: v3
change note: Version 4.1.0

Terminal care (AIDS)
preferred label: Cuidados terminales (SIDA) @es
comment: End-of-life care for those with AIDS and their families; aimed at optimizing quality of life and mitigating suffering.
comment: Cuidados al final de la vida para personas con SIDA y sus familias; destinados a optimizar la calidad de vida y mitigar el sufrimiento. @es
broader: Health care for LGBTQ+ people
related: LGBTQ+ death and dying
related: AIDS death and dying
has top concept: Health care for LGBTQ+ people
replaces: terminalCareAIDS
issued: 2019-05-14
modified: 2025-02-23
type: Concept
in scheme: v3
change note: Version 4.1.0

Testicle
preferred label: Testículo @es
alternative label: Testicles
alternative label: Balls
alternative label: Nuts
alternative label: Testes
alternative label: Testis
alternative label: Bola @es
alternative label: Pelota @es
alternative label: Cojón @es
alternative label: Huevo @es
alternative label: Canica @es
alternative label: Coco @es
alternative label: Hueva @es
comment: Reproductive gland or gonad that produces sperm and androgens, primarily testosterone.
comment: Gónada o glándula reproductiva que produce espermatozoides y andrógenos, principalmente testosterona. @es
broader: Erogenous body parts
broader: Genitals
broader: Gonads
related: Metoidioplasty
related: Scrotoplasty
has top concept: Erogenous body parts
replaces: testes
issued: 2019-05-14
modified: 2025-02-23
type: Concept
in scheme: v3
change note: Version 4.1.0

Testosterone
preferred label: Testosterona @es
comment: A steroid hormone that is produced in the testes, ovaries, and adrenal cortex. Testosterone is commonly utilized in masculinizing hormone therapy regimens for certain secondary sexual characteristics, such as increased muscle mass and growth of body hair.
comment: Hormona esteroide que se produce en los testículos, los ovarios y la corteza suprarrenal. La testosterona se utiliza comúnmente en regímenes de terapia hormonal masculinizante para ciertas características sexuales secundarias, como el aumento de la masa muscular y el crecimiento del vello corporal. @es
broader: Hormone therapy (Gender)
broader: Hormones
related: FtMs
related: Trans men
has top concept: Medical care
replaces: testosterone
issued: 2019-05-14
modified: 2025-02-23
type: Concept
in scheme: v3
change note: Version 4.1.0

LGBTQ+ theater
preferred label: Teatro LGBTQ+ @es
preferred label: LGBTQ+ theatre
comment: Works in the performance arts that focus on LGBTQ+ characters, communities, or issues.
comment: Trabajos en las artes escénicas que se centran en personajes, comunidades o cuestiones LGBTQ+. @es
narrower: Bisexual theater
narrower: Female impersonators
narrower: Gay theater
narrower: Kabuki
narrower: Lesbian theater
narrower: Male impersonators
narrower: Queer theater
narrower: Striptease
narrower: Transgender theater
narrower: Aromantic theater
narrower: Asexual theater
narrower: Demisexual theater
narrower: Megasexual theater
narrower: Greyromantic theater
narrower: Intersex theater
related: LGBTQ+ drama
related: LGBTQ+ arts
related: LGBTQ+ musicals
related: LGBTQ+ cultural heritage institutions
related: LGBTQ+ special collections
related: Two-Spirit theater
replaces: theatreLGBTQ
issued: 2019-05-14
modified: 2025-03-20
type: Concept
in scheme: v3
change note: Version 4.1.0

LGBTQ+ theology
alternative label: Theology (LGBTQ)
narrower: Queer theology
related: LGBTQ+ African religions
is replaced by: homoit0001218
replaces: theologyLGBTQ
issued: 2019-05-14
modified: 2022-11-17
type: Concept
in scheme: v3
change note: Version 4.1.0

Theories
preferred label: Teorías @es
comment: Systems of ideas intended to explain a particular phenomenon.
comment: Sistemas de ideas destinados a explicar un fenómeno particular. @es
narrower: Essentialism
narrower: Etiology
narrower: Queer theory
narrower: Social constructionism
narrower: Critical race theory
narrower: Feminist theory
narrower: Womanism
narrower: Lavender linguistics
narrower: Queer linguistics
narrower: Decolonial theory
narrower: Compulsory heterosexuality
replaces: theories
issued: 2019-05-14
modified: 2025-04-23
type: Concept
in scheme: v3
change note: Version 4.1.0

Therapies
preferred label: Terapias @es
comment: Treatments addressing impairments, illnesses, diseases, or disorders through counseling and rehabilitation.
comment: Tratamientos que abordan discapacidades, enfermedades, dolencias o trastornos a través del asesoramiento y la rehabilitación. @es
broader: Medical care
narrower: Behavioral therapy
narrower: Conversion therapy
narrower: Hormone therapy (Gender)
narrower: Electroshock therapy
narrower: Herbal treatments
narrower: Medication
narrower: Sex therapy
narrower: Voice therapy (Gender)
related: Mental health care for LGBTQ+ people
related: LGBTQ+ psychology
has top concept: Medical care
replaces: therapies
issued: 2019-05-14
modified: 2025-04-23
type: Concept
in scheme: v3
change note: Version 4.1.0

Thigh harnesses
preferred label: Arnés para el muslo @es
comment: Devices worn to attach a dildo to a person's thigh, typically so they can penetrate a partner's vagina or anus.
comment: Dispositivos que se utilizan para sujetar un consolador al muslo de una persona, generalmente para que pueda penetrar la vagina o el ano de su pareja. @es
broader: Harnesses
related: Dildo harnesses
has top concept: Sex accessories
replaces: thighHarnesses
issued: 2019-05-14
modified: 2025-02-23
type: Concept
in scheme: v3
change note: Version 4.1.0

Third gender
preferred label: Tercer género @es
comment: Social category present in societies that recognize three or more genders.
comment: Categoría social presente en sociedades que reconocen tres o más géneros. @es
broader: Non-Euro-American gender and sexual identities
related: Third gender people
has top concept: Gender
replaces: thirdGender
issued: 2019-05-14
modified: 2025-02-23
type: Concept
in scheme: v3
change note: Version 4.1.0

Third gender people
preferred label: Personas del tercer género @es
comment: Individuals who are categorized (by their will or by social consensus) as neither man nor woman.
comment: Personas que no están categorizadas (por su voluntad o por consenso social) ni como hombre ni como mujer. @es
broader: Transgender people
related: Third gender
has top concept: LGBTQ+ people
replaces: thirdGenderPeople
issued: 2019-05-14
modified: 2025-02-23
type: Concept
in scheme: v3
change note: Version 4.1.0

Thirunangai
comment: Regional term in Tamil Nadu, India for people assigned male at birth who identify as women.
comment: Término regional en Tamil Nadu, la India, para las personas asignadas al sexo masculino al nacer y que se autoidentifican como mujeres. @es
broader: Non-Euro-American gender and sexual identities
related: Aravani
has top concept: Gender
replaces: thirunangai
issued: 2019-05-14
modified: 2025-02-23
type: Concept
in scheme: v3
change note: Version 4.1.0

Thirunambi
comment: Regional term in Tamil Nadu, India for people assigned female at birth who identify as men.
comment: Término regional en Tamil Nadu, la India, para las personas asignadas al sexo femenino al nacer y que se autoidentifican como hombres. @es
broader: Non-Euro-American gender and sexual identities
has top concept: Gender
replaces: thirunambi
issued: 2019-05-14
modified: 2025-02-23
type: Concept
in scheme: v3
change note: Version 4.1.0

Tida wena
comment: In Venezuela's indigenous Warao culture, this term refers to people assigned male at birth who are thought to possess two spirits and often assume a spiritual role; translates to "twisted women."
comment: En la cultura indígena warao de Venezuela, este término se refiere a las personas asignadas al sexo masculino al nacer y que se cree que poseen dos espíritus y que, a menudo, asumen un papel espiritual; se traduce como "mujeres retorcidas". @es
broader: Non-Euro-American gender and sexual identities
related: Two-Spirit people
has top concept: Gender
replaces: tidaWena
issued: 2019-05-14
modified: 2025-02-23
type: Concept
in scheme: v3
change note: Version 4.1.0

Tom
comment: In Thailand, this term is used to describe people assigned female at birth who exhibit masculine traits, often partnering with feminine dees; similar to a butch in U.S. lesbian culture.
comment: En Tailandia, este término se utiliza para describir a las personas asignadas al sexo femenino al nacer y que exhiben rasgos masculinos, a menudo, emparejándose con dees femeninos; similar a una marimacha en la cultura lésbica estadounidense. @es
broader: Non-Euro-American gender and sexual identities
related: Dee
related: Katoey
has top concept: Gender
replaces: tom
issued: 2019-05-14
modified: 2025-02-23
type: Concept
in scheme: v3
change note: Version 4.1.0

Tomboys
preferred label: Marimacho @es
alternative label: Tomboy @es
alternative label: Marimacha @es
alternative label: Machona @es
alternative label: Machorra @es
alternative label: Machota @es
comment: Girls who exhibit some characteristics associated with gender expectations for boys.
comment: Niñas que exhiben algunas características asociadas con las expectativas de género para los niños. @es
broader: Gender roles
broader: Girls
related: Butches
related: Masculine of center
has top concept: Role behavior
replaces: tomboys
issued: 2019-05-14
modified: 2025-02-23
type: Concept
in scheme: v3
change note: Version 4.1.0

Tongzhi
alternative label: Tongzhis @zh
comment: Contemporary term for LGBTQ+ people in China and Taiwan.
comment: Término contemporáneo para las personas LGBTQ+ en China y Taiwán. @es
broader: Sexual minorities
has top concept: Sexual minorities
replaces: tongzhi
issued: 2019-05-14
modified: 2025-02-23
type: Concept
in scheme: v3
change note: Version 4.1.0

Tops (Sex)
preferred label: Tops (sexo) @es
alternative label: Pitchers (Sex)
alternative label: Pitchers
alternative label: Tops
alternative label: Activo @es
comment: Slang term for individuals who act as the giving partner in sexual encounters.
comment: Término de la jerga para personas que asumen el rol de pareja que da en encuentros sexuales. @es
broader: Sexual identity
broader: Sexual roles
narrower: LGBTQ+ mistresses (BDSM culture)
related: Kink community
related: Bottoms (Sex)
related: LGBTQ+ dominants
related: Social privilege
related: LGBTQ+ submissives
related: Switches (Sex)
related: Vers (Sex)
related: Seme (Yaoi)
related: Power exchange
related: Kinky people
has top concept: Sexual identity
replaces: tops
issued: 2019-05-14
modified: 2025-02-23
type: Concept
in scheme: v3
change note: Version 4.1.0

Toxic masculinity
preferred label: Masculinidad tóxica @es
comment: Set of attitudes, behaviors, and cultural norms stereotypically associated with or expected of men and which are regarded as having a negative impact on men and society at large.
comment: Conjunto de actitudes, comportamientos y normas culturales asociadas o esperadas de forma estereotípica de los hombres y que se considera que tienen un impacto negativo en los hombres y la sociedad en general. @es
broader: Masculinities
related: Machismo
related: Social privilege
has top concept: Gender
replaces: toxicMasculinity
issued: 2019-05-14
modified: 2025-02-23
type: Concept
in scheme: v3
change note: Version 4.1.0

Transgender people
preferred label: Personas transgénero @es
alternative label: Trans people
alternative label: Transgendered people
alternative label: Transpeople
alternative label: Trans-people
alternative label: Transgender-identified people
alternative label: Trans-identified people
alternative label: Trans* people
alternative label: Personas trans @es
alternative label: Personas trans* @es
comment: Broad term for people who do not conform to their gender assigned at birth. Add more specific terms when possible.
comment: Término amplio para personas que no se ajustan al género asignado al nacer. Agregue términos más específicos cuando sea posible. @es
broader: LGBTQ+ people
broader: Gender minorities
narrower: Agender people
narrower: Androgynous people
narrower: Bigender people
narrower: Demigender people
narrower: FtXs
narrower: Genderfluid people
narrower: MtXs
narrower: Non-binary people
narrower: Older transgender people
narrower: Pangender people
narrower: Third gender people
narrower: Transsexual people
narrower: Transfeminine people
narrower: Transgender children
narrower: Transgender daughters
narrower: Transgender fathers
narrower: Transgender mothers
narrower: Transgender parents
narrower: Transgender sons
narrower: Transgender youth
narrower: Transmasculine people
narrower: Trigender people
narrower: Trans women
narrower: Trans men
narrower: Transgenderqueer people
narrower: Closeted transgender people
narrower: Transgender college students
narrower: Pregnant transgender people
related: Gender assigned at birth
related: Cisgender people
related: Stealth (Transgender)
related: Crossdressers
related: Hormone therapy (Gender)
related: Non-Euro-American gender and sexual identities
related: Eonist people
related: Gender-affirming surgery
related: Gender diversity
related: Gender identity
related: Gender identity disorder
related: Gender markers
related: Gender non-conforming people
related: Genderqueer people
related: Males
related: No hormone identity
related: Non-operative
related: Parents of transgender people
related: Partners of transgender people
related: Passing (Gender)
related: Persecution of transgender people
related: Post-operative
related: Pre-operative
related: Reading (Gender)
related: Transgender characters
related: Transgender community
related: Transgender community centers
related: Transgender identity
related: Transgender people in the military
related: Transgenderism
related: Transitioning status
related: Transitioning (Gender)
related: Transphobia
related: Transvestites
related: Females
related: Trans
related: t4t

Transgender demonstrations
preferred label: Marchas trans @es
alternative label: Transgender marches
alternative label: Trans marches
alternative label: Transgender rallies
alternative label: Trans rallies
alternative label: Transgender protests
alternative label: Trans protests
alternative label: Trans demonstrations
alternative label: Marchas transgénero @es
comment: Marches, rallies, and other large, public gatherings organized to protest discrimination against trans people and advocate for trans visibility, rights, and issues.
comment: Marchas y encuentros centrados en cuestiones y derechos trans. @es
broader: LGBTQ+ demonstrations
related: Transgender movement
has top concept: LGBTQ+ activism
replaces: transMarches
issued: 2019-05-14
modified: 2025-04-17
type: Concept
in scheme: v3
change note: Version 4.1.0

Transsexuality
preferred label: Transexualidad @es
alternative label: Transexuality
comment: Term used to describe the identity of people who transition from female to male or male to female. Generally refers to individuals who transition their physical bodies to align with their gender identities. Though this term was popular in the 20th century and is still in use today, it has been largely replaced by "transgender identity" and "trans identity." Some but not all people regard this term as outdated and offensive. Only use to describe people who self-identify as transsexual.
comment: Término utilizado para describir la identidad de las personas que hacen la transición de mujer a hombre o de hombre a mujer. Generalmente se refiere a personas que hacen la transición de sus cuerpos físicos para alinearse con sus identidades de género. Aunque este término fue popular en el siglo XX y todavía se utiliza hoy en día, ha sido reemplazado en gran medida por "identidad transgénero" e "identidad trans". Algunas personas, pero no todas, consideran este término obsoleto y ofensivo. Utilícese únicamente para describir a personas que se identifiquen como transexuales. @es
related: Transsexual people
related: Transsexualism
replaces: transsexuality
issued: 2019-05-14
modified: 2025-02-23
type: Concept
in scheme: v3
change note: Version 4.1.0

Transsexual people
preferred label: Personas transexuales @es
alternative label: Transexuals
alternative label: Transsexuals
alternative label: Transexuales @es
comment: Individuals who transition from female to male or male to female. Generally refers to individuals who transition their physical bodies to align with their gender identities. Though this term was popular in the 20th century and is still in use today, it has been largely replaced by "transgender people" and "trans people." Some but not all people regard this term as outdated and offensive. Only use to describe people who self-identify as transsexual.
comment: Personas que hacen la transición de mujer a hombre o de hombre a mujer. Generalmente se refiere a personas que hacen la transición de sus cuerpos físicos para alinearse con sus identidades de género. Aunque este término fue popular en el siglo XX y todavía se utiliza hoy en día, ha sido reemplazado en gran medida por "personas transgénero" y "personas trans". Algunas personas, pero no todas, consideran este término obsoleto y ofensivo. Utilícese únicamente para describir a personas que se identifiquen como transexuales. @es
broader: Transgender people
narrower: FtMs
narrower: MtFs
related: Cissexual people
related: Gender-affirming surgery
related: Gender identity disorder
related: No hormone identity
related: Non-operative
related: Pansexual people
related: Post-operative
related: Pre-operative
related: Transsexuality
related: Transitioning status
related: Transitioning (Gender)
related: Transsexualism
related: Clocking (Gender)
has top concept: LGBTQ+ people
replaces: transsexualPeople
issued: 2019-05-14
modified: 2025-02-23
type: Concept
in scheme: v3
change note: Version 4.1.0

Transfeminine people
preferred label: Personas transfemeninas @es
comment: People who identify partially or fully with a feminine gender identity and who were typically (but not always) assigned male at birth.
comment: Personas que se identifican parcial o totalmente con una identidad de género femenina y a quienes normalmente (pero no siempre) se les asignó al sexo masculino al nacer. @es
broader: Transgender people
related: Femininities
related: Demigirls
related: Transfemininity
related: Feminine of center
has top concept: LGBTQ+ people
replaces: transfemininePeople
issued: 2019-05-14
modified: 2025-02-23
type: Concept
in scheme: v3
change note: Version 4.1.0

Transgender activism
preferred label: Activismo transgénero @es
comment: Direct action and organizing to achieve political or social change and acceptance for transgender people.
comment: Acción directa y organización para lograr cambio político o social y la aceptación de las personas transgénero. @es
broader: LGBTQ+ activism
related: Transgender political activists
has top concept: LGBTQ+ activism
replaces: transgenderActivism
issued: 2019-05-14
modified: 2025-02-23
type: Concept
in scheme: v3
change note: Version 4.1.0

African American transgender people
preferred label: Personas transgénero afroamericanas @es
alternative label: Transgender African American people
alternative label: Transgender African Americans
alternative label: Afroamericanos transgénero @es
alternative label: Afroamericanas transgénero @es
comment: Transgender people of African descent born in the United States or transgender people born in African countries who live in or have a strong connection to the United States. Use for individuals who self-identity as African American. Follow the individual’s preference for African American or Black whenever possible.
comment: Personas transgénero de ascendencia africana nacidas en los Estados Unidos o personas transgénero nacidas en países africanos que viven o tienen una conexión fuerte con los Estados Unidos. Utilícese para personas que se autoidentifiquen como afroamericanas. @es
broader: African American LGBTQ+ people
broader: Black transgender people
has top concept: LGBTQ+ people
replaces: transgenderAfricanAmericans
issued: 2019-05-14
modified: 2025-02-23
type: Concept
in scheme: v3
change note: Version 4.1.0

Afro-Canadian transgender people
preferred label: Personas transgénero afrocanadienses @es
alternative label: Transgender Afro-Canadian people
alternative label: Transgender Afro-Canadians
alternative label: Personas afrocanadienses transgénero @es
alternative label: Afrocanadienses transgénero @es
comment: Transgender people of African descent born in Canada or transgender people born in African countries who live in or have a strong connection to Canada. Use for individuals who self-identify as Afro-Canadian.
comment: Personas transgénero de ascendencia africana nacidas en Canadá o personas transgénero nacidas en países africanos que viven o tienen una conexión fuerte con Canadá. Utilícese para personas que se autoidentifiquen como afrocanadienses. @es
broader: Afro-Canadian LGBTQ+ people
broader: Black transgender people
has top concept: LGBTQ+ people
replaces: transgenderAfroCanadians
issued: 2019-05-14
modified: 2025-02-23
type: Concept
in scheme: v3
change note: Version 4.1.0

Afro-Caribbean transgender people
preferred label: Personas transgénero afrocaribeñas @es
alternative label: Transgender Afro-Caribbean people
alternative label: Transgender Afro-Caribbeans
alternative label: Personas afrocaribeñas transgénero @es
alternative label: Afrocaribeños transgénero @es
alternative label: Afrocaribeñas transgénero @es
comment: Transgender people of African descent born in the Caribbean or transgender people born in African countries who live in or have a strong connection to the Caribbean. Only use for individuals who self-identify as Afro-Caribbean.
comment: Personas transgénero afrodescendientes nacidas en el Caribe o personas transgénero nacidas en países africanos que viven o tienen una conexión fuerte con el Caribe. Utilícese únicamente para personas que se identifiquen como afrocaribeñas. @es
broader: Afro-Caribbean LGBTQ+ people
broader: Black transgender people
has top concept: LGBTQ+ people
replaces: transgenderAfroCaribbeans
issued: 2019-05-14
modified: 2025-02-23
type: Concept
in scheme: v3
change note: Version 4.1.0

Afro-European transgender people
preferred label: Personas transgénero afroeuropeas @es
alternative label: Transgender Afro-European people
alternative label: Transgender Afro-Europeans
alternative label: Personas afroeuropeas transgénero @es
alternative label: Afroeuropeos transgénero @es
alternative label: Afroeuropeas transgénero @es
comment: Transgender people of African descent born in European countries or transgender people born in African countries who live in or have a strong connection to Europe. Only use for individuals who self-identify as Afro-European.
comment: Personas transgénero de ascendencia africana nacidas en países europeos o personas transgénero nacidas en países africanos que viven en Europa o tienen una fuerte conexión con Europa. Utilícese únicamente para personas que se identifiquen como afroeuropeas. @es
broader: Afro-European LGBTQ+ people
broader: Black transgender people
has top concept: LGBTQ+ people
replaces: transgenderAfroEuropeans
issued: 2019-05-14
modified: 2025-02-23
type: Concept
in scheme: v3
change note: Version 4.1.0

Afro-Latin American transgender people
preferred label: Personas transgénero afrolatinoamericanas @es
alternative label: Transgender Afro-Latin American people
alternative label: Transgender Afro-Latin Americans
alternative label: Personas afrolatinoamericanas transgénero @es
alternative label: Afrolatinoamericanos transgénero @es
alternative label: Afrolatinoamericanas transgénero @es
comment: Transgender people of African descent born in Latin American countries or transgender people born in African countries who live in or have a strong connection to Latin America. Only use for individuals who self-identify as Afro-Latin American.
comment: Personas transgénero afrodescendientes nacidas en países latinoamericanos o personas transgénero nacidas en países africanos que viven o tienen una conexión fuerte con América Latina. Utilícese únicamente para personas que se identifiquen como afrolatinoamericanas. @es
broader: Afro-Latin American LGBTQ+ people
broader: Black transgender people
has top concept: LGBTQ+ people
replaces: transgenderAfroLatinAmericans
issued: 2019-05-14
modified: 2025-02-23
type: Concept
in scheme: v3
change note: Version 4.1.0

Transgender archives
preferred label: Archivos transgénero @es
comment: Collections of records and materials relating to transgender people or transgender communities; can include a variety of organizations and institutions from community to government archives.
comment: Colecciones de registros y materiales relacionados con personas transgénero o comunidades transgénero; puede incluir una variedad de organizaciones e instituciones, desde archivos comunitarios hasta gubernamentales. @es
broader: LGBTQ+ archives
has top concept: LGBTQ+ cultural heritage institutions
replaces: transgenderArchives
issued: 2019-05-14
modified: 2026-02-23
type: Concept
in scheme: v3
change note: Version 4.1.0

Transgender artists
preferred label: Artistas transgénero @es
comment: Trans people who practice any of various creative arts.
comment: Artistas conocidos por ser transgénero. @es
broader: LGBTQ+ artists
has top concept: LGBTQ+ people
replaces: transgenderArtists
issued: 2019-05-14
modified: 2025-02-23
type: Concept
in scheme: v3
change note: Version 4.1.0

Asian American transgender people
preferred label: Personas transgénero asiático-americanas @es
alternative label: Transgender Asian American people
alternative label: Transgender Asian Americans
alternative label: Personas asiático-americanas transgénero @es
alternative label: Asiático-americanos transgénero @es
alternative label: Asiático-americanas transgénero @es
comment: Transgender people of Asian heritage or descent born in the United States or born in Asian countries who live in or have a strong connection to the United States. Only use for individuals who self-identify as Asian American.
comment: Personas transgénero de ascendencia asiática nacidas en Estados Unidos o personas transgénero nacidas en países asiáticos que viven en o tienen una conexión fuerte con los Estados Unidos. Utilícese para personas que se autoidentifiquen como asiático-americanas. @es
broader: Asian American LGBTQ+ people
broader: Asian transgender people
has top concept: LGBTQ+ people
replaces: transgenderAsianAmericans
issued: 2019-05-14
modified: 2025-02-23
type: Concept
in scheme: v3
change note: Version 4.1.0

Asian transgender people
preferred label: Personas transgénero asiáticas @es
alternative label: Transgender Asian people
alternative label: Transgender Asians
alternative label: Personas asiáticas transgénero @es
alternative label: Asiáticos transgénero @es
alternative label: Asiáticas transgénero @es
comment: Transgender people of Asian heritage or descent, living in Asia or part of the Asian diaspora. Only use for people who self-identify as Asian.
comment: Personas transgénero nacidas en países asiáticos o descendientes de ellos. Utilícese únicamente para personas que se autoidentifiquen como asiáticas. @es
broader: Asian LGBTQ+ people
narrower: Asian American transgender people
has top concept: LGBTQ+ people
replaces: transgenderAsians
issued: 2019-05-14
modified: 2025-02-23
type: Concept
in scheme: v3
change note: Version 4.1.0

Transgender atheists
preferred label: Ateos transgénero @es
comment: Transgender people who are atheists.
comment: Personas transgénero que son ateas. @es
broader: LGBTQ+ atheists
has top concept: LGBTQ+ people
replaces: transgenderAtheists
issued: 2019-05-14
modified: 2025-02-23
type: Concept
in scheme: v3
change note: Version 4.1.0

Transgender bars
preferred label: Bares transgénero @es
comment: Drinking establishments that primarily cater to transgender people.
comment: Establecimientos de bebidas que atienden principalmente a personas transgénero. @es
broader: LGBTQ+ bars
has top concept: LGBTQ+ meeting places
replaces: transgenderBars
issued: 2019-05-14
modified: 2025-02-23
type: Concept
in scheme: v3
change note: Version 4.1.0

Transgender beaches
preferred label: Playas transgénero @es
comment: Beaches set aside for use by transgender people or beaches known to be frequented by transgender people.
comment: Playas reservadas para uso por personas transgénero o playas conocidas por ser frecuentadas por personas transgénero. @es
broader: LGBTQ+ beaches
has top concept: LGBTQ+ meeting places
replaces: transgenderBeaches
issued: 2019-05-14
modified: 2025-02-23
type: Concept
in scheme: v3
change note: Version 4.1.0

Black transgender people
preferred label: Personas transgénero negras @es
alternative label: Transgender Black people
alternative label: Personas negras transgénero @es
comment: Black people who are transgender. Use only for individuals who self-identity as Black. Follow the individual’s preference for African American or Black whenever possible.
comment: Personas negras que son queer. Utilícese únicamente para personas que seautoidentificancomo negras. Siga la preferencia del individuo para el uso de afroamericanos o negros siempre que sea posible. @es
broader: Black LGBTQ+ people
narrower: African American transgender people
narrower: Afro-Canadian transgender people
narrower: Afro-Caribbean transgender people
narrower: Afro-European transgender people
narrower: Afro-Latin American transgender people
related: Black Trans Lives Matter movement
has top concept: LGBTQ+ people
replaces: transgenderBlackPeople
issued: 2019-05-14
modified: 2025-02-23
type: Concept
in scheme: v3
change note: Version 4.1.0

Transgender bookshops
preferred label: Librerías transgénero @es
comment: Bookshops that sell materials intended for use by transgender people or addressing topics related to transgender experiences.
comment: Librerías que venden materiales destinados a personas transgénero o que abordan temas relacionados con experiencias transgénero. @es
broader: LGBTQ+ bookshops
has top concept: LGBTQ+ bookshops
replaces: transgenderBookshops
issued: 2019-05-14
modified: 2025-02-23
type: Concept
in scheme: v3
change note: Version 4.1.0

Transgender Buddhists
preferred label: Budistas transgénero @es
comment: Transgender people who are Buddhist.
comment: Personas transgénero que son budistas. @es
broader: LGBTQ+ Buddhists
has top concept: LGBTQ+ African religions
replaces: transgenderBuddhists
issued: 2019-05-14
modified: 2025-02-23
type: Concept
in scheme: v3
change note: Version 4.1.0

Transgender characters
preferred label: Personajes transgénero @es
comment: Characters in creative works who are transgender.
comment: Personajes de obras creativas que son transgénero. @es
broader: LGBTQ+ characters
related: Transgender people
related: Transgender children
has top concept: LGBTQ+ characters
replaces: transgenderCharacters
issued: 2019-05-14
modified: 2025-02-23
type: Concept
in scheme: v3
change note: Version 4.1.0

Transgender children
preferred label: Niños transgénero @es
comment: Transgender people who have not yet reached the age of adolescence.
comment: Niños menores de 18 años que se autoidentifican como transgénero. @es
broader: LGBTQ+ children
broader: Transgender people
broader: Transgender youth
narrower: Transgender daughters
narrower: Transgender sons
related: Puberty blockers
related: Transgender characters
related: Transgender identity
related: Transgender health care bans for children and youth
related: Health care for transgender children and youth
has top concept: Family members
replaces: transgenderChildren
issued: 2019-05-14
modified: 2025-02-23
type: Concept
in scheme: v3
change note: Version 4.1.0

Transgender Christians
preferred label: Cristianos transgénero @es
comment: Transgender people who are Christian.
comment: Personas transgénero que son cristianas. @es
broader: LGBTQ+ Christians
has top concept: LGBTQ+ African religions
replaces: transgenderChristians
issued: 2019-05-14
modified: 2025-02-23
type: Concept
in scheme: v3
change note: Version 4.1.0

Transgender clergy
preferred label: Clero transgénero @es
comment: Transgender people who are ordained for religious duties, particularly in the Christian Church.
comment: Personas transgénero que están ordenadas para deberes religiosos, particularmente en la Iglesia cristiana. @es
broader: LGBTQ+ clergy
related: Bisexual clergy
related: Celibacy
related: Gay clergy
related: Lesbian clergy
related: Queer clergy
has top concept: LGBTQ+ clergy
replaces: transgenderClergy
issued: 2019-05-14
modified: 2025-02-23
type: Concept
in scheme: v3
change note: Version 4.1.0

Transgender community
preferred label: Comunidad transgénero @es
comment: Groups of people who share the experience of being transgender.
comment: Grupos de personas que comparten la experiencia de ser transgénero. @es
broader: LGBTQ+ communities
related: LGBT
related: LGB
related: LGBTI
related: LGBTQ
related: LGBTQ+
related: LGBTQIA
related: Transgender people
related: t4t
related: 2SLGBTQ+
related: Trans joy
has top concept: LGBTQ+ communities
replaces: transgenderCommunity
issued: 2019-05-14
modified: 2025-02-23
type: Concept
in scheme: v3
change note: Version 4.1.0

Transgender community centers
preferred label: Centros comunitarios transgénero @es
preferred label: Transgender community centres
comment: Spaces in which people from transgender communities meet for social, education, recreational, or organizing activities.
comment: Espacios en los que personas de comunidades transgénero se reúnen para actividades sociales, educativas, recreativas u organizativas. @es
broader: LGBTQ+ community centers
related: Transgender people
has top concept: LGBTQ+ centers
replaces: transgenderCommunityCentres
issued: 2019-05-14
modified: 2025-02-23
type: Concept
in scheme: v3
change note: Version 4.1.0

Transgender couples
preferred label: Parejas transgénero @es
comment: Partnerships in which both people are transgender.
comment: Relaciones en las que ambas personas son transgénero. @es
broader: LGBTQ+ couples
has top concept: Relationship satisfaction
replaces: transgenderCouples
issued: 2019-05-14
modified: 2025-02-23
type: Concept
in scheme: v3
change note: Version 4.1.0

Transgender culture
preferred label: Cultura transgénero @es
comment: Cultural experiences shared by members of transgender communities or products of transgender culture (e.g., art and media created by and for transgender people, activism focused on transgender issues, slang commonly used in transgender communities, etc.).
comment: Experiencias culturales compartidas por miembros de comunidades transgénero o productos de la cultura transgénero (por ejemplo, arte y medios creados por y para personas transgénero, activismo centrado en cuestiones transgénero, jerga comúnmente utilizada en comunidades transgénero, etc.). @es
broader: LGBTQ+ culture
narrower: Transgender slang
related: Sexual identity
related: Queer culture
related: Bisexual culture
has top concept: Subcultures
replaces: transgenderCulture
issued: 2019-05-14
modified: 2025-02-23
type: Concept
in scheme: v3
change note: Version 4.1.0

Transgender daughters
preferred label: Hijas transgénero @es
comment: Daughters who identify as transgender.
comment: Hijas que se identifican como transgénero. @es
broader: LGBTQ+ daughters
broader: Transgender people
broader: Transgender children
has top concept: LGBTQ+ people
replaces: transgenderDaughters
issued: 2019-05-14
modified: 2025-02-23
type: Concept
in scheme: v3
change note: Version 4.1.0

Transgender Day of Remembrance
preferred label: Día Internacional de la Memoria Transgénero @es
alternative label: TDOR
alternative label: TDoR
alternative label: Trans Day of Remembrance
alternative label: Transgender Day of Rememberance @es
alternative label: Día Internacional de la Remembranza Trans @es
alternative label: Día Internacional de la Memoria Trans @es
comment: International day of observance recognized annually on November 20 to honor the memory and lives of trans people who were murdered in the previous 12 months and to draw attention to the continued violence against trans people. Transgender Day of Remembrance (abbreviated TDoR) was founded in 1999 by a small group of trans people, including Gwendolyn Ann Smith, to memorialize Rita Hester, a trans woman murdered in Allston, Massachusetts.
comment: Día internacional de conmemoración reconocido anualmente el 20 de noviembre para honrar la memoria y las vidas de las personas trans que fueron asesinadas en los 12 meses anteriores y para concientizar sobre la continua violencia contra las personas trans. El Día de la Memoria Transgénero (TDoR, por sus siglas en inglés) fue fundado en 1999 por un pequeño grupo de personas trans, incluida Gwendolyn Ann Smith, para conmemorar a Rita Hester, una mujer trans asesinada en Allston, Massachusetts. @es
broader: LGBTQ+ memorials
has top concept: LGBTQ+ memorials
replaces: transgenderDayOfRemembrance
issued: 2019-05-14
modified: 2025-02-23
type: Concept
in scheme: v3
change note: Version 4.1.0

Transgender information centers
preferred label: Centros de información transgénero @es
preferred label: Transgender information centres
alternative label: Transgender documentation centers
alternative label: Centros de documentación transgénero @es
comment: Institutions providing education, support, and information about transgender issues and transgender communities to transgender people.
comment: Instituciones que brindan educación, apoyo e información sobre asuntos transgénero y comunidades transgénero a personas transgénero. @es
broader: LGBTQ+ information centers
related: Transgender movement
related: Transgenderism
has top concept: LGBTQ+ centers
replaces: transgenderInformationCentres
issued: 2019-05-14
modified: 2025-02-23
type: Concept
in scheme: v3
change note: Version 4.1.0

Transgender dominatrices
preferred label: Dominatrices transgénero @es
comment: Women who take a dominant role in BDSM activities; use for dominatrices who identify as transgender.
comment: Mujeres que desempeñan un papel dominante en las actividades de BDSM; utilícese para dominatrices que se autoidentifican como transgénero. @es
broader: LGBTQ+ dominatrices
related: Bisexual dominatrices
related: Lesbian dominatrices
related: Queer dominatrices
has top concept: Relationship minorities
replaces: transgenderDominatrices
issued: 2019-05-14
modified: 2025-02-23
type: Concept
in scheme: v3
change note: Version 4.1.0

Transgender drama
preferred label: Drama transgénero @es
comment: Works of fiction written to be performed; use in reference to dramatic works focusing on transgender characters or themes.
comment: Obras de ficción escritas para ser puestas en escena; utilícese en referencia a obras dramáticas que se centran en personajes o temas transgénero. @es
broader: LGBTQ+ drama
related: Transgender authors
has top concept: Subcultures
replaces: transgenderDrama
issued: 2019-05-14
modified: 2025-02-23
type: Concept
in scheme: v3
change note: Version 4.1.0

Transgender families
preferred label: Familias transgénero @es
comment: Families, whether biological, adoptive, or chosen, in which one or more individuals identify as transgender.
comment: Familias, ya sean biológicas, adoptivas o elegidas, en las que una o más personas se autoidentifican como transgénero. @es
broader: LGBTQ+ families
related: Children of transgender people
related: Transgender parents
related: People with transgender parents
has top concept: LGBTQ+ families
replaces: transgenderFamilies
issued: 2019-05-14
modified: 2025-02-23
type: Concept
in scheme: v3
change note: Version 4.1.0

Transgender fathers
preferred label: Padres transgénero @es
comment: Transgender people who are fathers.
comment: Personas transgénero que son padres. @es
broader: Transgender people
broader: Transgender parents
broader: LGBTQ+ fathers
has top concept: LGBTQ+ people
replaces: transgenderFathers
issued: 2019-05-14
modified: 2025-02-23
type: Concept
in scheme: v3
change note: Version 4.1.0

Transgender fiction
preferred label: Ficción transgénero @es
comment: Written works describing imagined events or people; use in reference to fictional works focusing on transgender characters or themes.
comment: Obras escritas que describen eventos o personas imaginadas; utilícese en referencia a obras de ficción que se centran en personajes o temas transgénero. @es
broader: LGBTQ+ fiction
related: Transgender authors
related: Intersex fiction
related: Aromantic fiction
related: Asexual fiction
related: Transfic
related: Transgender people in fandom
has top concept: Subcultures
replaces: transgenderFiction
issued: 2019-05-14
modified: 2026-02-23
type: Concept
in scheme: v3
change note: Version 4.1.0

Transgender identity
preferred label: Identidad transgénero @es
comment: Identity term used to describe people who cross or transgress the gender they were assigned at birth.
comment: Término identitario utilizado para describir a las personas que traspasan o transgreden el género que les fue asignado al nacer. @es
broader: Gender identity
related: Transgender people
related: Transgender children
related: Trans
has top concept: Gender
replaces: transgenderIdentity
issued: 2019-05-14
modified: 2025-02-23
type: Concept
in scheme: v3
change note: Version 4.1.0

Jewish transgender people
preferred label: Personas transgénero judías @es
alternative label: Transgender Jews
alternative label: Judíos transgénero @es
comment: Transgender people who are Jewish.
comment: Personas transgénero que son judíos. @es
broader: Jewish LGBTQ+ people
has top concept: LGBTQ+ people
replaces: transgenderJews
issued: 2019-05-14
modified: 2025-02-23
type: Concept
in scheme: v3
change note: Version 4.1.0

Latino/a/x transgender people
preferred label: Personas transgénero Latinx @es
alternative label: Latina transgender people
alternative label: Latine transgender people
alternative label: Latino transgender people
alternative label: Latinx transgender people
alternative label: Transgender Latinas
alternative label: Transgender Latine people
alternative label: Transgender Latinos
alternative label: Transgender Latinx people
comment: Latin American people who are transgender; only use to describe individuals who self-identify as Latino, Latina, or Latinx. Do not conflate with Chicano/a/x or Hispanic.
comment: Personas latinoamericanas que son transgénero; utilícese únicamente para describir a personas que se autoidentifican como latinos, latinas o latinxs. No debe confundirse con chicano/a/x o hispano/a/x. @es
broader: Latino/a/x LGBTQ+ people
has top concept: LGBTQ+ people
replaces: transgenderLatinx
issued: 2019-05-14
modified: 2025-02-23
type: Concept
in scheme: v3
change note: Version 4.1.0

Transgender libraries
preferred label: Bibliotecas transgénero @es
comment: Libraries that hold materials primarily pertaining to transgender people or intended for use by transgender people.
comment: Bibliotecas que contienen materiales principalmente relacionados con personas transgénero o destinados a personas transgénero. @es
broader: LGBTQ+ libraries
has top concept: LGBTQ+ cultural heritage institutions
replaces: transgenderLibraries
issued: 2019-05-14
modified: 2026-02-23
type: Concept
in scheme: v3
change note: Version 4.1.0

Transgender literature
preferred label: Literatura transgénero @es
comment: Written literary works about transgender characters or themes.
comment: Obras literarias escritas sobre personajes o temas transgénero. @es
broader: LGBTQ+ literature
related: Transgender authors
related: Transgender people in literature
has top concept: Subcultures
replaces: transgenderLiterature
issued: 2019-05-14
modified: 2025-04-23
type: Concept
in scheme: v3
change note: Version 4.1.0

Transgender dominants
preferred label: Dominantes transgénero @es
alternative label: Transgender masters
alternative label: Amos transgénero @es
comment: Transgender people who are part of the BDSM scene and assume the dominant role in sexual relationships with a dominant/submissive dynamic.
comment: Personas transgénero que forman parte de la escena BDSM y asumen el rol dominante en las relaciones sexuales con una dinámica dominante/sumisa. @es
broader: LGBTQ+ dominants
has top concept: Sexual identity
replaces: transgenderMasters
issued: 2019-05-14
modified: 2025-02-23
type: Concept
in scheme: v3
change note: Version 4.1.0

Transgender mistresses
preferred label: Amas transgénero @es
comment: Transgender women who are part of the BDSM scene and assume the mistress role in sexual relationships with a mistress/submissive dynamic.
comment: Mujeres transgénero que forman parte de la escena BDSM y asumen el rol de amas en relaciones sexuales con una dinámica ama/esclava. @es
broader: LGBTQ+ mistresses (BDSM culture)
related: Bisexual mistresses
related: Lesbian mistresses
related: Queer mistresses
has top concept: Sexual identity
replaces: transgenderMistresses
issued: 2019-05-14
modified: 2026-02-24
type: Concept
in scheme: v3
change note: Version 4.1.0

Transgender mothers
preferred label: Madres transgénero @es
alternative label: Mamás transgénero @es
comment: Transgender people who are mothers.
comment: Personas transgénero que son madres. @es
broader: Transgender people
broader: Transgender parents
broader: LGBTQ+ mothers
has top concept: LGBTQ+ people
replaces: transgenderMothers
issued: 2019-05-14
modified: 2025-02-23
type: Concept
in scheme: v3
change note: Version 4.1.0

Transgender movement
preferred label: Movimiento transgénero @es
alternative label: Transgender Movement @es
comment: Umbrella term for activism focused on the rights of transgender people and issues faced by transgender communities.
comment: Término general para el activismo centrado en los derechos de las personas transgénero y los problemas que enfrentan las comunidades transgénero. @es
broader: LGBTQ+ movement
related: Transgender information centers
related: Transgender press
related: Transgender television
related: Transgenderism
related: Transgender demonstrations
has top concept: Social movements
replaces: transgenderMovement
issued: 2019-05-14
modified: 2025-04-17
type: Concept
in scheme: v3
change note: Version 4.1.0

Transgender museums
preferred label: Museos transgénero @es
comment: Institutions dedicated to the storage, exhibition, conservation, and preservation of materials relating to transgender people and transgender history.
comment: Instituciones dedicadas al almacenamiento, la exhibición, la conservación y la preservación de materiales relacionados con las personas transgénero y la historia transgénero. @es
broader: LGBTQ+ museums
has top concept: LGBTQ+ cultural heritage institutions
replaces: transgenderMuseums
issued: 2019-05-14
modified: 2026-02-23
type: Concept
in scheme: v3
change note: Version 4.1.0

Transgender Muslims
preferred label: Musulmanes transgénero @es
comment: Transgender people who are Muslim.
comment: Personas transgénero que son musulmanas. @es
broader: LGBTQ+ Muslims
has top concept: LGBTQ+ African religions
replaces: transgenderMuslims
issued: 2019-05-14
modified: 2025-02-23
type: Concept
in scheme: v3
change note: Version 4.1.0

Native American transgender people
preferred label: Personas transgénero nativoamericanas @es
alternative label: American Indian transgender people
alternative label: Transgender American Indians
alternative label: Transgender Native Americans
alternative label: Personas nativoamericanas transgénero @es
comment: People who are part of the Native peoples of the continental United States and Canada (excluding Inuit people) and self-identity as transgender. Use more specific terms when available.
comment: Personas transgénero que son nativoamericanas o parte de los pueblos indígenas de Norteamérica; utilícese únicamente para personas que se autoidentifiquen como nativoamericanas y transgénero. @es
broader: Native American LGBTQ+ people
has top concept: LGBTQ+ people
replaces: transgenderNativeAmericans
issued: 2019-05-14
modified: 2025-02-23
type: Concept
in scheme: v3
change note: Version 4.1.0

Transgender newsletters
preferred label: Boletines transgénero @es
comment: Serialized print or digital periodicals created by or for transgender people, often with the purpose of sharing news and information related to transgender communities and transgender issues.
comment: Publicaciones periódicas impresas o digitales serializadas creadas por o para personas transgénero, a menudo con el propósito de compartir noticias e información relacionadas con comunidades transgénero y asuntos transgénero. @es
broader: LGBTQ+ newsletters
broader: Transgender press
related: Transgender newspapers
has top concept: LGBTQ+ press
replaces: transgenderNewsletters
issued: 2019-05-14
modified: 2025-02-23
type: Concept
in scheme: v3
change note: Version 4.1.0

Transgender newspapers
preferred label: Periódicos transgénero @es
alternative label: Diarios transgénero @es
comment: Serialized print or digital publications about transgender people or transgender issues (and typically produced by transgender people or transgender organizations) that contain news, articles, columns, correspondence, and advertisements.
comment: Publicaciones impresas o digitales serializadas sobre personas transgénero o asuntos transgénero (y generalmente producidas por personas transgénero u organizaciones transgénero) que contienen noticias, artículos, columnas, correspondencia y anuncios. @es
broader: LGBTQ+ newspapers
broader: Transgender press
related: Transgender newsletters
has top concept: LGBTQ+ press
replaces: transgenderNewspapers
issued: 2019-05-14
modified: 2025-02-23
type: Concept
in scheme: v3
change note: Version 4.1.0

Transgender Pagans
preferred label: Paganos transgénero @es
comment: Transgender people who are members of polytheistic religions or other religions outside of the dominant culture that typically incorporate nature worship and/or the sacred feminine, such as Wicca, Druidry, Heathenry, etc. Use to describe transgender people who self-identify as Pagan.
comment: Personas transgénero que son miembros de religiones politeístas u otras religiones fuera de la cultura dominante que típicamente incorporan el culto a la naturaleza y/o lo sagrado femenino, como la Wicca, el druidismo, el paganismo, etc. Utilícese para describir a las personas transgénero que se autoidentifican como paganas. @es
broader: LGBTQ+ Pagans
related: Transgender witches
has top concept: LGBTQ+ African religions
replaces: transgenderPagans
issued: 2019-05-14
modified: 2025-02-23
type: Concept
in scheme: v3
change note: Version 4.1.0

Transgender parents
preferred label: Madres y padres transgénero @es
alternative label: Madres transgénero @es
alternative label: Padres transgénero @es
comment: Transgender people who are parents.
comment: Personas transgénero que son padres y/o madres. @es
broader: LGBTQ+ parents
broader: Transgender people
narrower: Transgender fathers
narrower: Transgender mothers
related: Children of transgender people
related: Transgender families
related: LGBTQ+ family generations
related: People with transgender parents
has top concept: LGBTQ+ families
replaces: transgenderParents
issued: 2019-05-14
modified: 2025-02-23
type: Concept
in scheme: v3
change note: Version 4.1.0

Transgender people in the military
preferred label: Personas transgénero en el ejército @es
alternative label: Personas transgénero en las fuerzas armadas @es
comment: Transgender people serving in state and national armed forces.
comment: Personas transgénero que sirven en las fuerzas armadas estatales y nacionales. @es
broader: LGBTQ+ people in the military
related: Transgender people
has top concept: Legal status
replaces: transgenderPeopleInTheMilitary
issued: 2019-05-14
modified: 2025-02-23
type: Concept
in scheme: v3
change note: Version 4.1.0

Transgender people of color
preferred label: Personas transgénero de color @es
preferred label: Transgender people of colour
alternative label: Trans people of color
comment: Primarily used in the United States, this term refers to transgender people who are not white and who identify as people of color.
comment: Personas transgénero que no son blancas y que se autoidentifican como personas de color. @es
broader: LGBTQ+ people of color
has top concept: LGBTQ+ people
replaces: transgenderPeopleOfColour
issued: 2019-05-14
modified: 2025-02-23
type: Concept
in scheme: v3
change note: Version 4.1.0

Transgender poetry
preferred label: Poesía transgénero @es
comment: Literary works, typically written in verse, that focus on transgender characters, transgender themes, or transgender identity.
comment: Obras literarias, normalmente escritas en verso, que se centran en personajes transgénero, temas transgénero o la identidad transgénero. @es
broader: LGBTQ+ poetry
related: Transgender authors
has top concept: Subcultures
replaces: transgenderPoetry
issued: 2019-05-14
modified: 2025-02-23
type: Concept
in scheme: v3
change note: Version 4.1.0

Transgender political activists
preferred label: Activistas políticos transgénero @es
comment: Transgender people working to bring about political or social change through public organizing.
comment: Personas transgénero que trabajan para lograr cambios políticos o sociales a través de la organización pública. @es
broader: LGBTQ+ political activists
related: Transgender activism
has top concept: LGBTQ+ people
replaces: transgenderPoliticalActivists
issued: 2019-05-14
modified: 2025-02-23
type: Concept
in scheme: v3
change note: Version 4.1.0

Transgender porn films
preferred label: Películas porno transgénero @es
alternative label: Películas pornográficas transgénero @es
comment: Erotic or sexually explicit films featuring transgender people.
comment: Películas eróticas o sexualmente explícitas protagonizadas por personas transgénero. @es
broader: LGBTQ+ porn films
broader: Transgender erotic art
related: Transgender erotic films
has top concept: Subcultures
replaces: transgenderPornFilms
issued: 2019-05-14
modified: 2025-02-23
type: Concept
in scheme: v3
change note: Version 4.1.0

Transgender press
preferred label: Prensa transgénero @es
comment: Newspapers, magazines, or other publishing outlets aimed at transgender audiences and/or operated by transgender people.
comment: Periódicos, revistas u otros medios editoriales dirigidos a audiencias transgénero y/o operados por personas transgénero. @es
broader: LGBTQ+ press
narrower: Transgender newsletters
narrower: Transgender newspapers
narrower: Transgender zines
related: LGBTQ+ magazines
related: Transgender movement
has top concept: LGBTQ+ press
replaces: transgenderPress
issued: 2019-05-14
modified: 2025-02-23
type: Concept
in scheme: v3
change note: Version 4.1.0

Transgender sex workers
preferred label: Trabajadores sexuales transgénero @es
alternative label: Trans sex workers
alternative label: Transgender prostitutes
alternative label: Trans prostitutes
alternative label: Transgender prostitution
alternative label: Transgender sex work
alternative label: Trans sex work
comment: Transgender people who receive money or goods in exchange for sexual services, performances, or companionship. Use to describe transgender people working across the broad spectrum of sex work.
comment: Personas transgénero que reciben dinero o bienes a cambio de servicios o actuaciones sexuales. Se utiliza para describir a las personas transgénero que trabajan en el amplio espectro del trabajo sexual. @es
broader: LGBTQ+ sex workers
has top concept: Sex workers
replaces: transgenderProstitutes
issued: 2019-05-14
modified: 2025-02-23
type: Concept
in scheme: v3
change note: Version 4.1.0

Transgender prostitution
is replaced by: homoit0001437
replaces: transgenderProstitution
issued: 2019-05-14
modified: 2025-01-28
type: Concept
in scheme: v3
change note: Version 4.1.0

Transgender Protestants
preferred label: Protestantes transgénero @es
comment: Transgender people who are members of the Protestant Church.
comment: Personas transgénero que son miembros de la Iglesia protestante. @es
broader: LGBTQ+ Protestants
has top concept: LGBTQ+ African religions
replaces: transgenderProtestants
issued: 2019-05-14
modified: 2025-02-23
type: Concept
in scheme: v3
change note: Version 4.1.0

Transgender publishers
preferred label: Editoriales transgénero @es
comment: Companies and organizations that publish materials for transgender communities or addressing transgender issues.
comment: Empresas y organizaciones que publican materiales para comunidades transgénero o que abordan asuntos transgénero. @es
broader: LGBTQ+ publishers
has top concept: LGBTQ+ publishers
replaces: transgenderPublishers
issued: 2019-05-14
modified: 2025-02-23
type: Concept
in scheme: v3
change note: Version 4.1.0

Transgender radio
preferred label: Radio transgénero @es
comment: Auditory content broadcast on the radio (analog or digital) about transgender people and transgender issues.
comment: Contenidos auditivos transmitidos por radio (analógica o digital) sobre personas transgénero y asuntos transgénero. @es
broader: LGBTQ+ radio
has top concept: LGBTQ+ radio
replaces: transgenderRadio
issued: 2019-05-14
modified: 2026-02-23
type: Concept
in scheme: v3
change note: Version 4.1.0

Transgender relationships
preferred label: Relaciones transgénero @es
comment: Ongoing connections (romantic, sexual, or platonic) between two or more transgender people.
comment: Conexiones continuas (románticas, sexuales o platónicas) entre dos o más personas transgénero. @es
broader: Relationship satisfaction
related: Bisexual relationships
related: Gay relationships
related: Lesbian relationships
related: Queer relationships
has top concept: Relationship satisfaction
replaces: transgenderRelationships
issued: 2019-05-14
modified: 2025-02-23
type: Concept
in scheme: v3
change note: Version 4.1.0

Transgender rights
preferred label: Derechos de personas transgénero @es
comment: Legal, social, or ethical principles of freedom or entitlement held by transgender people.
comment: Principios legales, sociales o éticos de libertad o derechos que tienen las personas transgénero. @es
broader: LGBTQ+ civil rights
has top concept: Human rights
replaces: transgenderRights
issued: 2019-05-14
modified: 2025-02-23
type: Concept
in scheme: v3
change note: Version 4.1.0

Transgender Roman Catholics
preferred label: Personas católico romanas transgénero @es
alternative label: Católico romanos transgénero @es
comment: Transgender people who are members of the Roman Catholic Church.
comment: Personas transgénero que son miembros de la Iglesia católica romana. @es
broader: LGBTQ+ Roman Catholics
has top concept: LGBTQ+ African religions
replaces: transgenderRomanCatholics
issued: 2019-05-14
modified: 2025-02-23
type: Concept
in scheme: v3
change note: Version 4.1.0

Transgender slang
preferred label: Jerga transgénero @es
alternative label: Argot transgénero @es
comment: Colloquial or informal language related to transgender identity or used by transgender people.
comment: Lenguaje coloquial o informal relacionado con la identidad transgénero o utilizado por personas transgénero. @es
broader: LGBTQ+ slang
broader: Transgender culture
has top concept: LGBTQ+ slang
replaces: transgenderSlang
issued: 2019-05-14
modified: 2025-02-23
type: Concept
in scheme: v3
change note: Version 4.1.0

Transgender sons
preferred label: Hijos transgénero @es
comment: Transgender people who are sons.
comment: Personas transgénero que son hijos. @es
broader: LGBTQ+ sons
broader: Transgender people
broader: Transgender children
has top concept: LGBTQ+ people
replaces: transgenderSons
issued: 2019-05-14
modified: 2025-02-23
type: Concept
in scheme: v3
change note: Version 4.1.0

Transgender studies
preferred label: Estudios transgénero @es
comment: Academic field of research and study about transgender people, transgender identity, and transgender communities.
comment: Campo académico de investigación y estudio sobre personas transgénero, la identidad transgénero y comunidades transgénero. @es
broader: Gender studies
related: Bisexual studies
related: Gay studies
related: Lesbian studies
related: Queer studies
related: Transgenderism
has top concept: Gender studies
replaces: transgenderStudies
issued: 2019-05-14
modified: 2026-02-24
type: Concept
in scheme: v3
change note: Version 4.1.0

Transgender survivors of hate crimes
preferred label: Sobrevivientes transgénero de crímenes de odio @es
comment: Transgender people who have experienced and survived hate crimes; follow the individual's preference for "victims" or "survivors" whenever possible.
comment: Personas transgénero que han sufrido y sobrevivido crímenes de odio; siga la preferencia de la persona sobre el uso de "víctimas" o "sobrevivientes" siempre que sea posible. @es
broader: LGBTQ+ survivors of hate crimes
broader: Transgender victims of hate crimes
has top concept: LGBTQ+ people
replaces: transgenderSurvivorsOfHateCrimes
issued: 2019-05-14
modified: 2025-02-23
type: Concept
in scheme: v3
change note: Version 4.1.0

Transgender survivors of rape
preferred label: Sobrevivientes transgénero de violación @es
comment: Transgender people who have experienced and survived rape; follow the individual's preference for "victims" or "survivors" whenever possible.
comment: Personas transgénero que han sufrido y sobrevivido una violación; siga la preferencia de la persona sobre el uso de "víctimas" o "sobrevivientes" siempre que sea posible. @es
broader: LGBTQ+ survivors of rape
broader: Transgender victims of rape
has top concept: LGBTQ+ people
replaces: transgenderSurvivorsOfRape
issued: 2019-05-14
modified: 2025-02-23
type: Concept
in scheme: v3
change note: Version 4.1.0

Transgender survivors of sexual abuse
preferred label: Sobrevivientes transgénero de abuso sexual @es
comment: Transgender people who have experienced and survived sexual abuse; follow the individual's preference for "victims" or "survivors" whenever possible.
comment: Personas transgénero que han sufrido y sobrevivido abusos sexuales; siga la preferencia de la persona sobre el uso de "víctimas" o "sobrevivientes" siempre que sea posible. @es
broader: LGBTQ+ survivors of sexual abuse
broader: Transgender victims of sexual abuse
has top concept: LGBTQ+ people
replaces: transgenderSurvivorsOfSexualAbuse
issued: 2019-05-14
modified: 2025-02-23
type: Concept
in scheme: v3
change note: Version 4.1.0

Transgender survivors of war
preferred label: Sobrevivientes transgénero de guerra @es
comment: Transgender people who have experienced and survived war; follow the individual's preference for "victims" or "survivors" whenever possible.
comment: Personas transgénero que han sufrido y sobrevivido la guerra; siga la preferencia de la persona sobre el uso de "víctimas" o "sobrevivientes" siempre que sea posible. @es
broader: LGBTQ+ survivors of war
broader: Transgender victims of war
has top concept: LGBTQ+ people
replaces: transgenderSurvivorsOfWar
issued: 2019-05-14
modified: 2025-02-23
type: Concept
in scheme: v3
change note: Version 4.1.0

Transgender youth
preferred label: Juventud transgénero @es
alternative label: Transgender teenagers
alternative label: Transgender adolescents
alternative label: Transgender teens
alternative label: Adolescentes transgénero @es
alternative label: Jóvenes transgénero @es
comment: Transgender people who are between the ages of childhood and adulthood.
comment: Personas transgénero que se encuentran entre las edades de la niñez y la edad adulta. @es
broader: Transgender people
broader: LGBTQ+ youth
narrower: Transgender children
related: Transgender youth literature
related: Transgender health care bans for children and youth
related: Health care for transgender children and youth
has top concept: LGBTQ+ people
replaces: transgenderYouth
issued: 2019-05-14
modified: 2025-02-23
type: Concept
in scheme: v3
change note: Version 4.1.0

Transgender television
preferred label: Televisión transgénero @es
comment: Television shows featuring transgender characters or themes.
comment: Programas de televisión con personajes o temas transgénero. @es
broader: LGBTQ+ television
related: Transgender movement
has top concept: LGBTQ+ television
replaces: transgenderTelevision
issued: 2019-05-14
modified: 2025-02-23
type: Concept
in scheme: v3
change note: Version 4.1.0

Transgender theater
preferred label: Teatro transgénero @es
preferred label: Transgender theatre
comment: Works in the performance arts that focus on transgender characters or themes.
comment: Trabajos en las artes escénicas que se centran en personajes o temas transgénero. @es
broader: LGBTQ+ theater
has top concept: LGBTQ+ theater
replaces: transgenderTheatre
issued: 2019-05-14
modified: 2025-02-23
type: Concept
in scheme: v3
change note: Version 4.1.0

Transgender theology
broader: LGBTQ+ theology
has top concept: LGBTQ+ theology
is replaced by: homoit0001218
replaces: transgenderTheology
issued: 2019-05-14
modified: 2022-08-22
type: Concept
in scheme: v3
change note: Version 4.1.0

Transgender victims of hate crimes
preferred label: Víctimas transgénero de crímenes de odio @es
comment: Transgender people who have experienced hate crimes and may or may not have survived; follow the individual's preference for "victims" or "survivors" whenever possible.
comment: Personas transgénero que han sufrido crímenes de odio y pueden o no haber sobrevivido; siga la preferencia de la persona sobre el uso de "víctimas" o "sobrevivientes" siempre que sea posible. @es
broader: LGBTQ+ victims of hate crimes
narrower: Transgender survivors of hate crimes
has top concept: LGBTQ+ people
replaces: transgenderVictimsOfHateCrimes
issued: 2019-05-14
modified: 2025-02-23
type: Concept
in scheme: v3
change note: Version 4.1.0

Transgender victims of rape
preferred label: Víctimas transgénero de violación @es
comment: Transgender people who have experienced rape and may or may not have survived; follow the individual's preference for "victims" or "survivors" whenever possible.
comment: Personas transgénero que han sufrido una violación y pueden o no haber sobrevivido; siga la preferencia de la persona sobre el uso de "víctimas" o "sobrevivientes" siempre que sea posible. @es
broader: LGBTQ+ victims of rape
narrower: Transgender survivors of rape
has top concept: LGBTQ+ people
replaces: transgenderVictimsOfRape
issued: 2019-05-14
modified: 2025-02-23
type: Concept
in scheme: v3
change note: Version 4.1.0

Transgender victims of sexual abuse
preferred label: Víctimas transgénero de abuso sexual @es
comment: Transgender people who have experienced sexual abuse and may or may not have survived; follow the individual's preference for "victims" or "survivors" whenever possible.
comment: Personas transgénero que han sufrido abuso sexual y pueden o no haber sobrevivido; siga la preferencia de la persona sobre el uso de "víctimas" o "sobrevivientes" siempre que sea posible. @es
broader: LGBTQ+ victims of sexual abuse
narrower: Transgender survivors of sexual abuse
has top concept: LGBTQ+ people
replaces: transgenderVictimsOfSexualAbuse
issued: 2019-05-14
modified: 2025-02-23
type: Concept
in scheme: v3
change note: Version 4.1.0

Transgender victims of war
preferred label: Víctimas transgénero de guerra @es
comment: Transgender people who have experienced war and may or may not have survived; follow the individual's preference for "victims" or "survivors" whenever possible.
comment: Personas transgénero que han sufrido la guerra y que pueden haber sobrevivido o no; siga la preferencia de la persona sobre el uso de "víctimas" o "sobrevivientes" siempre que sea posible. @es
broader: LGBTQ+ victims of war
narrower: Transgender survivors of war
has top concept: LGBTQ+ people
replaces: transgenderVictimsOfWar
issued: 2019-05-14
modified: 2025-02-23
type: Concept
in scheme: v3
change note: Version 4.1.0

Transgender victims' rights
preferred label: Derechos de víctimas transgénero @es
comment: Transgender people’s legal rights to be informed, present, and heard within the criminal justice system after having been harmed or injured as the result of of a crime, accident, or other event.
comment: Los derechos legales de las personas transgénero a estar informadas, estar presentes y ser escuchadas dentro del sistema de justicia penal después de haber sido perjudicadas o lesionadas como resultado de un delito, accidente u otro evento. @es
broader: LGBTQ+ victims' rights
has top concept: Law
replaces: transgenderVictimsRights
issued: 2019-05-14
modified: 2025-02-23
type: Concept
in scheme: v3
change note: Version 4.1.0

White transgender people
preferred label: Personas transgénero blancas @es
alternative label: Caucasian transgender people
alternative label: Transgender Caucasian people
alternative label: Transgender white people
alternative label: Personas trasngénero caucásicas @es
alternative label: Personas caucásicas transgénero @es
alternative label: Personas blancas transgénero @es
comment: Transgender people who are white.
comment: Personas transgénero que son blancas. @es
broader: White LGBTQ+ people
has top concept: White LGBTQ+ people
replaces: transgenderWhitePeople
issued: 2019-05-14
modified: 2025-02-23
type: Concept
in scheme: v3
change note: Version 4.1.0

Transgender youth literature
preferred label: Literatura juvenil transgénero @es
comment: Written literary works for an audience of readers from 12-18 years of age, also known as young adult literature or YA; use in reference to youth literature focusing on transgender characters or themes.
comment: Obras literarias escritas para una audiencia de lectores de 12 a 18 años de edad, también conocidas como literatura para adultos jóvenes o YA (por sus siglas en inglés); utilícese en referencia a la literatura juvenil que se centra en personajes o temas transgénero. @es
broader: LGBTQ+ youth literature
related: Transgender youth
has top concept: Subcultures
replaces: transgenderYouthLiterature
issued: 2019-05-14
modified: 2025-02-23
type: Concept
in scheme: v3
change note: Version 4.1.0

Transgenderism
preferred label: Transgenerismo @es
comment: Pathologizing term often used in the medicalization of transgender people; use only in historical contexts.
comment: Término patologizante a menudo utilizado en la medicalización de personas transgénero; utilícese sólo en contextos históricos. @es
broader: Medicalization
narrower: Transsexualism
related: Eonism
related: Gender
related: Gender identity
related: LGBTI
related: Transgender people
related: Transgender information centers
related: Transgender movement
related: Transgender studies
related: Trans
has top concept: Medical care
replaces: transgenderism
issued: 2019-05-14
modified: 2025-02-23
type: Concept
in scheme: v3
change note: Version 4.1.0

Transitioning status
preferred label: Estado de transición @es
comment: Term used to describe a person’s current status in their gender transition.
comment: Término utilizado para describir el estado actual de una persona en su transición de género. @es
broader: Transitioning (Gender)
narrower: No hormone identity
narrower: Non-operative
narrower: Post-operative
narrower: Pre-operative
related: Gender-affirming surgery
related: Transgender people
related: Transsexual people
related: Detransitioning
related: Retransitioning
related: Desistance (Gender)
related: Facial gender affirming surgery
related: Facial masculinization surgery
related: Facial feminization surgery
has top concept: Transitioning (Gender)
replaces: transitioningStatus
issued: 2019-05-14
modified: 2026-02-23
type: Concept
in scheme: v3
change note: Version 4.1.0

Transitioning (Gender)
preferred label: Transición (Género) @es
alternative label: Transitioning (Transgender)
alternative label: Transición (Transgénero) @es
comment: The process of changing one's gender presentation to affirm one's internal sense of gender; can include social or medical transition.
comment: El proceso de cambiar la presentación de género para afirmar el sentido propio del género; puede incluir una transición social o médica. @es
narrower: Transitioning status
narrower: Detransitioning
narrower: Retransitioning
narrower: Desistance (Gender)
related: Assigned gender
related: Birth certificates
related: Driver's licenses
related: Gender-affirming surgery
related: Gender identity
related: Gender markers
related: Bottom surgery
related: Hair removal
related: Medical practitioners' statements
related: Passports
related: Social security cards
related: Transgender people
related: Transsexual people
related: Transsexualism
related: Voice therapy (Gender)
related: Facial gender affirming surgery
related: Facial masculinization surgery
related: Facial feminization surgery
related: Top surgery
related: Chest reconstruction surgery
related: Feminizing vocal surgery
related: Masculinizing vocal surgery
related: Clitoroplasty
related: Labiaplasty
related: Metoidioplasty
related: Scrotoplasty
related: Vaginectomy
related: Tracheal shave
related: Phalloplasty
related: Vaginoplasty
related: Neophallus
replaces: transitioningTransgender
issued: 2019-05-14
modified: 2025-02-23
type: Concept
in scheme: v3
change note: Version 4.1.0

Transmasculine people
preferred label: Personas transmasculinas @es
comment: Trans people assigned female at birth who identify partially or fully with a masculine gender.
comment: Personas trans asignadas al sexo femenino al nacer que se autoidentifican parcial o totalmente con un género masculino. @es
broader: Transgender people
related: Bois
related: Masculinities
related: Demiboys
related: Transmasculinity
related: Masculine of center
has top concept: LGBTQ+ people
replaces: transmasculinePeople
issued: 2019-05-14
modified: 2025-02-23
type: Concept
in scheme: v3
change note: Version 4.1.0

Transphobia
preferred label: Transfobia @es
comment: Antagonism or disgust directed toward trans individuals (or others perceived to be transgressing gender norms) due to their gender identity and/or expression. Transphobia can include denial of the existence of trans identities, stereotypes, verbal harassment, and physical violence.
comment: Antagonismo o disgusto dirigido hacia personas trans (u otras personas percibidas como transgresoras de las normas de género) debido a su identidad y/o expresión de género. La transfobia puede incluir la negación de la existencia de identidades trans, estereotipos, acoso verbal y violencia física. @es
broader: LGBTQ+ phobia
narrower: Transphobia in fandom
narrower: Internalized transphobia
narrower: Trans-exclusionary radical feminism
related: Anti-transgender discrimination
related: Anti-transgender violence
related: Heterosexism
related: Transgender people
related: Trans exclusivity
related: Transmisogyny
related: Transmisogynoir
related: Anti-transgender legislation
related: Anti-gender movement
has top concept: LGBTQ+ phobia
replaces: transphobia
issued: 2019-05-14
modified: 2025-02-23
type: Concept
in scheme: v3
change note: Version 4.1.0

Transsexualism
preferred label: Transexualismo @es
comment: An individual's identification with a gender inconsistent with or not culturally associated with their assigned sex.
comment: La identificación de una persona con un género inconsistente o no asociado culturalmente con su sexo asignado. @es
broader: Medicalization
broader: Transgenderism
related: Eonism
related: Transsexuality
related: Transsexual people
related: Transitioning (Gender)
related: Voice therapy (Gender)
related: Trans
has top concept: Medical care
replaces: transsexualism
issued: 2019-05-14
modified: 2025-02-23
type: Concept
in scheme: v3
change note: Version 4.1.0

Transvestism
preferred label: Travestismo @es
comment: U.S. historical term used to describe the practices of individuals who wear clothes associated with a gender other than their gender assigned at birth; generally considered to be a derogatory term; use only in historical contexts.
comment: Término histórico estadounidense utilizado para describir las prácticas de personas que utilizan ropa asociada con un género distinto al asignado al nacer; generalmente se considera un término despectivo; utilícese únicamente en contextos históricos. @es
broader: Gender expression
broader: Medicalization
related: Crossdressing
related: Eonism
related: Trans
related: Masquerading
has top concept: Gender
replaces: transvestism
issued: 2019-05-14
modified: 2025-02-23
type: Concept
in scheme: v3
change note: Version 4.1.0

Transvestites
preferred label: Travestis @es
comment: U.S. historical term used to describe individuals who wear clothes associated with a gender other than their gender assigned at birth; generally considered to be a derogatory term; use only in historical contexts.
comment: Término histórico estadounidense utilizado para describir a personas que utilizan ropa asociada con un género distinto al asignado al nacer; generalmente se considera un término despectivo; utilícese únicamente en contextos históricos. @es
broader: LGBTQ+ historical terms
broader: Gender minorities
related: Crossdressers
related: Transgender people
related: Clocking (Gender)
has top concept: LGBTQ+ historical terms
replaces: transvestites
issued: 2019-05-14
modified: 2025-02-23
type: Concept
in scheme: v3
change note: Version 4.1.0

Travestis
alternative label: Travesti @es
comment: Spanish term for people assigned male at birth who have a feminine gender identity; commonly used in South America.
comment: Término para personas asignadas al sexo masculino al nacer que tienen una identidad de género femenina; comúnmente utilizado en Sudamérica. @es
broader: Non-Euro-American gender and sexual identities
has top concept: Gender
replaces: travesti
issued: 2019-05-14
modified: 2025-02-23
type: Concept
in scheme: v3
change note: Version 4.1.0

Tribades
preferred label: Bolleras @es
alternative label: Cachaperas @es
alternative label: Tortilleras @es
alternative label: Tortalleras @es
alternative label: Tortaletas @es
alternative label: Tortas @es
alternative label: Tribadas @es
comment: Historical term for individuals who engage in the sexual practice of tribadism; use only in historical contexts.
comment: Término histórico para personas que ejercen la práctica sexual del tribadismo; utilícese únicamente en contextos históricos. @es
broader: LGBTQ+ historical terms
related: Lesbians
related: Tribadism
has top concept: LGBTQ+ historical terms
replaces: tribades
issued: 2019-05-14
modified: 2025-02-23
type: Concept
in scheme: v3
change note: Version 4.1.0

Trigender identity
preferred label: Identidad trigénero @es
comment: Gender identity including three genders, typically male, female, and a third (often non-binary) gender.
comment: Identidad de género que incluye tres géneros, típicamente masculino, femenino y un tercer género (a menudo no binario). @es
broader: Gender identity
related: Trigender people
has top concept: Gender
replaces: trigenderIdentity
issued: 2019-05-14
modified: 2025-02-23
type: Concept
in scheme: v3
change note: Version 4.1.0

Trigender people
preferred label: Personas trigénero @es
comment: People whose gender continually moves between or among three gender identities, typically male, female, and a third gender.
comment: Personas cuyo género se mueve continuamente entre tres identidades de género, típicamente masculina, femenina y un tercer género. @es
broader: Non-Euro-American gender and sexual identities
broader: Transgender people
broader: Gender minorities
related: Trigender identity
has top concept: Gender
replaces: trigenderPeople
issued: 2019-05-14
modified: 2025-02-23
type: Concept
in scheme: v3
change note: Version 4.1.0

Tritiya-Prakriti
comment: Ancient Hindu term for a third gender that is typically described as fluid and/or continuously transformative.
comment: Término hindú antiguo para un tercer género que normalmente se describe como fluido y/o continuamente en transformación. @es
broader: Non-Euro-American gender and sexual identities
has top concept: Gender
replaces: tritiyaPrakriti
issued: 2019-05-14
modified: 2025-02-23
type: Concept
in scheme: v3
change note: Version 4.1.0

Tucking (Phallus)
preferred label: Remetimiento (Falo) @es
alternative label: Tucking
alternative label: Remetido @es
alternative label: Ocultar y pegar @es
comment: Slang term describing various methods used to visually conceal the penis to give a flatter appearance in clothing.
comment: Término de la jerga que describe varios métodos utilizados para ocultar visualmente el pene y dar una apariencia más plana a la ropa. @es
broader: Gender expression
related: Penis
has top concept: Gender
replaces: tucking
issued: 2019-05-14
modified: 2025-02-23
type: Concept
in scheme: v3
change note: Version 4.1.0

Tumtum
comment: Term originating in Rabbinic Judaism to refer to someone with an unknown sex; literally translates to "hidden." Used historically to refer to intersex variations where the genitals were covered by skin. Only use for individuals who are Jewish and who self-identify as Tumtum.
comment: Término hebreo utilizado en referencia a un género desconocido; se traduce literalmente como "oculto". @es
broader: Non-Euro-American gender and sexual identities
has top concept: Gender
replaces: tumtum
issued: 2019-05-14
modified: 2025-02-23
type: Concept
in scheme: v3
change note: Version 4.1.0

Turner syndrome
preferred label: Síndrome de Turner @es
comment: Turner syndrome is a variation in which a person is born with a 45X chromosome pattern (sometimes called 45XO) rather than the typical 46XX. People with Turner syndrome often share specific physical features such as short stature, a webbed neck and broad chest, and heart issues. They can also develop variations in their other sex characteristics, such as smaller-than-typical ovaries that may stop producing hormones at a younger age than typical, and they might not menstruate or experience pubertal changes.
comment: El síndrome de Turner es una variación en la que una persona nace con un patrón cromosómico 45X (a veces llamado 45XO) en lugar del típico 46XX. Las personas con síndrome de Turner a menudo comparten características físicas específicas, como baja estatura, cuello palmeado y pecho ancho, y problemas cardíacos. También pueden desarrollar variaciones en sus otras características sexuales, como ovarios más pequeños de lo típico que pueden dejar de producir hormonas a una edad más temprana de lo normal, y es posible que no menstrúen ni experimenten cambios puberales. @es
broader: Intersex variations
has top concept: Sex (Body)
replaces: turnerSyndrome
issued: 2019-05-14
modified: 2025-02-23
type: Concept
in scheme: v3
change note: Version 4.1.0

Twinks (Gay culture)
preferred label: Twinks (Cultura gay) @es
alternative label: Twinkies
alternative label: Twinks
alternative label: Yogurín @es
comment: U.S. slang term for young gay men who are typically small in stature, hairless, and considered effeminate.
comment: Término de la jerga estadounidense para referirse a hombres gay jóvenes que suelen ser de baja estatura, lampiños y considerados afeminados. @es
broader: Gay culture
broader: Gay men
broader: Gender roles
broader: Sexual identity
related: Gender expression
has top concept: Subcultures
replaces: twinks
issued: 2019-05-14
modified: 2025-02-23
type: Concept
in scheme: v3
change note: Version 4.1.0

Two-Spirit people
preferred label: Personas dos espíritus @es
alternative label: 2S people
alternative label: Two Spirit people
alternative label: Two Spirited people
alternative label: Two-Spirited people
comment: Indigenous people in North America who self-identify as Two-Spirit to reconnect with the multiple gender and sexual roles in Native cultures.
comment: Personas indígenas de Norteamérica que se autoidentifican como dos espíritus para reconectar con los múltiples roles sexuales y de género en las culturas nativas. @es
broader: Non-Euro-American gender and sexual identities
broader: Sexual minorities
narrower: Two-Spirit authors
narrower: Two-Spirit families
narrower: Two-Spirit parents
narrower: Two-Spirit chefs
narrower: Closeted Two-Spirit people
narrower: Two-Spirit athletes
narrower: Two-Spirit victims of bullying
narrower: Two-Spirit people in the workplace
narrower: Two-Spirit neurodivergent people
narrower: Two-Spirit artists
narrower: Two-Spirit disabled people
narrower: Two-Spirit comedians
narrower: Two-Spirit partners
narrower: Two-Spirit victims of sexual abuse
narrower: Two-Spirit politicians
narrower: Two-Spirit college students
narrower: Pregnant Two-Spirit people
narrower: Two-Spirit sons
narrower: Two-Spirit teachers
narrower: Two-Spirit academics
narrower: Rural Two-Spirit people
narrower: Two-Spirit students
narrower: Two-Spirit information professionals
narrower: Two-Spirit scientists
narrower: Two-Spirit television personalities
narrower: Two-Spirit victims of crime
narrower: Two-Spirit sex workers
narrower: Two-Spirit celebrities
narrower: Two-Spirit dancers
narrower: Two-Spirit people in arts and media
narrower: Two-Spirit people who use substances
narrower: Two-Spirit people with addictions
narrower: Two-Spirit people practicing sobriety
narrower: Two-Spirit people in recovery
narrower: Two-Spirit people in recovery groups
narrower: Two-Spirit journalists
related: Alyha
related: Berdache
related: Dilbaa
related: Hwame
related: Indigenous LGBTQ+ people
related: Lhamana
related: Nádleehi
related: Native American LGBTQ+ people
related: Niizh manidoowag
related: Ninauposkitzipxpe
related: Quariwarmi
related: Tida wena
related: Winkté
related: Indigiqueer people
related: Indigiqueer
related: Two-Spirit community
related: Two-Spirit people in fandom
related: Two-Spirit community centers
has top concept: Gender
replaces: two-spiritPeople
issued: 2019-05-14
modified: 2026-03-04
type: Concept
in scheme: v3
change note: Version 4.1.0

Uncut men
preferred label: Hombres no circuncisos @es
alternative label: Uncircumcised men
alternative label: Hombres no circuncidados @es
comment: Men whose penises are uncircumcised (i.e., the foreskin of the penis has not been surgically removed).
comment: Hombres cuyos penes no están circuncidados (es decir, el prepucio del pene no ha sido extirpado quirúrgicamente). @es
related: Circumcision
replaces: uncutMen
issued: 2019-05-14
modified: 2025-02-23
type: Concept
in scheme: v3
change note: Version 4.1.0

Undocumented LGBTQ+ residents
preferred label: Residentes LGBTQ+ indocumentados @es
alternative label: Undocumented LGBTQ residents
alternative label: Residentes LGBTQ indocumentados @es
comment: LGBTQ+ people who do not have official documentation to remain legal residents of the countries in which they live.
comment: Personas LGBTQ+ que no cuentan con documentación oficial para seguir siendo residentes legales de los países en los que viven. @es
broader: LGBTQ+ people
related: Law
related: Legal status
related: LGBTQ+ people of shared ethnic or national identities
related: LGBTQ+ immigration rights
related: LGBTQ+ migrants
related: LGBTQ+ refugees
related: LGBTQ+ persecutions
related: LGBTQ+ immigrants
related: LGBTQ+ asylum seekers
has top concept: LGBTQ+ people
replaces: undocumentedLGBTQResidents
issued: 2019-05-14
modified: 2025-02-23
type: Concept
in scheme: v3
change note: Version 4.1.0

Unmarried couples
preferred label: Parejas no casadas @es
comment: Romantic and/or sexual partnerships of two people who are unmarried.
comment: Parejas románticas y/o sexuales de dos personas que no están casadas. @es
broader: Marital status
has top concept: Living arrangements
replaces: unmarriedCouples
issued: 2019-05-14
modified: 2025-02-23
type: Concept
in scheme: v3
change note: Version 4.1.0

Uranians
preferred label: Uranistas @es
alternative label: Urnings
comment: 19th century term used to refer to gender and sexual minorities; use only in historical contexts.
comment: Término del siglo XIX utilizado para referirse a minorías sexuales y de género; utilícese únicamente en contextos históricos. @es
broader: LGBTQ+ historical terms
related: Sexual minorities
related: Uranism
has top concept: LGBTQ+ historical terms
replaces: uranians
issued: 2019-05-14
modified: 2025-02-23
type: Concept
in scheme: v3
change note: Version 4.1.0

Vaginal dilation
preferred label: Dilatación vaginal @es
comment: The process of gently and incrementally stretching the vagina using vaginal dilators.
comment: El proceso de estirar suave y progresivamente la vagina utilizando dilatadores vaginales. @es
replaces: vaginalDilation
issued: 2019-05-14
modified: 2025-02-23
type: Concept
in scheme: v3
change note: Version 4.1.0

Vaginal fisting
preferred label: Fisting vaginal @es
comment: Sexual practice of inserting a fist into a vagina.
comment: Práctica sexual de introducir un puño en la vagina. @es
broader: Fisting
broader: Vaginal sex
related: Anal fisting
has top concept: Sexual practices
replaces: vaginalFisting
issued: 2019-05-14
modified: 2025-02-23
type: Concept
in scheme: v3
change note: Version 4.1.0

Vaginal sex
preferred label: Sexo vaginal @es
comment: Sexual acts involving the vagina.
comment: Actos sexuales que involucran la vagina. @es
broader: Sex (Act)
broader: Sexual practices
narrower: Fingering
narrower: Fucking
narrower: Vaginal fisting
related: Cunnilingus
related: Clitoral sex
has top concept: Sex (Act)
replaces: vaginalSex
issued: 2019-05-14
modified: 2025-02-23
type: Concept
in scheme: v3
change note: Version 4.1.0

Vagina
alternative label: Cunt
alternative label: Pussy
alternative label: Snatch
alternative label: Twat
alternative label: Vag
alternative label: Vaginas
alternative label: Pepe @es
alternative label: Coño @es
alternative label: Chocho @es
alternative label: Chocha @es
alternative label: Borrego @es
alternative label: Crica @es
alternative label: Panocha @es
comment: Internal muscular channel connected to external genital organs.
comment: Canal muscular interno conectado a los órganos genitales externos. @es
broader: Erogenous body parts
broader: Genitals
narrower: G-spot
narrower: Neovagina
related: Cunnilingus
related: Sex assigned at birth
related: Vaginismus
related: Labiaplasty
related: Vaginectomy
related: Vaginoplasty
has top concept: Erogenous body parts
replaces: vaginas
issued: 2019-05-14
modified: 2025-02-23
type: Concept
in scheme: v3
change note: Version 4.1.0

Vaginismus
preferred label: Vaginismo @es
alternative label: Vaginism
comment: A condition characterized by painful, spasmodic contractions of the vagina in response to physical contact, pressure, or insertion.
comment: Una condición caracterizada por contracciones espasmódicas y dolorosas de la vagina en respuesta al contacto físico, la presión o la inserción. @es
broader: Sexual dysfunction
related: Vagina
has top concept: Sexual dysfunction
replaces: vaginismus
issued: 2019-05-14
modified: 2025-02-23
type: Concept
in scheme: v3
change note: Version 4.1.0

Vaginoplasty
broader: Gender-affirming surgery
broader: Bottom surgery
related: Vaginal dilation
related: Vaginectomy
has top concept: Medical care
is replaced by: homoit0001851
replaces: vaginoplasty
issued: 2019-05-14
modified: 2022-08-15
type: Concept
in scheme: v3
change note: Version 4.1.0

Vibrators
preferred label: Vibradores @es
comment: Electric-powered sex toys that produce different levels of vibrations or pulses to aid in sexual stimulation and pleasure.
comment: Juguetes sexuales eléctricos que producen diferentes niveles de vibraciones o pulsos para ayudar en la estimulación y el placer sexual. @es
broader: Sex accessories
related: Dildos
has top concept: Sex accessories
replaces: vibrators
issued: 2019-05-14
modified: 2025-02-23
type: Concept
in scheme: v3
change note: Version 4.1.0

LGBTQ+ victims' rights
preferred label: Derechos de víctimas LGBTQ+ @es
alternative label: Victims' rights (LGBTQ)
comment: LGBTQ+ people’s legal rights to be informed, present, and heard within the criminal justice system after having been harmed or injured as the result of a crime, accident, or other event.
comment: Los derechos legales de las personas LGBTQ+ a estar informadas, estar presentes y ser escuchadas dentro del sistema de justicia penal después de haber sido perjudicadas o lesionadas como resultado de un delito, accidente u otro evento. @es
broader: Law
narrower: Bisexual victims' rights
narrower: Gay victims' rights
narrower: Lesbian victims' rights
narrower: Queer victims' rights
narrower: Transgender victims' rights
narrower: Asexual victims' rights
narrower: Intersex victims' rights
related: LGBTQ+ civil rights
related: LGBTQ+ victims of crime
related: Two-Spirit victims' rights
has top concept: Law
replaces: victimsRightsLGBTQ
issued: 2019-05-14
modified: 2025-02-23
type: Concept
in scheme: v3
change note: Version 4.1.0

Virginity
preferred label: Virginidad @es
comment: Term used to describe the sexual status of people who have never engaged in sexual activity.
comment: Término utilizado para describir el estado sexual de personas que nunca han tenido actividad sexual. @es
broader: Sexual abstinence
related: Asexuality
related: Sexual preference
has top concept: Sex (Act)
replaces: virginity
issued: 2019-05-14
modified: 2025-02-23
type: Concept
in scheme: v3
change note: Version 4.1.0

Voguing
alternative label: Vogueing
comment: A highly stylized form of dance originating in the Harlem ballroom scene in the 1980s and 1990s.
comment: Una forma de danza muy estilizada que se originó en la escena de ballroom de Harlem en las décadas de 1980 y 1990. @es
related: Ball culture
related: Drag
related: Drag balls
replaces: voguing
issued: 2019-05-14
modified: 2025-02-23
type: Concept
in scheme: v3
change note: Version 4.1.0

Voice
preferred label: Voz @es
comment: Sound produced by the larynx and vocal tract that is used for communication and expression.
comment: Sonido producido por la laringe y el tracto vocal que se utiliza para la comunicación y la expresión. @es
broader: Secondary sex characteristics
related: Feminizing vocal surgery
related: Masculinizing vocal surgery
has top concept: Sex (Body)
replaces: voice
issued: 2019-05-14
modified: 2025-02-23
type: Concept
in scheme: v3
change note: Version 4.1.0

Voice therapy (Gender)
preferred label: Terapia vocal (género) @es
alternative label: Voice therapy (Transgender)
alternative label: Voice therapy
alternative label: Terapia vocal (Transgénero) @es
alternative label: Terapia vocal @es
comment: Any non-surgical technique used to make the human voice sound either more feminine or masculine.
comment: Cualquier técnica no quirúrgica utilizada para hacer que la voz humana suene más femenina o masculina. @es
broader: Gender expression
broader: Therapies
related: Transitioning (Gender)
related: Transsexualism
related: Feminizing vocal surgery
related: Masculinizing vocal surgery
has top concept: Gender
replaces: voiceTherapyTransgender
issued: 2019-05-14
modified: 2025-02-23
type: Concept
in scheme: v3
change note: Version 4.1.0

Vulva
comment: External genitalia surrounding the vagina.
comment: Genitales externos que rodean la vagina. @es
broader: Genitals
related: Labiaplasty
related: Vaginectomy
related: Vaginoplasty
has top concept: Sex (Body)
replaces: vulva
issued: 2019-05-14
modified: 2025-02-23
type: Concept
in scheme: v3
change note: Version 4.1.0

Wacking off
alternative label: Haciendo una paja @es
alternative label: Hacerse una puñeta @es
comment: Slang term for masturbation that is commonly used in the United States.
comment: Término de la jerga para la masturbación, que se usa comúnmente en los Estados Unidos. @es
broader: Manual sex
broader: Masturbation
broader: Phallic sex
narrower: Wanking
has top concept: Sex (Act)
replaces: wackingOff
issued: 2019-05-14
modified: 2025-02-23
type: Concept
in scheme: v3
change note: Version 4.1.0

Whakatane
alternative label: Wakatane @mi
comment: In Māori culture in New Zealand, this term is used to describe people assigned female at birth who pursue traditionally male roles.
comment: En la cultura maorí de Nueva Zelanda, este término se utiliza para describir a las personas asignadas al sexo femenino al nacer y que desempeñan roles tradicionalmente masculinos. @es
broader: Non-Euro-American gender and sexual identities
broader: MVPFAFF+
related: Butches
related: Whakawāhine
has top concept: Gender
replaces: wakatane
issued: 2019-05-14
modified: 2025-02-23
type: Concept
in scheme: v3
change note: Version 4.1.0

Wanking
alternative label: Haciendo una paja @es
alternative label: Hacerse una puñeta @es
comment: Slang term for masturbation commonly used in the United Kingdom and Ireland; typically refers to the manual stimulation of the penis.
comment: Término de la jerga para la masturbación, comúnmente utilizado en el Reino Unido e Irlanda; normalmente se refiere a la estimulación manual del pene. @es
broader: Manual sex
broader: Phallic sex
broader: Wacking off
has top concept: Sex (Act)
replaces: wanking
issued: 2019-05-14
modified: 2025-02-23
type: Concept
in scheme: v3
change note: Version 4.1.0

Waria
comment: Third gender people in Indonesia who are assigned male at birth but who express femininity and may identify as women.
comment: Personas del tercer género en Indonesia que fueron asignadas al sexo masculino al nacer pero que expresan feminidad y pueden identificarse como mujeres. @es
broader: Non-Euro-American gender and sexual identities
has top concept: Gender
replaces: waria
issued: 2019-05-14
modified: 2025-02-23
type: Concept
in scheme: v3
change note: Version 4.1.0

Whakawāhine
alternative label: Whakawahine @mi
comment: In Māori culture in New Zealand, this term is used to describe people assigned male at birth who pursue traditionally female roles.
comment: En la cultura maorí de Nueva Zelanda, este término se utiliza para describir a las personas asignadas al sexo masculino al nacer y que desempeñan roles tradicionalmente femeninos. @es
broader: Non-Euro-American gender and sexual identities
broader: MVPFAFF+
related: Whakatane
has top concept: Gender
replaces: whakawahine
issued: 2019-05-14
modified: 2025-02-23
type: Concept
in scheme: v3
change note: Version 4.1.0

Whips
preferred label: Látigos @es
comment: Sticks, cords, or straps, usually with stiff handles, that are used for striking individuals. Often used in BDSM circles to enhance sexual arousal.
comment: Palos, cuerdas o correas, generalmente con mangos rígidos, que se utilizan para golpear a personas. A menudo se utilizan en círculos de BDSM para mejorar la excitación sexual. @es
broader: Sex accessories
related: Flagellation
related: Whipping
has top concept: Sex accessories
replaces: whips
issued: 2019-05-14
modified: 2025-02-23
type: Concept
in scheme: v3
change note: Version 4.1.0

Widowed people
preferred label: Personas enviudadas @es
alternative label: Widowers
alternative label: Widows
alternative label: Viudas @es
alternative label: Viudos @es
comment: People whose spouses or partners have died.
comment: Personas cuyos cónyuges o parejas hayan fallecido. @es
broader: Marital status
has top concept: Living arrangements
replaces: widowedPeople
issued: 2019-05-14
modified: 2025-02-23
type: Concept
in scheme: v3
change note: Version 4.1.0

Wimmin
comment: A way of spelling "women" that is used in certain feminist circles. First used by George P. Krapp (1872-1934) and then appeared in 19th century Black American English renderings before being used by feminists in the 20th century.
comment: Una forma de deletrear "women" (mujeres en inglés) que se utiliza en ciertos círculos feministas. Utilizado por primera vez por George P. Krapp (1872-1934) y luego apareció en representaciones del inglés afroamericano del siglo XIX antes de ser utilizado por feministas en el siglo XX. @es
related: Feminism
related: Females
related: Womyn
replaces: wimmin
issued: 2019-05-14
modified: 2025-02-23
type: Concept
in scheme: v3
change note: Version 4.1.0

Winkté
alternative label: Winkte
comment: North American Lakota word referring to people assigned male at birth who adopt feminine roles; translates to "to be like a woman."
comment: Palabra lakota norteamericana que se refiere a personas asignadas al sexo masculino al nacer y que adoptan roles femeninos; se traduce como "ser como una mujer". @es
broader: Non-Euro-American gender and sexual identities
related: Two-Spirit people
has top concept: Gender
replaces: winkte
issued: 2019-05-14
modified: 2025-02-23
type: Concept
in scheme: v3
change note: Version 4.1.0

Witches (Lesbians)
related: Goddess movement
related: Lesbian Pagans
is replaced by: homoit0001908
replaces: witchesLesbian
issued: 2019-05-14
modified: 2022-08-22
type: Concept
in scheme: v3
change note: Version 4.1.0

Wolves (Gay culture)
preferred label: Lobos (Cultura gay) @es
alternative label: Wolves
alternative label: Lobos @es
comment: U.S. slang term for heavy-set, masculine gay men who are often characterized as having hairy bodies and facial hair; typically used for individuals who are more aggressive and overtly masculine than bears.
comment: Término de la jerga estadounidense para hombres gay masculinos y corpulentos que a menudo se caracterizan por tener cuerpos peludos y vello facial; normalmente se utiliza para personas que son más agresivas y abiertamente masculinas que los osos. @es
broader: Gay culture
broader: Gay men
broader: Gender roles
broader: Sexual identity
narrower: Cubs (Gay culture)
related: Bears (Gay culture)
related: Gender expression
related: Masculinities
related: Otters (Gay culture)
has top concept: Subcultures
replaces: wolves
issued: 2019-05-14
modified: 2025-02-23
type: Concept
in scheme: v3
change note: Version 4.1.0

Women who have sex with women
preferred label: Mujeres que tienen sexo con mujeres @es
alternative label: WSW
comment: Women who engage in sexual activity with other women.
comment: Mujeres que mantienen actividad sexual con otras mujeres. @es
broader: LGBTQ+ people
broader: Females
narrower: Mati
related: Bisexual women
related: Lesbians
related: Same-gender-loving
related: Sexual minorities
related: Strap-on sex
related: Women's sexuality
has top concept: LGBTQ+ people
replaces: womenWhoHaveSexWithWomen
issued: 2019-05-14
modified: 2025-02-23
type: Concept
in scheme: v3
change note: Version 4.1.0

Women's bookshops
preferred label: Librerías para mujeres @es
alternative label: Librerias de mujeres @es
comment: Bookshops that sell materials intended for use by women or addressing topics related to women.
comment: Librerías que venden materiales destinados para el uso de mujeres o que abordan temas relacionados con las mujeres. @es
broader: LGBTQ+ bookshops
related: Lesbian bookshops
has top concept: LGBTQ+ bookshops
replaces: womensBookshops
issued: 2019-05-14
modified: 2025-02-23
type: Concept
in scheme: v3
change note: Version 4.1.0

Women's community centers
preferred label: Centros comunitarios para mujeres @es
preferred label: Women's community centres
alternative label: Centros comunitarios de mujeres @es
comment: Spaces in which women meet for social, educational, recreational, and organizing activities.
comment: Espacios en los que las mujeres se reúnen para actividades sociales, educativas, recreativas y organizativas. @es
broader: LGBTQ+ community centers
has top concept: LGBTQ+ centers
replaces: womensCommunityCentres
issued: 2019-05-14
modified: 2025-02-23
type: Concept
in scheme: v3
change note: Version 4.1.0

Women's libraries
preferred label: Bibliotecas de mujeres @es
alternative label: Bibliotecas para mujeres @es
comment: Libraries that contain materials primarily pertaining to women or for use by women.
comment: Bibliotecas que contienen materiales principalmente relacionados con mujeres o para el uso de mujeres. @es
broader: LGBTQ+ libraries
narrower: Lesbian libraries
has top concept: LGBTQ+ cultural heritage institutions
replaces: womensLibraries
issued: 2019-05-14
modified: 2026-02-24
type: Concept
in scheme: v3
change note: Version 4.1.0

Women's marriages
preferred label: Casamientos entre mujeres @es
alternative label: Matrimonios entre mujeres @es
comment: Same-gender marriage tradition between two women in Africa conducted according to African culture and traditions.
comment: Tradición matrimonial entre personas del mismo sexo entre dos mujeres en África realizada de acuerdo con la cultura y las tradiciones africanas. @es
broader: Marriage
related: Same-sex marriage
has top concept: Living arrangements
replaces: womensMarriages
issued: 2019-05-14
modified: 2025-02-23
type: Concept
in scheme: v3
change note: Version 4.1.0

Women's music festivals
preferred label: Festivales de música para mujeres @es
alternative label: Festivales de música de mujeres @es
comment: Organized events typically lasting more than one day that feature performances by women’s musical groups and performers. Though centered on music, women’s music festivals may also incorporate aspects of lesbian and feminist culture by offering workshops, arts and crafts, and community resources.
comment: Eventos organizados que suelen durar más de un día y que cuentan con presentaciones de artistas y grupos musicales de mujeres. Aunque se centran en la música, los festivales de música para mujeres también pueden incorporar aspectos de la cultura lésbica y feminista al ofrecer talleres, artes y manualidades, y recursos comunitarios. @es
broader: Women's events
related: Women's music
related: Womyn
has top concept: Women's events
replaces: womensMusicFestivals
issued: 2019-05-14
modified: 2025-02-23
type: Concept
in scheme: v3
change note: Version 4.1.0

Womyn
comment: A spelling of "woman" or "women" that first appeared in print in 1976 and is used in certain feminist circles to avoid having the suffix of "men." Some contemporary transgender activists have criticized use of the word "womyn" due to its prevalence in trans-exclusionary radical feminist (TERF) circles following the exclusion of trans women from the Michigan Womyn’s Music Festival.
comment: Una grafía de "woman" o "women" (que en español significa "mujer" o "mujeres") que apareció impresa por primera vez en 1976 y se utiliza en ciertos círculos feministas para evitar tener el sufijo "men" (que en español significa "hombres"). Algunos activistas transgénero contemporáneos han criticado el uso de la palabra "womyn" debido a su prevalencia en los círculos feministas radicales transexclusivos (TERF) tras la exclusión de las mujeres trans del Festival de Música Womyn de Michigan. @es
related: Anti-transgender discrimination
related: Feminism
related: Radical feminism
related: Wimmin
related: Females
related: Women's music festivals
related: Trans exclusivity
replaces: womyn
issued: 2019-05-14
modified: 2025-02-23
type: Concept
in scheme: v3
change note: Version 4.1.0

Khaniths
alternative label: Khanith @ar
alternative label: Xanith @ar
alternative label: Xaniths @ar
comment: Arabic word used in Oman for people who assigned male at birth who adopt feminine mannerisms and/or roles.
comment: Palabra árabe utilizada en Omán para las personas asignadas al sexo masculino al nacer y que adoptan gestos y/o roles femeninos. @es
broader: Non-Euro-American gender and sexual identities
has top concept: Gender
replaces: xanith
issued: 2019-05-14
modified: 2025-02-23
type: Concept
in scheme: v3
change note: Version 4.1.0

X-jendā
comment: Japanese term for people who do not fit within the categories of man or woman; includes individuals born intersex, female, or male, and is often abbreviated using FTX, MTX, or XTX to describe individuals' transitions; some definitions equate the term to genderqueer or beyond the binary identities.
comment: Término japonés para personas que no encajan en las categorías de hombre o mujer; incluye a personas nacidas intersex, mujeres u hombres, y a menudo se abrevia utilizando FTX, MTX o XTX para describir las transiciones de las personas; algunas definiciones equiparan el término con genderqueer o más allá de las identidades binarias. @es
broader: Non-Euro-American gender and sexual identities
related: FtXs
related: MtXs
has top concept: Gender
replaces: XJenda
issued: 2019-05-14
modified: 2025-02-23
type: Concept
in scheme: v3
change note: Version 4.1.0

Yīnyángrén
alternative label: Jiānxìngrén @zh
alternative label: Yin-yang ren @zh
alternative label: Yinyang ren @zh
alternative label: Yinyangren @zh
comment: Chinese word for individuals who are both female (yin) and male (yang).
comment: Palabra china para personas que son tanto femeninas (yin) como masculinas (yang). @es
broader: Non-Euro-American gender and sexual identities
has top concept: Gender
replaces: yinyangRen
issued: 2019-05-14
modified: 2025-02-23
type: Concept
in scheme: v3
change note: Version 4.1.0

Youth
preferred label: Juventud @es
comment: The time period between childhood and adulthood.
comment: El período de tiempo entre la niñez y la edad adulta. @es
narrower: Heterosexual youth
narrower: Intersex youth
narrower: LGBTQ+ youth
narrower: Cisgender youth
narrower: Two-Spirit youth
related: Children
related: Bishounen
replaces: youth
issued: 2019-05-14
modified: 2025-02-23
type: Concept
in scheme: v3
change note: Version 4.1.0

LGBTQ+ youth
preferred label: Juventud LGBTQ+ @es
alternative label: Adolescents (LGBTQ)
alternative label: Teenagers (LGBTQ)
alternative label: Teens (LGBTQ)
alternative label: Youth (LGBTQ)
alternative label: LGBTQ+ adolescents
alternative label: LGBTQ+ teenagers
alternative label: LGBTQ+ teens
alternative label: Adolescentes LGBTQ+ @es
alternative label: Juventud (LGBTQ) @es
alternative label: Jóvenes (LGBTQ) @es
alternative label: Jóvenes LGBTQ+ @es
alternative label: Juventud LGBTQ @es
alternative label: Adolescentes (LGBTQ) @es
comment: LGBTQ+ people who are between the ages of childhood and adulthood.
comment: Personas LGBTQ+ que se encuentran entre las edades de la niñez y la edad adulta. @es
broader: Youth
narrower: Bisexual youth
narrower: Gay and lesbian youth
narrower: Lesbian youth
narrower: LGBTQ+ unhoused youth
narrower: Queer youth
narrower: Transgender youth
narrower: Non-binary youth
narrower: Asexual youth
narrower: Aromantic youth
narrower: Demisexual youth
narrower: Megasexual youth
narrower: Greyromantic youth
narrower: LGBTQ+ youth survivors of bullying
narrower: LGBTQ+ youth victims of bullying
related: Heterosexual youth
related: Intersex youth
related: Schools for LGBTQ+ youth
related: LGBTQ+ youth centers
related: LGBTQ+ youth literature
related: Gender creative
related: Gender dysphoria in youth
related: Two-Spirit youth
related: Social work with LGBTQ+ youth
has top concept: Youth
replaces: youthLGBTQ
issued: 2019-05-14
modified: 2025-04-29
type: Concept
in scheme: v3
change note: Version 4.1.0

LGBTQ+ youth literature
preferred label: Literatura juvenil LGBTQ+ @es
alternative label: Young adult literature (LGBTQ)
alternative label: Youth literature (LGBTQ)
comment: Written literary works for an audience of readers from 12-18 years of age, also known as young adult literature or YA; use in reference to youth literature focusing on LGBTQ+ characters or themes.
comment: Obras literarias escritas para una audiencia de lectores de 12 a 18 años de edad, también conocidas como literatura para adultos jóvenes o YA (por sus siglas en inglés); utilícese en referencia a la literatura juvenil centrada en personajes o temas LGBTQ+. @es
broader: LGBTQ+ literature
narrower: Bisexual youth literature
narrower: Gay youth literature
narrower: Lesbian youth literature
narrower: Queer youth literature
narrower: Transgender youth literature
narrower: Aromantic youth literature
narrower: Asexual youth literature
narrower: Demisexual youth literature
narrower: Megasexual youth literature
narrower: Greyromantic youth literature
narrower: Intersex youth literature
related: LGBTQ+ youth
related: LGBTQ+ fanfiction
related: Two-Spirit youth literature
has top concept: Subcultures
replaces: youthLiteratureLGBTQ
issued: 2019-05-14
modified: 2025-02-23
type: Concept
in scheme: v3
change note: Version 4.1.0

Zenani
preferred label: Zenanas @hil
comment: In northern India and Pakistan, this term is used to refer to effeminate people.
comment: En el norte de la India y Pakistán, este término se utiliza para referirse a las personas afeminadas. @es
comment: Urdu word for effeminate people.
broader: Non-Euro-American gender and sexual identities
has top concept: Gender
replaces: zenanas
replaces: zenani
issued: 2019-05-14
modified: 2025-02-23
modified: 2022-12-13
type: Concept
in scheme: v3
change note: Version 4.1.0
is replaced by: homoit0001523

Recovery groups
preferred label: Adult Children of Alcoholics
preferred label: Al-Anon
preferred label: Alcoholics Anonymous
preferred label: Cocaine Anonymous
preferred label: Crystal Meth Anonymous
preferred label: LGBTQ+-affirming recovery groups
preferred label: Grupos de recuperación que afirman las identidades LGBTQ+ @es
preferred label: Narcotics Anonymous
alternative label: 12-step groups
alternative label: ACA
alternative label: ACOA
alternative label: AA
alternative label: CA
alternative label: CMA
alternative label: 12 step programs (LGBTQ)
alternative label: Recovery groups (LGBTQ)
alternative label: Step work (LGBTQ)
alternative label: LGBTQ+-affirming 12 step programs
alternative label: LGBTQ+-affirming step work
alternative label: NA
related: Sobriety
related: Alcoholics
related: LGBTQ+ children
related: LGBTQ+ people in Adult Children of Alcoholics
related: Substance abuse
related: LGBTQ+ support groups
has top concept: Health care for LGBTQ+ people
is replaced by: homoit0001551
replaces: recoveryGroups
replaces: adultChildrenOfAlcoholics
replaces: al-Anon
replaces: alcoholicsAnonymous
replaces: cocaineAnonymous
replaces: crystalMethAnonymous
replaces: LGBTQRecoveryGroups
replaces: narcoticsAnonymous
issued: 2020-06-02
issued: 2020-06-03
modified: 2022-08-15
modified: 2022-08-22
modified: 2025-02-23
type: Concept
in scheme: v3
change note: Version 4.1.0
comment: A twelve step program based in the U.S. that treats alcoholism as a disease and aims to address its impact on the adult lives of children of alcoholics; may be used in reference to LGBTQ+ members of ACA or LGBTQ+-focused chapters of ACA
comment: An international organization aimed toward supporting alcoholics in sobriety through a twelve-step program; may be used in reference to LGBTQ+ individuals in AA or LGBTQ+ chapters of AA
comment: Recovery groups, or voluntary associations of people in recovery from use disorders, conditions, or addictions, that are accepting and supportive of LGBTQ+ people and their identities.
comment: Grupos de recuperación, o asociaciones voluntarias de personas en recuperación de trastornos por consumo, condiciones o adicciones, que aceptan y apoyan a las personas LGBTQ+ y sus identidades. @es
broader: Mental health care for LGBTQ+ people

Alcoholics
preferred label: Alcoholism
preferred label: LGBTQ+ people with alcohol use disorders
preferred label: Personas LGBTQ+ con trastornos por consumo de alcohol @es
comment: Individuals who are addicted to alcohol or have alcohol dependencies
comment: LGBTQ+ people who have been diagnosed with or regard themselves as having an alcohol use disorder, a medical condition that involves a pattern of alcohol use that is difficult to control, negatively impacts the individual's life, and results in withdrawal symptoms upon cessation. Only use to refer to individuals who describe themselves as having an alcohol use disorder. Follow the individual's preference for "use disorder" or "addiction" whenever possible.
comment: Personas LGBTQ+ que han sido diagnosticadas o que reconocen que tienen un trastorno por consumo de alcohol, una condición médica que implica un patrón de consumo de alcohol difícil de controlar, que afecta negativamente la vida de la persona y que provoca síntomas de abstinencia al dejar de consumirlo. Utilícese únicamente para referirse a personas que se describen a sí mismas como padeciendo de un trastorno por consumo de alcohol. Siga la preferencia de la persona sobre el uso de "trastorno por consumo" o "adicción" siempre que sea posible. @es
related: LGBTQ+ children
related: LGBTQ+ partners
related: LGBTQ+ people in Adult Children of Alcoholics
related: Recovery groups
related: LGBTQ+ people in recovery
related: Two-Spirit people with alcohol use disorders
has top concept: LGBTQ+ people
is replaced by: homoit0001540
replaces: alcoholics
replaces: alcoholism
replaces: LGBTQAlcoholics
issued: 2020-06-02
issued: 2020-06-03
modified: 2022-08-22
modified: 2025-04-24
type: Concept
in scheme: v3
change note: Version 4.1.0
alternative label: Alcoholics (LGBTQ)
alternative label: LGBTQ+ alcoholics
alternative label: Alcohólicos (LGBTQ) @es
alternative label: Alcohólicos LGBTQ+ @es
alternative label: LGBTQ+ alcohólicos @es
broader: LGBTQ+ people who use substances
broader: LGBTQ+ people with addictions

Allosexuality
preferred label: Alosexualidad @es
comment: A sexual orientation generally characterized by the occurrence of sexual attraction or the desire for partnered sexual experiences.
comment: Una orientación sexual generalmente caracterizada por la atracción sexual o el deseo de tener experiencias sexuales en pareja. @es
broader: Sexual orientation
related: Bisexual people
related: Heterosexuals
related: Homosexuals
related: Pansexual people
related: Compulsory sexuality
related: Allosexual people
has top concept: Sexual orientation
replaces: allosexuality
issued: 2020-06-02
modified: 2025-02-23
type: Concept
in scheme: v3
change note: Version 4.1.0

Amatonormativity
preferred label: Amatonormatividad @es
comment: The assumption that all people share a desire for romantic relationships and that this is a preferential life goal.
comment: La suposición de que todas las personas comparten el deseo de tener relaciones románticas y que este es un objetivo de vida preferencial. @es
broader: Social norms
related: Aromantic people
related: LGBTQ+ discrimination
related: Compulsory monogamy
has top concept: Social norms
replaces: amatonormativity
issued: 2020-06-02
modified: 2025-02-23
type: Concept
in scheme: v3
change note: Version 4.1.0

Compulsory sexuality
preferred label: Sexualidad obligatoria @es
comment: The belief that everyone should be either sexually available or in a sexual relationship.
comment: La creencia de que todo el mundo debería estar disponible sexualmente o en una relación sexual. @es
broader: Social norms
related: Asexuality
related: Asexual people
related: Demisexuality
related: Demisexual people
related: LGBTQ+ discrimination
related: Allosexuality
related: Compulsory monogamy
related: Allosexual people
has top concept: Social norms
replaces: compulsorySexuality
issued: 2020-06-02
modified: 2025-02-23
type: Concept
in scheme: v3
change note: Version 4.1.0

Erotomania
preferred label: Erotomanía @es
alternative label: Clinical erotomania
alternative label: De Clérambault syndrome
alternative label: De Clérambault's syndrome
alternative label: Obsessional erotomania
alternative label: Primary erotomania
alternative label: Erotomanía clínica @es
alternative label: Síndrome de De Clérambault @es
alternative label: Erotomanía obsesiva @es
alternative label: Erotomanía primaria @es
comment: Condition characterized by an individual's persistent and often mistaken belief that another person is infatuated or in love with them. Can also be used to describe a level or frequency of sexual desire perceived as excessive within a given culture. Medical doctors and psychologists have historically diagnosed LGBTQ+ people with erotomania in order to wrongly treat their identities and desires as medical disorders. Should only be used in a historical context or if an individual self-identifies with the term.
comment: Condición caracterizada por la creencia persistente y a menudo errónea de una persona de que otra persona está encaprichada o enamorada de él. También se puede utilizar para describir un nivel o una frecuencia de deseo sexual percibida como excesiva dentro de una cultura determinada. Históricamente, los médicos y psicólogos han diagnosticado a las personas LGBTQ+ con erotomanía para erróneamente tratar sus identidades y deseos como trastornos médicos. Utilícese únicamente en un contexto histórico o si una persona se identifica con el término. @es
related: Hypersexuality
related: LGBTQ+ people with sexual addictions
replaces: erotomania
issued: 2020-06-02
modified: 2025-02-23
type: Concept
in scheme: v3
change note: Version 4.1.0

LGBTQ+ people with internet sex addictions
preferred label: Personas LGBTQ+ con adicciones al sexo por Internet @es
alternative label: LGBTQ+ people with cybersex addictions
alternative label: LGBTQ+ people with internet sexual addictions
alternative label: LGBTQ+ people with porn addictions
alternative label: LGBTQ+ people with pornography addictions
comment: LGBTQ+ people experiencing addiction to or dependency upon sexual activities involving the internet, including watching pornography, engaging in sexual conversations online, etc. Only use to refer to individuals who describe themselves as having internet sex addictions, not individuals who sexual practices are perceived as promiscuous or excessive by others.
comment: Personas LGBTQ+ que experimentan una adicción o dependencia de actividades sexuales que involucran el internet, incluyendo ver pornografía, participar de conversaciones sexuales en línea, etc. Utilícese únicamente para referirse a personas que se describen a sí mismas como adictas al sexo por internet, no a personas cuyas prácticas sexuales se perciban como promiscuas o excesivo por otras personas. @es
broader: LGBTQ+ people with sexual addictions
has top concept: LGBTQ+ people
replaces: internetSexAddiction
issued: 2020-06-03
modified: 2025-02-23
type: Concept
in scheme: v3
change note: Version 4.1.0

LGBTQ+ people in Adult Children of Alcoholics
preferred label: LGBTQ+ people in Al-Anon
preferred label: LGBTQ+ people in Alcoholics Anonymous
preferred label: LGBTQ+ people in Cocaine Anonymous
preferred label: LGBTQ+ people in Crystal Meth Anonymous
preferred label: LGBTQ+ people in Narcotics Anonymous
preferred label: LGBTQ+ step work
preferred label: LGBTQ+ people in recovery groups
preferred label: Personas LGBTQ+ en grupos de recuperación @es
alternative label: LGBTQ people in Adult Children of Alcoholics
alternative label: LGBTQ people in Al-Anon
alternative label: LGBTQ people in AA
alternative label: LGBTQ people in Alcoholics Anonymous
alternative label: LGBTQ people in CA
alternative label: LGBTQ people in Cocaine Anonymous
alternative label: LGBTQ people in CMA
alternative label: LGBTQ people in Crystal Meth Anonymous
alternative label: LGBTQ people in NA
alternative label: LGBTQ people in Narcotics Anonymous
alternative label: LGBTQ step work
alternative label: LGBTQ people in recovery groups
alternative label: LGBTQ+ people in 12 step programs
alternative label: People in recovery groups (LGBTQ)
broader: LGBTQ+ people
broader: Recovery groups
has top concept: LGBTQ+ people
has top concept: Health care for LGBTQ+ people
is replaced by: homoit0002227
replaces: LGBTQPeopleInAdultChildrenOfAlcoholics
replaces: LGBTQPeopleInAlAnon
replaces: LGBTQPeopleInAlcoholicsAnonymous
replaces: LGBTQPeopleInCocaineAnonymous
replaces: LGBTQPeopleInCrystalMethAnonymous
replaces: LGBTQPeopleInNarcoticsAnonymous
replaces: LGBTQStepWork
issued: 2020-06-03
issued: 2022-07-19
modified: 2022-12-16
modified: 2025-04-24
type: Concept
in scheme: v3
change note: Version 4.1.0
related: Alcoholics
related: Substance abuse
related: Recovery groups
related: Two-Spirit people in recovery groups
comment: LGBTQ+ people who are members of recovery groups, or voluntary associations of people in recovery from use disorders, conditions, or addictions.
comment: Personas LGBTQ+ que son miembros de grupos de recuperación o asociaciones voluntarias de personas en recuperación de trastornos, condiciones o adicciones por consumo. @es

LGBTQ+ people in recovery
preferred label: Personas LGBTQ+ en recuperación @es
alternative label: LGBTQ people in recovery
comment: LGBTQ+ people currently in recovery from use disorders, conditions, or addictions. Follow the individual's preference for "recovery" or "sobriety" whenever possible.
comment: Personas LGBTQ+ actualmente en recuperación de trastornos, condiciones o adicciones por consumo. Siga la preferencia de la persona sobre el uso de "recuperación" o "sobriedad" siempre que sea posible. @es
broader: LGBTQ+ people
related: Cocaine
related: Alcoholics
related: Two-Spirit people in recovery
has top concept: LGBTQ+ people
replaces: LGBTQPeopleInRecovery
issued: 2020-06-03
modified: 2025-04-24
type: Concept
in scheme: v3
change note: Version 4.1.0

LGBTQ+ people with addictions
preferred label: Personas LGBTQ+ con adicciones @es
alternative label: LGBTQ people with addictions
alternative label: Personas LGBTQ con adicciones @es
comment: Umbrella term for LGBTQ+ people experiencing addictions, dependencies, or use disorders of some kind. Only use to refer to individuals who describe themselves as having addictions. Apply more specific terms if possible.
comment: Término general para las personas LGBTQ+ que sufren de adicciones, dependencias o trastornos por consumo de algún tipo. Utilícese únicamente para referirse a personas que se describen a sí mismas como adictas. Aplique términos más específicos de ser posible. @es
broader: LGBTQ+ people who use substances
broader: Cocaine
broader: LGBTQ+ people
narrower: LGBTQ+ people with sexual addictions
narrower: Alcoholics
narrower: Substance abuse
related: Two-Spirit people with addictions
has top concept: LGBTQ+ people
replaces: LGBTQPeopleWithAddictions
issued: 2020-06-03
modified: 2025-04-24
type: Concept
in scheme: v3
change note: Version 4.1.0

Leather bars
preferred label: Bares leather @es
comment: Bars or clubs that cater to or which are known to be especially friendly to the leather community.
comment: Bares o clubes que atienden a miembros de la comunidad de cuero. @es
broader: LGBTQ+ bars
related: Dark rooms
related: Gay bars
related: Leather community
has top concept: LGBTQ+ meeting places
replaces: leatherBars
issued: 2020-06-03
modified: 2025-02-23
type: Concept
in scheme: v3
change note: Version 4.1.0

Metamours
comment: In polyamory or open relationships, metamours are the partners of an individual's partner, with whom the individual does not have a direct sexual or romantic relationship.
comment: En el poliamor o las relaciones abiertas, los metamours son las parejas de la pareja de una persona, con quien la persona no tiene una relación sexual o romántica directa. @es
broader: Polyamory
broader: Non-monogamous people
related: Secondary partners
related: Consensual non-monogamy
related: Paramours
has top concept: Relationship orientation
replaces: metamours
issued: 2020-06-03
modified: 2025-02-23
type: Concept
in scheme: v3
change note: Version 4.1.0

Mononormativity
preferred label: Mononormatividad @es
comment: The belief that all people share a desire for monogamous relationships and that this is a preferential life goal.
comment: La creencia de que todas las personas comparten el deseo de tener relaciones monógamas y que este es un objetivo preferencial en la vida. @es
broader: Social norms
related: LGBTQ+ discrimination
related: Monogamy
related: Monosexuality
related: Monosexual people
related: Monogamous people
has top concept: Social norms
replaces: mononormativity
issued: 2020-06-03
modified: 2025-02-23
type: Concept
in scheme: v3
change note: Version 4.1.0

Monosexuality
preferred label: Monosexualidad @es
comment: A sexuality that involves attraction to only one gender; includes homosexuality and heterosexuality.
comment: Una sexualidad que implica la atracción hacia un solo género; incluye la homosexualidad y la heterosexualidad. @es
broader: Sexual orientation
narrower: Heterosexuality
narrower: Homosexuality
related: Sexual diversity
related: Sexual identity
related: Sexual preference
related: Mononormativity
related: Monosexual people
has top concept: Sexual orientation
replaces: monosexuality
issued: 2020-06-03
modified: 2025-02-23
type: Concept
in scheme: v3
change note: Version 4.1.0

Polysexuality
preferred label: Polisexualidad @es
comment: Term used to describe the sexual identity of individuals who experience attraction to more than one gender; includes bisexuality and pansexuality.
comment: Término utilizado para describir la identidad sexual de personas que sienten atracción por más de un género; incluye la bisexualidad y la pansexualidad. @es
broader: Sexual diversity
broader: Sexual identity
broader: Sexual orientation
broader: Sexual preference
narrower: Bisexuality
narrower: Pansexuality
related: Polyamory
related: Polysexual people
has top concept: Diversity
replaces: polysexuality
issued: 2020-06-03
modified: 2026-02-24
type: Concept
in scheme: v3
change note: Version 4.1.0

Reclaimed terms
preferred label: Palabras reclamadas @es
alternative label: Términos recuperados @es
alternative label: Lenguaje reapropiado @es
comment: Terms that have been or are currently used in derogatory ways but have been reclaimed by certain groups or in certain circumstances.
comment: Términos que se han utilizado o se utilizan actualmente de manera despectiva pero que han sido reclamados por ciertos grupos o en determinadas circunstancias. @es
broader: LGBTQ+ slang
narrower: Dykes
narrower: Faggots
narrower: Queer people
narrower: Crip
narrower: Fairies (Gay culture)
narrower: Queercrip
related: Queer slang
related: Slurs
has top concept: LGBTQ+ slang
replaces: reclaimedTerms
issued: 2020-06-03
modified: 2025-02-23
type: Concept
in scheme: v3
change note: Version 4.1.0

Slurs
preferred label: Términos peyorativos @es
alternative label: Insultos @es
comment: Insulting or discriminating remarks, innuendos, or names intended to demoralize a person, typically by disparaging that person's identity or social group. Generally, for a term to be considered a slur, it must be derogatory towards a particular person or group, it must be used to subordinate them within some structure of power relations, and the derogated person or group must be defined by an intrinsic property such as their race, sexual orientation, gender identity, etc. This category includes terms considered slurs at any point in their usage. Therefore, some of these terms may no longer be considered universally derogatory, may be in common usage, or may be selectively reclaimed by certain groups.
comment: Comentarios, insinuaciones o nombres insultantes o discriminatorios destinados a desmoralizar a una persona, generalmente menospreciando su identidad o grupo social. Generalmente, para que un término se considere peyorativo, debe ser despectivo hacia una persona o grupo en particular, debe usarse para subordinarles dentro de alguna estructura de relaciones de poder, y la persona o grupo derogado debe estar definido por una propiedad intrínseca como su raza, orientación sexual, identidad de género, etc. Esta categoría incluye términos considerados insultos en cualquier momento de su uso. Por lo tanto, es posible que algunos de estos términos ya no se consideren universalmente despectivos, pueden ser de uso común o pueden ser reclamados selectivamente por ciertos grupos. @es
narrower: Agî
narrower: Ali
narrower: Bading
narrower: Bakla
narrower: Bantut
narrower: Berdache
narrower: Bayot
narrower: Chakka
narrower: Dykes
narrower: Faggots
narrower: Khteuy
narrower: Fairies (Gay culture)
related: Deadnaming
related: LGBTQ+ discrimination
related: Harassment
related: LGBTQ+ persecutions
related: LGBTQ+ slang
related: Reclaimed terms
replaces: slurs
issued: 2020-06-03
modified: 2025-02-23
type: Concept
in scheme: v3
change note: Version 4.1.0

Stigma
preferred label: Estigma @es
comment: Widespread disapproval of a group of people or set of behaviors based on preconceived ideas.
comment: Desaprobación generalizada de un grupo de personas o de un conjunto de conductas basada en ideas preconcebidas. @es
related: Intolerance towards LGBTQ+ people
related: LGBTQ+ discrimination
related: Gay shame
replaces: stigma
issued: 2020-06-03
modified: 2025-02-23
type: Concept
in scheme: v3
change note: Version 4.1.0

Sobriety
preferred label: LGBTQ+ people practicing sobriety
preferred label: Personas LGBTQ+ que practican la sobriedad @es
comment: Conscious abstinence from addictive or mind-altering substances, typically alcohol or drugs.
comment: LGBTQ+ people intentionally refraining from substance use (typically drugs or alcohol). Follow the individual's preference for "sobriety" or "recovery" whenever possible.
comment: Personas LGBTQ+ que se abstienen intencionalmente de consumir sustancias (usualmente drogas o alcohol). Siga la preferencia de la persona sobre el uso de "sobriedad" o "recuperación" siempre que sea posible. @es
related: Party drugs
related: Recovery groups
related: Two-Spirit people practicing sobriety
has top concept: LGBTQ+ people
is replaced by: homoit0002228
replaces: sobriety
issued: 2020-06-03
issued: 2022-07-19
modified: 2022-12-16
modified: 2025-04-24
type: Concept
in scheme: v3
change note: Version 4.1.0
alternative label: LGBTQ+ sober people
alternative label: Sober LGBTQ+ people
alternative label: Sober people (LGBTQ)
alternative label: Sobriety (LGBTQ)
broader: LGBTQ+ people

Trans
alternative label: Trans*
comment: Umbrella term used to describe individuals who "trans" gender regardless of their identification; sometimes used as a way to historicize non-binary identities.
comment: Término general utilizado para describir a las personas de género "trans" independientemente de su identificación; a veces, se utiliza como una forma de historizar identidades no binarias. @es
related: Gender identity
related: Transgender people
related: Transgender identity
related: Transgenderism
related: Transsexualism
related: Transvestism
replaces: trans
issued: 2020-06-03
modified: 2025-02-23
type: Concept
in scheme: v3
change note: Version 4.1.0

Uranism
preferred label: Uranismo @es
alternative label: Uranismus
alternative label: Congenital sexual inversion
alternative label: Urningism
alternative label: Uraniadism
alternative label: Uranianism
comment: Historical term originating from the German "Uranismus" coined by Karl Heinrich Ulrichs as an umbrella term for what are now referred to as gender and sexual minorities; use only in historical contexts.
comment: Término histórico que se origina en el "uranismo" alemán acuñado por Karl Heinrich Ulrichs como término general para lo que ahora se conoce como minorías sexuales y de género; utilícese únicamente en contextos históricos. @es
broader: LGBTQ+ historical terms
related: Inverts
related: Sexual inversion
related: Uranians
has top concept: LGBTQ+ historical terms
replaces: uranism
issued: 2020-06-03
modified: 2025-02-23
type: Concept
in scheme: v3
change note: Version 4.1.0

Lesbian fantasy fiction
preferred label: Ficción fantástica lésbica @es
comment: Written works that include magical or fantastical elements; use in reference to fantasy fiction focusing on lesbian characters or themes.
comment: Obras escritas que incluyan elementos mágicos o fantásticos; utilícese en referencia a la ficción fantástica centrada en personajes o temas lésbicos. @es
broader: LGBTQ+ fantasy fiction
has top concept: Subcultures
replaces: lesbianFantasyFiction
issued: 2020-06-03
modified: 2025-02-23
type: Concept
in scheme: v3
change note: Version 4.1.0

Gay fantasy fiction
preferred label: Ficción fantástica gay @es
comment: Written works that include magical or fantastical elements; use in reference to fantasy fiction focusing on gay characters or themes.
comment: Obras escritas que incluyen elementos mágicos o fantásticos; utilícese en referencia a la ficción fantástica que se centra en personajes o temas gay. @es
broader: LGBTQ+ fantasy fiction
has top concept: Subcultures
replaces: gayFantasyFiction
issued: 2020-06-03
modified: 2025-02-23
type: Concept
in scheme: v3
change note: Version 4.1.0

Bisexual fantasy fiction
preferred label: Familias bisexuales @es
comment: Written works that include magical or fantastical elements; use in reference to fantasy fiction focusing on bisexual characters or themes.
comment: Familias, ya sean biológicas, adoptivas o elegidas, en las que una o más personas se autoidentican como bisexuales. @es
broader: LGBTQ+ fantasy fiction
has top concept: Subcultures
replaces: bisexualFantasyFiction
issued: 2020-06-03
modified: 2025-02-23
type: Concept
in scheme: v3
change note: Version 4.1.0

Transgender fantasy fiction
preferred label: Ficción fantástica transgénero @es
comment: Written works that include magical or fantastical elements; use in reference to fantasy fiction focusing on transgender characters or themes.
comment: Obras escritas que incluyan elementos mágicos o fantásticos; utilícese en referencia a la ficción fantástica centrada en personajes o temas transgénero. @es
broader: LGBTQ+ fantasy fiction
has top concept: Subcultures
replaces: transgenderFantasyFiction
issued: 2020-06-03
modified: 2025-02-23
type: Concept
in scheme: v3
change note: Version 4.1.0

Queer fantasy fiction
preferred label: Ficción fantástica queer @es
comment: Written works that include magical or fantastical elements; use in reference to fantasy fiction focusing on queer characters or themes.
comment: Obras escritas que incluyan elementos mágicos o fantásticos; utilícese en referencia a la ficción fantástica que se centra en personajes o temas queer. @es
broader: LGBTQ+ fantasy fiction
has top concept: Subcultures
replaces: queerFantasyFiction
issued: 2020-06-03
modified: 2025-02-23
type: Concept
in scheme: v3
change note: Version 4.1.0

Lesbian science fiction
preferred label: Ciencia ficción lésbica @es
comment: Written literary works about imaginative or futuristic concepts incorporating science, technology, space, time travel, and other speculative elements; use in reference to science fiction focusing on lesbian characters and themes.
comment: Obras literarias escritas sobre conceptos imaginativos o futuristas que incorporen la ciencia, la tecnología, el espacio, los viajes en el tiempo y otros elementos especulativos; utilícese en referencia a la ciencia ficción centrada en personajes y temas lésbicos. @es
broader: LGBTQ+ science fiction
has top concept: Subcultures
replaces: lesbianScienceFiction
issued: 2020-06-03
modified: 2025-02-23
type: Concept
in scheme: v3
change note: Version 4.1.0

Gay science fiction
preferred label: Ciencia ficción gay @es
comment: Written literary works about imaginative or futuristic concepts incorporating science, technology, space, time travel, and other speculative elements; use in reference to science fiction focusing on gay characters or themes.
comment: Obras literarias escritas sobre conceptos imaginativos o futuristas que incorporan la ciencia, la tecnología, el espacio, los viajes en el tiempo y otros elementos especulativos; utilícese en referencia a la ciencia ficción centrada en personajes o temas gay. @es
broader: LGBTQ+ science fiction
has top concept: Subcultures
replaces: gayScienceFiction
issued: 2020-06-03
modified: 2025-02-23
type: Concept
in scheme: v3
change note: Version 4.1.0

Bisexual science fiction
preferred label: Personas católico romanas bisexuales @es
alternative label: Católico romanos bisexuales @es
alternative label: Católico romanas bisexuales @es
comment: Written literary work about imaginative or futuristic concepts incorporating science, technology, space, time travel, and other speculative elements; use in reference to science fiction focusing on bisexual characters or themes.
comment: Personas bisexuales que son miembros de la Iglesia católica romana. @es
broader: LGBTQ+ science fiction
has top concept: Subcultures
replaces: bisexualScienceFiction
issued: 2020-06-03
modified: 2025-02-23
type: Concept
in scheme: v3
change note: Version 4.1.0

Transgender science fiction
preferred label: Ciencia ficción transgénero @es
comment: Written literary works about imaginative or futuristic concepts incorporating science, technology, space, time travel, and other speculative elements; use in reference to science fiction focusing on transgender characters and themes.
comment: Obras literarias escritas sobre conceptos imaginativos o futuristas que incorporen la ciencia, la tecnología, el espacio, los viajes en el tiempo y otros elementos especulativos; utilícese en referencia a la ciencia ficción centrada en personajes y temas transgénero. @es
broader: LGBTQ+ science fiction
has top concept: Subcultures
replaces: transgenderScienceFiction
issued: 2020-06-03
modified: 2025-02-23
type: Concept
in scheme: v3
change note: Version 4.1.0

Queer science fiction
preferred label: Ciencia ficción queer @es
comment: Written literary works about imaginative or futuristic concepts incorporating science, technology, space, time travel, and other speculative elements; use in reference to science fiction focusing on queer characters or themes.
comment: Obras literarias escritas sobre conceptos imaginativos o futuristas que incorporen la ciencia, la tecnología, el espacio, los viajes en el tiempo y otros elementos especulativos; utilícese en referencia a la ciencia ficción centrada en personajes o temas queer. @es
broader: LGBTQ+ science fiction
has top concept: Subcultures
replaces: queerScienceFiction
issued: 2020-06-03
modified: 2025-02-23
type: Concept
in scheme: v3
change note: Version 4.1.0

Lesbian mystery and detective fiction
preferred label: Ficción lésbica de misterio y de detectives @es
alternative label: Ficción de misterio y detectives lésbica @es
comment: Written literary works about the investigation of crime or the work of detectives; use in reference to mystery and detective fiction focusing on lesbian characters and themes.
comment: Obras literarias escritas sobre la investigación de crímenes o el trabajo de detectives; utilícese en referencia a la ficción de misterio y de detectives centrada en personajes y temas lésbicos. @es
broader: LGBTQ+ mystery and detective fiction
has top concept: Subcultures
replaces: lesbianMysteryAndDectectiveFiction
issued: 2020-06-03
modified: 2025-02-23
type: Concept
in scheme: v3
change note: Version 4.1.0

Gay mystery and detective fiction
preferred label: Musulmanes gay @es
comment: Written literary works about the investigation of crime or the work of detectives; use in reference to mystery and detective fiction focusing on gay characters or themes.
comment: Hombres gay que son musulmanes. @es
broader: LGBTQ+ mystery and detective fiction
has top concept: Subcultures
replaces: gayMysteryAndDetectiveFiction
issued: 2020-06-03
modified: 2025-02-23
type: Concept
in scheme: v3
change note: Version 4.1.0

Bisexual mystery and detective fiction
preferred label: Musicales bisexuales @es
comment: Written literary works about the investigation of crime or the work of detectives; use in reference to mystery and detective fiction focusing on bisexual characters or themes.
comment: Musicales creados por directores bisexuales, que representan a personas bisexuales o que se consideran importantes dentro de la cultura bisexual. @es
broader: LGBTQ+ mystery and detective fiction
has top concept: Subcultures
replaces: bisexualMysteryAndDetectiveFiction
issued: 2020-06-03
modified: 2025-02-23
type: Concept
in scheme: v3
change note: Version 4.1.0

Transgender mystery and detective fiction
preferred label: Ficción transgénero de misterio y de detectives @es
comment: Written literary works about the investigation of crime or the work of detectives; use in reference to mystery and detective fiction focusing on transgender characters and themes.
comment: Obras literarias escritas sobre la investigación de crímenes o el trabajo de detectives; utilícese en referencia a la ficción de misterio y de detectives centrada en personajes y temas transgénero. @es
broader: LGBTQ+ mystery and detective fiction
has top concept: Subcultures
replaces: transgenderMysteryAndDetectiveFiction
issued: 2020-06-03
modified: 2025-02-23
type: Concept
in scheme: v3
change note: Version 4.1.0

Queer mystery and detective fiction
preferred label: Ficción queer de misterio y de detectives @es
comment: Written literary works about the investigation of crime or the work of detectives; use in reference to mystery and detective fiction focusing on queer characters and themes.
comment: Obras literarias escritas sobre la investigación de crímenes o el trabajo de detectives; utilícese en referencia a la ficción de misterio y de detectives centrada en personajes y temas queer. @es
broader: LGBTQ+ mystery and detective fiction
has top concept: Subcultures
replaces: queerMysteryAndDetectiveFiction
issued: 2020-06-03
modified: 2025-02-23
type: Concept
in scheme: v3
change note: Version 4.1.0

LGBTQ+ horror fiction
preferred label: Ficción de horror LGBTQ+ @es
alternative label: Horror fiction (LGBTQ)
alternative label: Ficción de horror (LGBTQ) @es
comment: Written works of fiction intended to frighten, scare, or disgust; use in reference to horror fiction focusing on LGBTQ+ characters or themes.
comment: Obras de ficción escritas con la intención de asustar, atemorizar o provocar disgusto; utilícese en referencia a la ficción de horror centrada en personajes o temas LGBTQ+. @es
broader: LGBTQ+ fiction
narrower: Lesbian horror fiction
narrower: Gay horror fiction
narrower: Bisexual horror fiction
narrower: Transgender horror fiction
narrower: Queer horror fiction
narrower: Demisexual horror fiction
narrower: Aromantic horror fiction
narrower: Intersex horror fiction
narrower: Asexual horror fiction
narrower: Megasexual horror fiction
narrower: Greyromantic horror fiction
narrower: Non-binary horror fiction
related: Māhū horror fiction
related: Two-Spirit horror fiction
has top concept: Subcultures
replaces: horrorFictionLGBTQ
issued: 2020-06-03
modified: 2025-02-23
type: Concept
in scheme: v3
change note: Version 4.1.0

Lesbian horror fiction
preferred label: Ficción de horror lésbica @es
alternative label: Ficción lésbica de terror @es
comment: Written works of fiction intended to frighten, scare, or disgust; use in reference to horror fiction focusing on lesbian characters or themes.
comment: Obras de ficción escritas con la intención de asustar, atemorizar o provocar disgusto; utilícese en referencia a la ficción de horror centrada en personajes o temas lésbicos. @es
broader: LGBTQ+ horror fiction
has top concept: Subcultures
replaces: lesbianHorrorFiction
issued: 2020-06-03
modified: 2025-02-23
type: Concept
in scheme: v3
change note: Version 4.1.0

Gay horror fiction
preferred label: Ficción de horror gay @es
comment: Written works of fiction intended to frighten, scare, or disgust; use in reference to horror fiction focusing on gay characters or themes.
comment: Obras de ficción escritas con la intención de asustar, atemorizar o provocar disgusto; utilícese en referencia a la ficción de horror centrada en personajes o temas gay. @es
broader: LGBTQ+ horror fiction
has top concept: Subcultures
replaces: gayHorrorFiction
issued: 2020-06-03
modified: 2025-02-23
type: Concept
in scheme: v3
change note: Version 4.1.0

Bisexual horror fiction
preferred label: Historia bisexual @es
comment: Written works of fiction intended to frighten, scare, or disgust; use in reference to horror fiction focusing on bisexual characters or themes.
comment: Eventos o relatos del pasado relacionados con personas bisexuales, o personas que podrían ser percibidas como bisexuales si estuvieran vivas hoy. @es
broader: LGBTQ+ horror fiction
has top concept: Subcultures
replaces: bisexualHorrorFiction
issued: 2020-06-03
modified: 2025-02-23
type: Concept
in scheme: v3
change note: Version 4.1.0

Transgender horror fiction
preferred label: Ficción de horror transgénero @es
comment: Written works of fiction intended to frighten, scare, or disgust; use in reference to horror fiction focusing on transgender characters or themes.
comment: Obras de ficción escritas con la intención de asustar, atemorizar o provocar disgusto; utilícese en referencia a la ficción de horror centrada en personajes o temas transgénero. @es
broader: LGBTQ+ horror fiction
has top concept: Subcultures
replaces: transgenderHorrorFiction
issued: 2020-06-03
modified: 2025-02-23
type: Concept
in scheme: v3
change note: Version 4.1.0

Queer horror fiction
preferred label: Ficción de horror queer @es
comment: Written works of fiction intended to frighten, scare, or disgust; use in reference to horror fiction focusing on queer characters or themes.
comment: Obras de ficción escritas con la intención de asustar, atemorizar o provocar disgusto; utilícese en referencia a la ficción de horror centrada en personajes o temas queer. @es
broader: LGBTQ+ horror fiction
has top concept: Subcultures
replaces: queerHorrorFiction
issued: 2020-06-03
modified: 2025-02-23
type: Concept
in scheme: v3
change note: Version 4.1.0

LGBTQ+ romance fiction
preferred label: Ficción romántica LGBTQ+ @es
alternative label: Romance fiction (LGBTQ)
alternative label: Ficción romántica (LGBTQ) @es
comment: Works of fiction revolving around romantic and/or sexual relationships between the main characters; use in reference to romance fiction focusing on LGBTQ+ characters.
comment: Obras de ficción que giran en torno a relaciones románticas y/o sexuales entre los personajes principales; utilícese en referencia a la ficción romántica centrada en personajes LGBTQ+. @es
broader: LGBTQ+ fiction
narrower: Lesbian romance fiction
narrower: Gay romance fiction
narrower: Bisexual romance fiction
narrower: Transgender romance fiction
narrower: Queer romance fiction
narrower: Asexual romance fiction
narrower: Aromantic romance fiction
narrower: Intersex romance fiction
narrower: Demisexual romance fiction
narrower: Megasexual romance fiction
narrower: Greyromantic romance fiction
narrower: Non-binary romance fiction
related: Māhū romance fiction
related: Two-Spirit romance fiction
has top concept: Subcultures
replaces: romanceFictionLGBTQ
issued: 2020-06-03
modified: 2025-02-23
type: Concept
in scheme: v3
change note: Version 4.1.0

Lesbian comics
preferred label: Cómics lésbicos @es
comment: Works consisting of sequential images often accompanied by text; use in reference to comics focusing on lesbian characters or themes.
comment: Obras que consisten en imágenes secuenciales, a menudo acompañadas de texto; utilícese en referencia a cómics que se centran en personajes o temas lésbicos. @es
broader: LGBTQ+ comics
has top concept: Subcultures
replaces: lesbianComics
issued: 2020-06-03
modified: 2025-02-23
type: Concept
in scheme: v3
change note: Version 4.1.0

Gay comics
preferred label: Cómics gay @es
alternative label: Historietas gay @es
comment: Works consisting of sequential images often accompanied by text; use in reference to comics focusing on gay characters or themes.
comment: Obras que consisten en imágenes secuenciales, a menudo acompañadas de texto; utilicese en referencia a cómics que se centran en personajes o temas gay. @es
broader: LGBTQ+ comics
has top concept: Subcultures
replaces: gayComics
issued: 2020-06-03
modified: 2025-02-23
type: Concept
in scheme: v3
change note: Version 4.1.0

Bisexual comics
preferred label: Cómics bisexuales @es
alternative label: Historietas bisexuales @es
comment: Works consisting of sequential images often accompanied by text; use in reference to comics focusing on bisexual characters or themes.
comment: Obras que consisten en imágenes secuenciales, a menudo acompañadas de texto; utilícese en referencia a cómics que se centran en personajes o temas bisexuales. @es
broader: LGBTQ+ comics
has top concept: Subcultures
replaces: bisexualComics
issued: 2020-06-03
modified: 2025-02-23
type: Concept
in scheme: v3
change note: Version 4.1.0

Transgender comics
preferred label: Cómics transgénero @es
alternative label: Historietas transgénero @es
comment: Works consisting of sequential images often accompanied by text; use in reference to comics focusing on transgender characters or themes.
comment: Obras que consisten en imágenes secuenciales, a menudo acompañadas de texto; utilícese en referencia a cómics que se centran en personajes o temas transgénero. @es
broader: LGBTQ+ comics
has top concept: Subcultures
replaces: transgenderComics
issued: 2020-06-03
modified: 2025-02-23
type: Concept
in scheme: v3
change note: Version 4.1.0

Queer comics
preferred label: Cómics queer @es
alternative label: Historietas queer @es
comment: Works consisting of sequential images often accompanied by text; use in reference to comics focusing on queer characters or themes.
comment: Obras que consisten en imágenes secuenciales, a menudo acompañadas de texto; utilícese en referencia a cómics que se centran en personajes o temas queer. @es
broader: LGBTQ+ comics
has top concept: Subcultures
replaces: queerComics
issued: 2020-06-03
modified: 2025-02-23
type: Concept
in scheme: v3
change note: Version 4.1.0

Lesbian romance fiction
preferred label: Ficción romántica lésbica @es
comment: Written literary works focusing on romantic relationships and love between people; use in reference to romance fiction focusing on lesbian characters and themes.
comment: Obras literarias escritas centradas en las relaciones románticas y en el amor entre personas; utilícese en referencia a la ficción romántica centrada en personajes y temas lésbicos. @es
broader: LGBTQ+ romance fiction
has top concept: Subcultures
replaces: lesbianRomanceFiction
issued: 2020-06-03
modified: 2025-02-23
type: Concept
in scheme: v3
change note: Version 4.1.0

Gay romance fiction
preferred label: Ficción romántica gay @es
comment: Written literary work focusing on romantic relationships and love between people; use in reference to romance fiction focusing on gay characters or themes.
comment: Obras literarias escritas centradas en las relaciones románticas y el amor entre personas; utilícese en referencia a la ficción romántica centrada en personajes o temas gay. @es
broader: LGBTQ+ romance fiction
has top concept: Subcultures
replaces: gayRomanceFiction
issued: 2020-06-03
modified: 2025-02-23
type: Concept
in scheme: v3
change note: Version 4.1.0

Bisexual romance fiction
preferred label: Derechos bisexuales @es
comment: Written literary work focusing on romantic relationships and love between people; use in reference to romance fiction focusing on bisexual characters or themes.
comment: Principios legales, sociales o éticos de libertad o derecho que tienen las personas bisexuales. @es
broader: LGBTQ+ romance fiction
has top concept: Subcultures
replaces: bisexualRomanceFiction
issued: 2020-06-03
modified: 2025-02-23
type: Concept
in scheme: v3
change note: Version 4.1.0

Transgender romance fiction
preferred label: Ficción romántica transgénero @es
comment: Written literary works focusing on romantic relationships and love between people; use in reference to romance fiction focusing on transgender characters and themes.
comment: Obras literarias escritas centradas en las relaciones románticas y el amor entre personas; utilícese en referencia a la ficción romántica centrada en personajes y temas transgénero. @es
broader: LGBTQ+ romance fiction
has top concept: Subcultures
replaces: transgenderRomanceFiction
issued: 2020-06-03
modified: 2025-02-23
type: Concept
in scheme: v3
change note: Version 4.1.0

Queer romance fiction
preferred label: Ficción romántica queer @es
comment: Written literary work focusing on romantic relationships and love between people; use in reference to romance fiction focusing on queer characters or themes.
comment: Obras literarias escritas centradas en las relaciones románticas y el amor entre personas; utilícese en referencia a la ficción romántica que se centra en personajes o temas queer. @es
broader: LGBTQ+ romance fiction
has top concept: Subcultures
replaces: queerRomanceFiction
issued: 2020-06-03
modified: 2025-02-23
type: Concept
in scheme: v3
change note: Version 4.1.0

Lesbian erotic literature
preferred label: Literatura erótica lesbiana @es
comment: Literary works that have erotic or sexual elements; use in reference to erotic literature focusing on lesbian characters or themes.
comment: Obras literarias que tiene elementos eróticos o sexuales; utilícese en referencia a la literatura erótica que se centra en personajes o temas lésbicos. @es
broader: LGBTQ+ erotic literature
broader: Femslash
related: Yuri
has top concept: Erotica
replaces: lesbianEroticLiterature
issued: 2020-06-03
modified: 2025-02-23
type: Concept
in scheme: v3
change note: Version 4.1.0

Gay erotic literature
preferred label: Literatura erótica gay @es
comment: Literary works with erotic or sexual elements; use in reference to erotic literature focusing on gay characters or themes.
comment: Obras literarias con elementos eróticos o sexuales; utilícese en referencia a la literatura erótica que se centra en personajes o temas gay. @es
broader: LGBTQ+ erotic literature
related: Yaoi
has top concept: Erotica
replaces: gayEroticLiterature
issued: 2020-06-03
modified: 2025-02-23
type: Concept
in scheme: v3
change note: Version 4.1.0

Bisexual erotic literature
preferred label: Películas eróticas bisexuales @es
comment: Literary works that have erotic or sexual elements; use in reference to erotic literature focusing on bisexual characters or themes.
comment: Filmes o películas eróticas, creadas por directores bisexuales, que representan a personas bisexuales o a personas consideradas importantes dentro de la cultura bisexual. @es
broader: LGBTQ+ erotic literature
has top concept: Erotica
replaces: bisexualEroticLiterature
issued: 2020-06-03
modified: 2025-02-23
type: Concept
in scheme: v3
change note: Version 4.1.0

Transgender erotic literature
preferred label: Literatura erótica transgénero @es
comment: Literary works that have erotic or sexual elements; use in reference to erotic literature focusing on transgender characters or themes.
comment: Obras literarias que tengan elementos eróticos o sexuales; utilícese en referencia a la literatura erótica que se centra en personajes o temas transgénero. @es
broader: LGBTQ+ erotic literature
has top concept: Erotica
replaces: transgenderEroticLiterature
issued: 2020-06-03
modified: 2025-02-23
type: Concept
in scheme: v3
change note: Version 4.1.0

Queer erotic literature
preferred label: Literatura erótica queer @es
comment: Literary works that have erotic or sexual elements; use in reference to erotic literature focusing on queer characters or themes.
comment: Obras literarias que tengan elementos eróticos o sexuales; utilícese en referencia a la literatura erótica que se centra en personajes o temas queer. @es
broader: LGBTQ+ erotic literature
has top concept: Erotica
replaces: queerEroticLiterature
issued: 2020-06-03
modified: 2025-02-23
type: Concept
in scheme: v3
change note: Version 4.1.0

LGBTQ+ literary criticism
preferred label: Crítica literaria LGBTQ+ @es
alternative label: Literary criticism (LGBTQ)
alternative label: Crítica literaria LGBTQ @es
comment: The study, evaluation, and interpretation of literary works focusing on LGBTQ+ characters or themes; can also include interpretation of literature through the lens and frameworks associated with LGBTQ+ studies.
comment: El estudio, la evaluación y la interpretación de obras literarias centradas en personajes o temas LGBTQ+; también puede incluir la interpretación de la literatura a través del lente y los marcos teóricos asociados con los estudios LGBTQ+. @es
narrower: Lesbian literary criticism
narrower: Gay literary criticism
narrower: Bisexual literary criticism
narrower: Transgender literary criticism
narrower: Queer literary criticism
narrower: Aromantic literary criticism
narrower: Asexual literary criticism
narrower: Demisexual literary criticism
narrower: Megasexual literary criticism
narrower: Greyromantic literary criticism
narrower: Intersex literary criticism
related: LGBTQ+ literature
related: LGBTQ+ authors
related: Two-Spirit literary criticism
related: LGBTQ+ film criticism
related: Feminist film criticism
replaces: literaryCriticismLGBTQ
issued: 2020-06-03
modified: 2025-02-23
type: Concept
in scheme: v3
change note: Version 4.1.0

Lesbian literary criticism
preferred label: Crítica literaria lésbica @es
comment: The study, evaluation, and interpretation of literary works focusing on lesbian characters or themes; can also include interpretation of literature through the lens and frameworks of lesbian studies.
comment: El estudio, la evaluación y la interpretación de obras literarias centradas en personajes o temas lésbicos; también puede incluir la interpretación de la literatura a través del lente y los marcos teóricos de los estudios lésbicos. @es
broader: LGBTQ+ literary criticism
related: Lesbian authors
related: Aromantic literary criticism
related: Asexual literary criticism
related: Greyromantic literary criticism
has top concept: LGBTQ+ literary criticism
replaces: lesbianLiteraryCriticism
issued: 2020-06-03
modified: 2025-02-23
type: Concept
in scheme: v3
change note: Version 4.1.0

Gay literary criticism
preferred label: Crítica literaria gay @es
comment: The study, evaluation, and interpretation of literary works focusing on gay characters or themes; can also include interpretation of literature through the lens and frameworks of gay studies.
comment: El estudio, la evaluación y la interpretación de obras literarias centradas en personajes o temas gay; también puede incluir la interpretación de la literatura a través del lente y los marcos teóricos de los estudios gay. @es
broader: LGBTQ+ literary criticism
related: Gay authors
related: Aromantic literary criticism
related: Asexual literary criticism
related: Greyromantic literary criticism
has top concept: LGBTQ+ literary criticism
replaces: gayLiteraryCriticism
issued: 2020-06-03
modified: 2025-02-23
type: Concept
in scheme: v3
change note: Version 4.1.0

Bisexual literary criticism
preferred label: Bibliotecas bisexuales @es
comment: The study, evaluation, and interpretation of literary works focusing on bisexual characters or themes; can also include interpretation of literature through the lens and frameworks of bisexuality.
comment: Bibliotecas que contienen materiales principalmente relacionados con personas bisexuales o destinados a personas bisexuales. @es
broader: LGBTQ+ literary criticism
related: Bisexual authors
related: Aromantic literary criticism
related: Asexual literary criticism
related: Greyromantic literary criticism
has top concept: LGBTQ+ literary criticism
replaces: bisexualLiteraryCriticism
issued: 2020-06-03
modified: 2025-02-23
type: Concept
in scheme: v3
change note: Version 4.1.0

Transgender literary criticism
preferred label: Crítica literaria transgénero @es
comment: The study, evaluation, and interpretation of literary works focusing on transgender characters or themes; can also include interpretation of literature through the lens and frameworks of transgender studies.
comment: El estudio, la evaluación y la interpretación de obras literarias centradas en personajes o temas transgénero; también puede incluir la interpretación de la literatura a través del lente y los marcos teóricos de los estudios transgénero. @es
broader: LGBTQ+ literary criticism
related: Transgender authors
related: Aromantic literary criticism
related: Asexual literary criticism
related: Greyromantic literary criticism
has top concept: LGBTQ+ literary criticism
replaces: transgenderLiteraryCriticism
issued: 2020-06-03
modified: 2025-02-23
type: Concept
in scheme: v3
change note: Version 4.1.0

Queer literary criticism
preferred label: Crítica literaria queer @es
comment: The study, evaluation, and interpretation of literary works focusing on queer characters or themes; can also include interpretation of literature through the lens and frameworks of queer theory.
comment: El estudio, la evaluación y la interpretación de obras literarias centradas en personajes o temas queer; también puede incluir la interpretación de la literatura a través del lente y los marcos teóricos de la teoría queer. @es
broader: LGBTQ+ literary criticism
related: Queer authors
related: Aromantic literary criticism
related: Asexual literary criticism
related: Greyromantic literary criticism
has top concept: LGBTQ+ literary criticism
replaces: queerLiteraryCriticism
issued: 2020-06-03
modified: 2025-02-23
type: Concept
in scheme: v3
change note: Version 4.1.0

LGBTQ+ short stories
preferred label: Cuentos cortos LGBTQ+ @es
alternative label: Short stories (LGBTQ)
alternative label: Cuentos cortos (LGBTQ) @es
alternative label: Relatos LGBTQ+ @es
alternative label: Relatos (LGBTQ) @es
comment: Written literary works that are short in length and detail a self-contained incident or concept; use in reference to short stories focusing on LGBTQ+ characters or themes.
comment: Obras literarias escritas que son breves y detallan un incidente o concepto autónomo; utilícese en referencia a cuentos cortos que se centren en personajes o temas LGBTQ+. @es
broader: LGBTQ+ fiction
narrower: Lesbian short stories
narrower: Gay short stories
narrower: Bisexual short stories
narrower: Transgender short stories
narrower: Queer short stories
narrower: Asexual short stories
narrower: Aromantic short stories
narrower: Intersex short stories
narrower: Demisexual short stories
narrower: Megasexual short stories
narrower: Greyromantic short stories
narrower: Non-binary short stories
related: Māhū short stories
related: Two-Spirit short stories
has top concept: Subcultures
replaces: shortStoriesLGBTQ
issued: 2020-06-03
modified: 2025-02-23
type: Concept
in scheme: v3
change note: Version 4.1.0

Lesbian short stories
preferred label: Cuentos cortos lésbicos @es
alternative label: Relatos lésbicos|| @es
comment: Written literary works that are short in length and detail a self-contained incident or concept; use in reference to short stories focusing on lesbian characters or themes.
comment: Obras literarias escritas que son breves y detallan un incidente o concepto autónomo; utilícese en referencia a cuentos centrados en personajes o temas lésbicos. @es
broader: LGBTQ+ short stories
has top concept: Subcultures
replaces: lesbianShortStories
issued: 2020-06-03
modified: 2025-02-23
type: Concept
in scheme: v3
change note: Version 4.1.0

Gay short stories
preferred label: Cuentos cortos gay @es
alternative label: Relatos gay @es
comment: Written literary works that are short in length and detail a self-contained incident or concept; use in reference to short stories focusing on gay characters or themes.
comment: Obras literarias escritas que son breves y detallan un incidente o concepto autónomo; utilícese en referencia a cuentos cortos que se centren en personajes o temas gay. @es
broader: LGBTQ+ short stories
has top concept: Subcultures
replaces: gayShortStories
issued: 2020-06-03
modified: 2025-02-23
type: Concept
in scheme: v3
change note: Version 4.1.0

Bisexual short stories
preferred label: Ficción romántica bisexual @es
comment: Written literary works that are short in length and detail a self-contained incident or concept; use in reference to short stories focusing on bisexual characters or themes.
comment: Obras literarias escritas centradas en las relaciones románticas y el amor entre personas; utilícese en referencia a la ficción romántica centrada en personajes o temas bisexuales. @es
broader: LGBTQ+ short stories
has top concept: Subcultures
replaces: bisexualShortStories
issued: 2020-06-03
modified: 2025-02-23
type: Concept
in scheme: v3
change note: Version 4.1.0

Transgender short stories
preferred label: Cuentos cortos transgénero @es
alternative label: Relatos transgénero @es
comment: Written literary works that are short in length and detail a self-contained incident or concept; use in reference to short stories focusing on transgender characters or themes.
comment: Obras literarias escritas que son breves y detallan un incidente o concepto autónomo; utilícese en referencia a cuentos cortos que se centren en personajes o temas transgénero. @es
broader: LGBTQ+ short stories
has top concept: Subcultures
replaces: transgenderShortStories
issued: 2020-06-03
modified: 2025-02-23
type: Concept
in scheme: v3
change note: Version 4.1.0

Queer short stories
preferred label: Cuentos cortos queer @es
alternative label: Relatos queer @es
comment: Written literary works that are short in length and detail a self-contained incident or concept; use in reference to short stories focusing on queer characters or themes.
comment: Obras literarias escritas que son breves y detallan un incidente o concepto autónomo; utilícese en referencia a los cuentos cortos que se centren en personajes o temas queer. @es
broader: LGBTQ+ short stories
has top concept: Subcultures
replaces: queerShortStories
issued: 2020-06-03
modified: 2025-02-23
type: Concept
in scheme: v3
change note: Version 4.1.0

LGBTQ+ biographies
preferred label: Biografías LGBTQ+ @es
alternative label: Biographies of authors
alternative label: Biographies (LGBTQ)
alternative label: Biografías (LGBTQ) @es
alternative label: Biografías de autores LGBTQ @es
comment: Written accounts of the lives of LGBTQ+ people. For written accounts of LGBTQ+ people's lives written by the subject, use "LGBTQ+ autobiographies."
comment: Relatos escritos de la vida de personas conocidas por ser LGBTQ+. @es
narrower: Lesbian biographies
narrower: Gay biographies
narrower: Bisexual biographies
narrower: Transgender biographies
narrower: Queer biographies
narrower: Aromantic biographies
narrower: Asexual biographies
narrower: Demisexual biographies
narrower: Megasexual biographies
narrower: Greyromantic biographies
narrower: Intersex biographies
related: LGBTQ+ autobiographies
related: LGBTQ+ history
related: Two-Spirit biographies
replaces: biographiesLGBTQ
issued: 2020-06-03
modified: 2025-02-23
type: Concept
in scheme: v3
change note: Version 4.1.0

Lesbian biographies
preferred label: Biografías lesbianas @es
comment: Written accounts of the lives of lesbians. For written accounts of lesbians' lives written by the subject, use "Lesbian autobiographies."
comment: Relatos escritos de la vida de mujeres conocidas por ser lesbianas. @es
broader: LGBTQ+ biographies
related: Lesbian autobiographies
related: Lesbian authors
has top concept: LGBTQ+ biographies
replaces: lesbianBiographies
issued: 2020-06-03
modified: 2025-02-23
type: Concept
in scheme: v3
change note: Version 4.1.0

Gay biographies
preferred label: Biografías gay @es
comment: Written accounts of the lives of gay men. For written accounts of gay men's lives written by the subject, use "Gay autobiographies."
comment: Relatos escritos de la vida de hombres conocidos por ser gay. @es
broader: LGBTQ+ biographies
related: Gay autobiographies
has top concept: LGBTQ+ biographies
replaces: gayBiographies
issued: 2020-06-03
modified: 2025-02-23
type: Concept
in scheme: v3
change note: Version 4.1.0

Bisexual biographies
preferred label: Biografías bisexuales @es
comment: Written accounts of the lives of bisexual people. For written accounts of bisexual people's lives written by the subject, use "Bisexual autobiographies."
comment: Relatos escritos de la vida de personas conocidas por ser bisexuales. @es
broader: LGBTQ+ biographies
related: Bisexual autobiographies
related: Bisexual authors
has top concept: LGBTQ+ biographies
replaces: bisexualBiographies
issued: 2020-06-03
modified: 2025-02-23
type: Concept
in scheme: v3
change note: Version 4.1.0

Transgender biographies
preferred label: Biografías transgénero @es
alternative label: Trans biographies
comment: Written accounts of the lives of trans people. For written accounts of trans people's lives written by the subject, use "Transgender autobiographies."
comment: Relatos escritos de la vida de personas conocidas por ser transgénero. @es
broader: LGBTQ+ biographies
related: Transgender autobiographies
related: Transgender authors
has top concept: LGBTQ+ biographies
replaces: transgenderBiographies
issued: 2020-06-03
modified: 2025-02-23
type: Concept
in scheme: v3
change note: Version 4.1.0

Queer biographies
preferred label: Biografías queer @es
comment: Written accounts of the lives of queer people. For written accounts of queer people's lives written by the subject, use "Queer autobiographies."
comment: Relatos escritos de la vida de personas conocidas por ser queer. @es
broader: LGBTQ+ biographies
related: Queer autobiographies
related: Queer authors
has top concept: LGBTQ+ biographies
replaces: queerBiographies
issued: 2020-06-03
modified: 2025-02-23
type: Concept
in scheme: v3
change note: Version 4.1.0

Breast augmentation
preferred label: Aumento de senos @es
alternative label: Augmentation mammaplasty
alternative label: Augmentation mammoplasty
alternative label: Boob job
alternative label: Mamoplastia de aumento @es
alternative label: Aumento de mamas @es
comment: A surgical procedure aimed at increasing breast size using a prosthetic implant; often undergone by transgender women as a gender affirming surgery.
comment: Un procedimiento quirúrgico para aumentar el tamaño de los senos mediante un implante protésico; a menudo realizado por mujeres transgénero como cirugía de afirmación de género. @es
broader: Top surgery
related: Breast
has top concept: Medical care
replaces: breastAugmentation
issued: 2020-12-11
modified: 2025-02-23
type: Concept
in scheme: v3
change note: Version 4.1.0

Breast fetish
preferred label: Fetiche de senos @es
alternative label: Mazophilia
alternative label: Breast partialism
alternative label: Mastofact
alternative label: Breast fetishism
alternative label: Breast kink
alternative label: Fetiche de mamas @es
alternative label: Fetichismo de mamas @es
alternative label: Fetichismo de senos @es
alternative label: Masofilia @es
alternative label: Mastofacto @es
alternative label: Kink de senos @es
alternative label: Kink de mamas @es
comment: Eroticization of the breasts.
comment: Erotización de los senos. @es
broader: Body part fetishes
related: Breast
related: Nipple play
related: Chest
related: Breast torture
related: Breast play
has top concept: Eroticism
replaces: breastFetishism
issued: 2020-12-11
modified: 2025-02-23
type: Concept
in scheme: v3
change note: Version 4.1.0

Breast reduction
preferred label: Reducción de senos @es
alternative label: Reduction mammaplasty
alternative label: Reduction mammoplasty
alternative label: Reducción de mamas @es
alternative label: Mamoplastia de reducción @es
comment: A surgical procedure to decrease breast size. Often undertaken by transgender men or non-binary people as a gender affirming surgery.
comment: Un procedimiento quirúrgico para disminuir el tamaño de los senos. A menudo realizado por hombres transgénero como cirugía de afirmación de género. @es
related: Breast
related: Mastectomy
replaces: breastReduction
issued: 2020-12-11
modified: 2025-02-23
type: Concept
in scheme: v3
change note: Version 4.1.0

Breast size
preferred label: Tamaño de los senos @es
comment: The dimensions of an individual's breast tissue; can be used as an approximation (e.g., large breasts, small breasts) or to reference to standards of measurement for bras and other support garments.
comment: Las dimensiones del tejido mamario de una persona; se puede utilizar como una aproximación (p. ej., senos grandes, senos pequeños) o como referencia a estándares de medidas para sujetadores y otras prendas de soporte. @es
narrower: Large breasts
narrower: Small breasts
related: Breast
replaces: breastSize
issued: 2020-12-11
modified: 2025-02-23
type: Concept
in scheme: v3
change note: Version 4.1.0

LGBTQ+ clergy
preferred label: Clero LGBTQ+ @es
alternative label: Clergy (LGBTQ)
alternative label: Clero (LGBTQ) @es
comment: LGBTQ+ people who are ordained for religious duties, particularly in the Christian Church.
comment: Personas LGBTQ+ que son ordenadas para deberes religiosos, particularmente en la Iglesia cristiana. @es
narrower: Bisexual clergy
narrower: Gay clergy
narrower: Lesbian clergy
narrower: Queer clergy
narrower: Transgender clergy
narrower: Intersex clergy
narrower: Asexual clergy
replaces: clergyLGBTQ
issued: 2020-12-11
modified: 2025-02-23
type: Concept
in scheme: v3
change note: Version 4.1.0

DADT relationships
preferred label: Relaciones DADT @es
comment: Abbreviation for "don’t ask don’t tell relationships," where partners agree that they have each have multiple romantic and/or sexual relationships as long as they do not discuss it with their primary partner or let it interfere with their partner’s daily life.
comment: Abreviatura de "relaciones de no preguntar, no decir" o "don't ask, don't tell" en inglés, donde las parejas acuerdan que cada una tiene múltiples relaciones románticas y/o sexuales, siempre y cuando no lo hablen con su pareja principal ni dejen que interfiera con la vida diaria de su pareja. . @es
broader: Consensual non-monogamy
related: Hierarchical non-monogamy
has top concept: Relationship orientation
replaces: DADTRelationships
issued: 2020-12-11
modified: 2025-02-23
type: Concept
in scheme: v3
change note: Version 4.1.0

Greysexuality
preferred label: Grissexualidad @es
alternative label: Graysexuality
alternative label: Grey-sexuality
alternative label: Gray-sexuality
comment: A sexual orientation generally characterized by infrequent, rare, or low-intensity sexual attraction.
comment: Orientación sexual caracterizada generalmente por una atracción sexual poco frecuente, rara o de baja intensidad. @es
broader: Sexual orientation
related: Greysexual people
related: Greyromanticism
has top concept: Sexual orientation
replaces: greysexuality
issued: 2020-12-11
modified: 2025-02-23
type: Concept
in scheme: v3
change note: Version 4.1.0

Greysexual people
preferred label: Personas grissexuales @es
alternative label: Graysexual people
alternative label: Grey-sexual people
alternative label: Gray-sexual people
comment: People who experience infrequent, rare, or low-intensity sexual attraction.
comment: Personas que experimentan una atracción sexual infrecuente, rara o de baja intensidad. @es
broader: Sexual minorities
related: Greysexuality
related: Greyromantic people
has top concept: Sexual minorities
replaces: greysexualPeople
issued: 2020-12-11
modified: 2025-02-23
type: Concept
in scheme: v3
change note: Version 4.1.0

Hard swap
preferred label: Intercambio duro @es
alternative label: Intercambio de pareja duro @es
comment: A term used in the swinging community to describe a type of partner swapping in which sexual activities happen in different spaces or rooms where partners may not necessarily be in sight of each other.
comment: Un término utilizado en la comunidad swinger para describir un tipo de intercambio de pareja en el que las actividades sexuales ocurren en diferentes espacios o habitaciones donde las parejas no necesariamente están a la vista. @es
broader: Sexual practices
related: Soft swap
has top concept: Sexual practices
replaces: hardSwap
issued: 2020-12-11
modified: 2025-02-23
type: Concept
in scheme: v3
change note: Version 4.1.0

Hierarchical non-monogamy
preferred label: No monogamia jerárquica @es
alternative label: Hierarchical polyamory
alternative label: Hierarchical nonmonogamy
alternative label: Poliamor jerárquico @es
comment: A form of consensual non-monogamy in which a person has multiple partners who are not "equal" to one another in terms of time, emotional intensity, financial, or scheduling matters.
comment: Una forma de no monogamia consensuada en la que una persona tiene múltiples parejas que no son "iguales" entre sí en términos de tiempo, intensidad emocional, cuestiones financieras o de calendarización. @es
broader: Polyamory
broader: Non-monogamy
narrower: Swinging
narrower: Monogamish
related: DADT relationships
related: Primary partners
related: Secondary partners
related: Anchor partners
related: Nesting partners
related: Polyfidelity
related: Polygamous people
has top concept: Relationship orientation
replaces: hierarchicalNonmonogamy
issued: 2020-12-11
modified: 2025-02-23
type: Concept
in scheme: v3
change note: Version 4.1.0

Large breasts
preferred label: Senos grandes @es
alternative label: Gigantomastia
alternative label: Macromastia
alternative label: Breast hypertrophy
comment: Breasts considered large within a given cultural context. Note that large breasts have various health issues associated with them and may carry stigmatized medical associations (such as terms like gigantomastia and macromastia). These terms have more specific medical meanings but should not be used outside of those specific contexts.
comment: Senos considerados grandes dentro de un contexto cultural determinado. Tenga en cuenta que los senos grandes implican varios problemas de salud asociados y pueden conllevar asociaciones médicas estigmatizadas (tales como términos como gigantomastia y macromastia). Estos términos tienen significados médicos más específicos, pero no deben utilizarse fuera de esos contextos específicos. @es
broader: Breast size
related: Breast
has top concept: Breast size
replaces: largeBreasts
issued: 2020-12-11
modified: 2025-02-23
type: Concept
in scheme: v3
change note: Version 4.1.0

Mastectomy
preferred label: Mastectomía @es
alternative label: Breast amputation
alternative label: Amputación de senos @es
comment: A surgical procedure aimed at removing the breast or as much breast tissue as possible; often undergone as part of "top surgery" for transgender men or nonbinary people.
comment: Un procedimiento quirúrgico destinado a extirpar la mama o la mayor cantidad de tejido mamario posible; a menudo se realiza como parte de una "cirugía superior" para hombres transgénero o personas no binarias. @es
broader: Top surgery
related: Breast
related: Breast reduction
related: Chest reconstruction surgery
has top concept: Medical care
replaces: mastectomy
issued: 2020-12-11
modified: 2025-02-23
type: Concept
in scheme: v3
change note: Version 4.1.0

Megasexuality
preferred label: Megasexualidad @es
comment: A sexual orientation generally characterized by a person's lack of emotional connection to other people unless or until they have formed a strong sexual connection with them first.
comment: Una orientación sexual generalmente caracterizada por la falta de conexión emocional de una persona con otras personas a menos que, o hasta que, primero esa persona haya formado una fuerte conexión sexual con ellas. @es
broader: Sexual identity
broader: Sexual orientation
related: Sexual relationships
related: Megasexual people
has top concept: Sexual identity
replaces: megasexuality
issued: 2020-12-11
modified: 2025-02-23
type: Concept
in scheme: v3
change note: Version 4.1.0

Megasexual people
preferred label: Personas megasexuales @es
comment: People who do not experience strong emotional connections to other people unless they form strong sexual connections with them first.
comment: Personas que no experimentan fuertes conexiones emocionales con otras personas a menos que primero formen fuertes conexiones sexuales con ellas. @es
broader: Sexual minorities
narrower: Megasexual college students
related: Asexual people
related: Sexual relationships
related: Megasexuality
has top concept: Sexual minorities
replaces: megasexualPeople
issued: 2020-12-11
modified: 2025-02-23
type: Concept
in scheme: v3
change note: Version 4.1.0

Body part fetishes
preferred label: Parcialismo @es
alternative label: Body part fetish
alternative label: Body part fetishism
alternative label: Partialism
alternative label: Partialisms
alternative label: Fetiche de partes del cuerpo @es
alternative label: Fetichismo de partes del cuerpo @es
alternative label: Parcialismos @es
comment: Any of various fetishes regarding a specific part of the body.
comment: Cualquiera de los diversos fetiches relacionados con una parte específica del cuerpo. @es
broader: BDSM
narrower: Breast fetish
narrower: Muscle worship
narrower: Boot fetish
related: Erogenous body parts
has top concept: Eroticism
replaces: partialism
issued: 2020-12-11
modified: 2025-02-23
type: Concept
in scheme: v3
change note: Version 4.1.0

Primary partners
preferred label: Parejas primarias @es
comment: A term used in hierarchical polyamory to refer to the partner whose interests and desires come before those of any secondary partner(s).
comment: Un término utilizado en el poliamor jerárquico para referirse a la pareja cuyos intereses y deseos están por delante de los de cualquier pareja secundaria. @es
broader: Partners
related: Hierarchical non-monogamy
related: Secondary partners
has top concept: Partners
replaces: primaryPartners
issued: 2020-12-11
modified: 2025-02-23
type: Concept
in scheme: v3
change note: Version 4.1.0

Relationship orientation
preferred label: Orientación relacional @es
comment: An individual's preference toward or away from a particular relationship model.
comment: La preferencia de una persona con respecto a un modelo relacional particular. @es
narrower: Monogamy
narrower: Non-monogamy
related: Cross-cultural relationships
related: Intergenerational relationships
related: Relationship satisfaction
related: Sexual orientation
related: Sexual relationships
related: Compulsory monogamy
related: Romantic orientation
related: Polycules
replaces: relationshipOrientation
issued: 2020-12-11
modified: 2025-02-23
type: Concept
in scheme: v3
change note: Version 4.1.0

Relationship minorities
preferred label: Relaciones minoritarias @es
comment: People whose relationship practices differ from those of the dominant culture.
comment: Personas cuyas prácticas relacionales difieren de las de la cultura dominante. @es
narrower: LGBTQ+ dominatrices
narrower: LGBTQ+ dominants
narrower: LGBTQ+ submissives
narrower: Non-monogamous people
narrower: Polyamorous people
narrower: Relationship anarchists
narrower: Polygamous people
related: Sexual minorities
related: Romantic minorities
related: Power exchange
replaces: relationshipMinorities
issued: 2020-12-11
modified: 2025-02-23
type: Concept
in scheme: v3
change note: Version 4.1.0

Secondary partners
preferred label: Parejas secundarias @es
comment: A term used in hierarchical polyamory to refer to partners whose interests and desires come second to those of the primary partner(s).
comment: Un término utilizado en el poliamor jerárquico para referirse a parejas cuyos intereses y deseos son secundarios a los de la(s) pareja(s) principal(es). @es
broader: Partners
related: Metamours
related: Hierarchical non-monogamy
related: Primary partners
related: Paramours
has top concept: Partners
replaces: secondaryPartners
issued: 2020-12-11
modified: 2025-02-23
type: Concept
in scheme: v3
change note: Version 4.1.0

Small breasts
preferred label: Senos pequeños @es
alternative label: Breast hypoplasia
alternative label: Underdeveloped breasts
alternative label: Hipoplasia de senos @es
alternative label: Senos subdesarrollados @es
comment: Breasts considered small within a given cultural context. In certain situations, medical professionals may refer to such breasts as "underdeveloped" or "hypoplastic." These terms can be considered offensive and should not be used outside of specific medical contexts. The alternate labels included here are intended to aid search tools only and should not be used in other contexts.
comment: Senos considerados pequeños dentro de un contexto cultural determinado. En determinadas situaciones, profesionales médicos pueden referirse a estos senos como "subdesarrollados" o "hipoplásicos". Estos términos pueden considerarse ofensivos y no deben utilizarse fuera de contextos médicos específicos. Las etiquetas alternativas incluidas aquí están destinadas únicamente para ayudar a las herramientas de búsqueda y no deben utilizarase en otros contextos. @es
broader: Breast size
related: Breast
has top concept: Breast size
replaces: smallBreasts
issued: 2020-12-11
modified: 2025-02-23
type: Concept
in scheme: v3
change note: Version 4.1.0

Soft swap
preferred label: Intercambio suave @es
alternative label: Intercambio de parejas suave @es
comment: A term used in the swinging community to describe a type of partner swap in which sexual activities happen in the same shared space so that all partners are within sight of one another.
comment: Un término utilizado en la comunidad swinger para describir un tipo de intercambio de pareja en el que las actividades sexuales ocurren en el mismo espacio compartido de modo que todas las parejas estén a la vista la una de la otra. @es
broader: Sexual practices
related: Hard swap
has top concept: Sexual practices
replaces: softSwap
issued: 2020-12-11
modified: 2025-02-23
type: Concept
in scheme: v3
change note: Version 4.1.0

Swinging
preferred label: Intercambio de parejas @es
alternative label: Wife swapping
alternative label: Husband swapping
alternative label: Partner swapping
alternative label: Intercambio de esposo @es
alternative label: Intercambio de esposa @es
comment: An agreement, sexual practice, or relationship in which a couple engages in group sex or the swapping of sexual partners within a group, often on a habitual basis.
comment: Un acuerdo, una práctica sexual o una relación en la que una pareja mantiene relaciones sexuales en grupo o intercambia parejas sexuales dentro de un grupo, a menudo de forma habitual. @es
broader: Hierarchical non-monogamy
broader: Consensual non-monogamy
related: Sexual practices
related: Monogamish
has top concept: Relationship orientation
replaces: swinging
issued: 2020-12-11
modified: 2025-02-23
type: Concept
in scheme: v3
change note: Version 4.1.0

Trans women
preferred label: Mujeres trans @es
alternative label: Transgender women
alternative label: Transwomen
alternative label: Trans-women
alternative label: Mujeres transgénero @es
comment: Women whose gender assigned at birth was not female. Do not use for intersex people unless the intersex person identifies as a trans woman.
comment: Mujeres a las que se les asignó al sexo masculino al nacer. @es
broader: Transgender people
broader: Females
narrower: MtFs
related: Assigned male at birth
related: Estrogen
related: Transfemininity
related: Feminine of center
related: Transfeminism
has top concept: LGBTQ+ people
replaces: transWomen
issued: 2020-12-11
modified: 2025-02-23
type: Concept
in scheme: v3
change note: Version 4.1.0

Trans men
preferred label: Hombres trans @es
alternative label: Transgender men
alternative label: Transmen
alternative label: Trans-men
alternative label: Hombres transgénero @es
comment: Men whose gender assigned at birth was not male. Do not use for intersex people unless the intersex person identifies as a trans man.
comment: Hombres a los que se les asignó al sexo femenino al nacer. @es
broader: Males
broader: Transgender people
narrower: FtMs
related: Assigned female at birth
related: Binding (Chest)
related: Testosterone
related: Transmasculinity
related: Masculine of center
has top concept: Gender
replaces: transMen
issued: 2020-12-11
modified: 2025-02-23
type: Concept
in scheme: v3
change note: Version 4.1.0

Aromanticism
preferred label: Arromanticismo @es
alternative label: Aromantic
alternative label: Arromántico @es
comment: A romantic orientation generally characterized by a lack of romantic attraction or desire.
comment: Orientación arromántica caracterizada generalmente por la falta de atracción o deseo romántico. @es
broader: Romantic orientation
related: Asexuality
related: Aromantic people
related: Alloromanticism
has top concept: Romantic orientation
replaces: aromanticism
issued: 2021-03-04
modified: 2025-02-23
type: Concept
in scheme: v3
change note: Version 4.1.0

Anchor partners
preferred label: Parejas anclas @es
alternative label: Vínculos ancla @es
comment: A term used in non-monogamous communities to refer to a long-term partner with multiple commitments. Often used in place of language that is seen as hierarchical (e.g., primary/secondary partner).
comment: Término utilizado en comunidades no monógamas para referirse a una pareja a largo plazo con múltiples compromisos. A menudo se utiliza en lugar de un lenguaje que se considera jerárquico (por ejemplo, pareja principal/secundaria). @es
broader: Non-monogamous people
broader: Partners
related: Polyamory
related: Hierarchical non-monogamy
related: Nesting partners
related: Polyamorous people
has top concept: Relationship minorities
replaces: anchorPartners
issued: 2021-06-30
modified: 2025-02-23
type: Concept
in scheme: v3
change note: Version 4.1.0

Assigned X at birth
preferred label: Asignado X al nacer @es
alternative label: AXAB
alternative label: Designated X at birth
alternative label: DXAB
alternative label: X assigned at birth
alternative label: XAAB
alternative label: Asignadx X al nacer @es
alternative label: AXAN @es
comment: The assignment of an "X" gender marker or "X" sex designation shortly after birth. It is uncommon for intersex people to be assigned intersex or X at birth.
comment: La asignación de un marcador de género "X" o una designación de sexo "X" poco después del nacimiento. Es poco común que a las personas intersexuales se les asigne intersex o X al nacer. @es
broader: Sex assigned at birth
related: Intersex variations
related: X gender markers
has top concept: Sex (Body)
replaces: assignedXAtBirth
issued: 2021-06-30
modified: 2025-02-23
type: Concept
in scheme: v3
change note: Version 4.1.0

Assigned sex
preferred label: Sexo asignado @es
comment: An individual's sex as determined by a medical practitioner or provider. Determination is usually based on the appearance of external genitalia but may use other methodologies. In practice, sex assigned at birth is often culturally variable; the term "assigned gender" is often more applicable or accurate.
comment: El sexo de una persona determinado por un médico. La determinación suele basarse en la apariencia de los genitales externos, pero pueden utilizarse otras metodologías. En la práctica, el sexo asignado al nacer suele variar culturalmente; el término "género asignado" suele ser más aplicable o preciso. @es
broader: Sex (Body)
narrower: Sex assigned at birth
related: Assigned gender
related: Chromosomes
related: Endosex
related: Endosex people
has top concept: Sex (Body)
replaces: assignedSex
issued: 2021-06-30
modified: 2025-02-23
type: Concept
in scheme: v3
change note: Version 4.1.0

Compersion
preferred label: Compersión @es
comment: The positive emotion an individual may experience in regards to their partner's relationship with another partner. Often defined as the opposite of jealousy.
comment: La emoción positiva que una persona puede experimentar con respecto a la relación de su pareja con otra pareja. A menudo se define como lo opuesto a los celos. @es
related: Polyamory
related: Consensual non-monogamy
replaces: compersion
issued: 2021-06-30
modified: 2025-02-23
type: Concept
in scheme: v3
change note: Version 4.1.0

Compulsory monogamy
preferred label: Monogamia obligatoria @es
comment: The assumption that all people share a desire for monogamous relationships and that this is a preferential life goal.
comment: La suposición de que todas las personas comparten el deseo de tener relaciones monógamas y que este es un objetivo preferencial en la vida. @es
related: Amatonormativity
related: Compulsory sexuality
related: Relationship orientation
related: Monogamous people
replaces: compulsoryMonogamy
issued: 2021-06-30
modified: 2025-02-23
type: Concept
in scheme: v3
change note: Version 4.1.0

Consensual non-monogamy
preferred label: No monogamia consensual @es
alternative label: Ethical Non-monogamy
alternative label: No monogamia ética @es
alternative label: NMC @es
alternative label: NME @es
comment: Practice of romantic or sexual relationships with more than one person simultaneously and with all the consent of all partners involved.
comment: Práctica de relaciones románticas o sexuales con más de una persona simultáneamente y con el consentimiento de todas las parejas involucradas. @es
broader: Non-monogamy
narrower: Polyamory
narrower: DADT relationships
narrower: Swinging
narrower: Relationship anarchists
narrower: Relationship anarchy
narrower: Open marriage
related: Metamours
related: Compersion
related: Paramours
has top concept: Relationship orientation
replaces: consensualNonMonogamy
issued: 2021-06-30
modified: 2025-02-23
type: Concept
in scheme: v3
change note: Version 4.1.0

Demigirls
preferred label: Deminiñas @es
alternative label: Demiwomen
alternative label: Demiwoman
alternative label: Demigirl
alternative label: Demilady
alternative label: Demiladies
alternative label: Demifemale people
comment: People who partially, but not fully, identify women or girls irrespective of their assigned genders. Used by cisgender, transgender, transfeminine, or nonbinary people who feel more strongly aligned with women physically or socially, but not strongly enough to identify solely as one.
comment: Personas que se autoidentifican parcial, pero no completamente, como mujeres o niñas independientemente de su género asignado. Utilizado por personas cisgénero, transgénero, transfemeninas o no binarias que se sienten más alineadas con las mujeres física o socialmente, pero no lo suficiente como para identificarse únicamente como tal. @es
broader: Demigender people
related: Cisgender people
related: Non-binary people
related: Transfeminine people
related: Demiboys
related: Transfemininity
related: Demigender identity
related: Feminine of center
has top concept: LGBTQ+ people
replaces: demigirls
issued: 2021-06-30
modified: 2025-02-23
type: Concept
in scheme: v3
change note: Version 4.1.0

Demiboys
preferred label: Deminiños @es
alternative label: Demiguy
alternative label: Demiguys
alternative label: Demimen
alternative label: Demimales
alternative label: Demimale people
alternative label: Demiboy
comment: People who partially, but not fully, identify as men or boys irrespective of their assigned genders. Used by cisgender, transgender, transmasculine, or nonbinary people who feel more aligned with men physically or socially, but not strongly enough to identify solely as one.
comment: Personas que se autoidentifican parcial, pero no totalmente, como hombres o niños independientemente de su género asignado. Utilizado por personas cisgénero, transgénero, transmasculinas o no binarias que se sienten más alineadas física o socialmente con los hombres, pero no lo suficiente como para identificarse únicamente como tal. @es
broader: Demigender people
related: Cisgender people
related: Non-binary people
related: Transmasculine people
related: Demigirls
related: Transmasculinity
related: Demigender identity
related: Masculine of center
has top concept: LGBTQ+ people
replaces: demiboys
issued: 2021-06-30
modified: 2025-02-23
type: Concept
in scheme: v3
change note: Version 4.1.0

Gym subculture
preferred label: Subcultura del gimnasio @es
alternative label: Subcultura de gimnasio @es
alternative label: Subcultura gym @es
comment: Gay subculture popularized in the 1970s via homoerotic bodybuilder magazines. Often includes aesthetics modeled after ancient Greek gymnasiums. Especially popular in San Francisco, West Hollywood, and New York City.
comment: Subcultura gay que se popularizó en la década de 1970 a través de revistas fisicoculturistas homoeróticas. A menudo, incluye una estética inspirada en los antiguos gimnasios griegos. Particularmente popular en San Francisco, West Hollywood y la ciudad de Nueva York. @es
broader: Subcultures
related: Gay culture
related: Bara
related: Bara fandom
related: Muscle worship
related: Body worship
has top concept: Subcultures
replaces: gymSubculture
issued: 2021-06-30
modified: 2025-02-23
type: Concept
in scheme: v3
change note: Version 4.1.0

Honeymooning
preferred label: Luna de miel @es
comment: A period of time in a relationship characterized by passionate love as well as intense feelings of attraction and ecstasy, sometimes accompanied by idealization of a partner or the shared relationship.
comment: Un periodo de tiempo en una relación caracterizado por un amor apasionado al igual que por intensos sentimientos de atracción y éxtasis, a veces acompañados por la idealización de la pareja o de la relación compartida. @es
related: NRE (New Relationship Energy)
replaces: honeymooning
issued: 2021-06-30
modified: 2025-02-23
type: Concept
in scheme: v3
change note: Version 4.1.0

Monogamish
alternative label: Relaciones casi monógamas @es
comment: Term used to describe relationships that are mostly monogamous with occasional exceptions made for sexual play.
comment: Término utilizado para describir relaciones que son, en su mayoría, monógamas con excepciones ocasionales para el juego sexual. @es
broader: Hierarchical non-monogamy
related: Swinging
related: Monogamous people
has top concept: Relationship orientation
replaces: monogamish
issued: 2021-06-30
modified: 2025-02-23
type: Concept
in scheme: v3
change note: Version 4.1.0

Nesting partners
preferred label: Compañeros de anidación @es
comment: A term used in non-monogamous communities to refer to partners an individual lives with. Often used in place of language that is seen as hierarchical (e.g., primary partner, secondary partner).
comment: Término utilizado en comunidades no monógamas para referirse a las parejas con las que vive una persona. A menudo, se utiliza en lugar de un lenguaje que se considera jerárquico (por ejemplo, "pareja principal", "pareja secundaria"). @es
broader: Non-monogamous people
broader: Partners
related: Polyamory
related: Hierarchical non-monogamy
related: Anchor partners
related: Polyamorous people
has top concept: Relationship minorities
replaces: nestingPartners
issued: 2021-06-30
modified: 2025-02-23
type: Concept
in scheme: v3
change note: Version 4.1.0

Non-monogamy
preferred label: No monogamia @es
alternative label: Nonmono
alternative label: Nonmonogamy
alternative label: Nomonogamia @es
comment: Practice of engaging in romantic or sexual relationships with more than one person simultaneously.
comment: Práctica de entablar relaciones románticas o sexuales con más de una persona simultáneamente. @es
broader: Relationship orientation
narrower: Hierarchical non-monogamy
narrower: Consensual non-monogamy
narrower: Jealousy
related: Polygamous people
has top concept: Relationship orientation
replaces: nonMonogamy
issued: 2021-06-30
modified: 2025-02-23
type: Concept
in scheme: v3
change note: Version 4.1.0

Non-monogamous people
preferred label: Personas no monógamas @es
comment: People who practice romantic or sexual relationships with more than one person simultaneously.
comment: Personas que practican relaciones románticas o sexuales con más de una persona simultáneamente. @es
broader: Relationship minorities
narrower: Metamours
narrower: Anchor partners
narrower: Nesting partners
narrower: Paramours
narrower: Polyamorous people
narrower: Relationship anarchists
related: Polycules
has top concept: Relationship minorities
replaces: nonMonogamousPeople
issued: 2021-06-30
modified: 2025-02-23
type: Concept
in scheme: v3
change note: Version 4.1.0

NRE (New Relationship Energy)
preferred label: Energía de la Nueva Relación @es
comment: A strong, almost giddy feeling of excitement and infatuation common in the beginning of a new romantic relationship. Often used in polyamory contexts.
comment: Un sentimiento fuerte, casi vertiginoso, de emoción y enamoramiento, común al comienzo de una nueva relación romántica. A menudo, se utiliza en contextos de poliamor. @es
related: Polyamory
related: Honeymooning
related: Polyamorous people
replaces: nre
issued: 2021-06-30
modified: 2025-02-23
type: Concept
in scheme: v3
change note: Version 4.1.0

Paramours
comment: In polyamory contexts, paramours are the partners of an individual's partner, typically as part of a relationship the primary partner is unaware of. In other contexts, this term is used broadly as a synonym for lovers.
comment: En contextos polyamoros, los paramours son lo @es
broader: Polyamory
broader: Non-monogamous people
related: Metamours
related: Secondary partners
related: Consensual non-monogamy
has top concept: Relationship orientation
replaces: paramours
issued: 2021-06-30
modified: 2025-02-23
type: Concept
in scheme: v3
change note: Version 4.1.0

Polyamorous people
preferred label: Personas poliamorosas @es
comment: People who engage in romantic, sexual, or play relationships with more than one person simultaneously, with the knowledge and consent of all parties involved.
comment: Personas que mantienen relaciones románticas, sexuales o de juego con más de una persona simultáneamente, con el conocimiento y consentimiento de todas las partes involucradas. @es
broader: Relationship minorities
broader: Non-monogamous people
related: Polyamory
related: Anchor partners
related: Nesting partners
related: NRE (New Relationship Energy)
related: Polycules
related: Polyamorous families
has top concept: Relationship minorities
replaces: polyamorousPeople
issued: 2021-06-30
modified: 2025-03-20
type: Concept
in scheme: v3
change note: Version 4.1.0

Polyfidelity
preferred label: Polifidelidad @es
alternative label: Poliexclusividad @es
comment: In polyamory circles, this term refers to the practice of engaging in multiple-partner relationships that are "closed off" to new participants per the agreement of those involved.
comment: En los círculos de poliamor, este término se refiere a la práctica de entablar relaciones con múltiples parejas que están "cerradas" a nuevos participantes según el acuerdo de las partes involucradas. @es
related: Polyamory
related: Hierarchical non-monogamy
replaces: polyfidelity
issued: 2021-06-30
modified: 2025-02-23
type: Concept
in scheme: v3
change note: Version 4.1.0

Relationship anarchists
preferred label: Anarquistas relacionales @es
alternative label: Anarquistas de relación @es
comment: People who practice a type of non-monogamy characterized by application of anarchist principles (such as autonomy, anti-normativity, anti-hierarchical practices, refusal of state governance) to relationships. Often contrasted with hierarchical polyamory.
comment: Personas que practican un tipo de no monogamia caracterizada por la aplicación de principios anarquistas (como la autonomía, la antinormatividad, las prácticas antijerárquicas, el rechazo de la gobernanza estatal) a las relaciones. A menudo, se contrasta con el poliamor jerárquico. @es
broader: Relationship minorities
broader: Consensual non-monogamy
broader: Non-monogamous people
related: Relationship anarchy
has top concept: Relationship minorities
replaces: relationshipAnarchists
issued: 2021-06-30
modified: 2025-02-23
type: Concept
in scheme: v3
change note: Version 4.1.0

Relationship anarchy
preferred label: Anarquía relacional @es
comment: A type of non-monogamy characterized by application of anarchist principles (such as autonomy, anti-normativity, anti-hierarchical practices, refusal of state governance) to relationships. Often contrasted with hierarchical polyamory.
comment: Un tipo de no monogamia caracterizada por la aplicación de principios anarquistas (como la autonomía, la antinormatividad, las prácticas antijerárquicas, el rechazo de la gobernanza estatal) a las relaciones. A menudo, se contrasta con el poliamor jerárquico. @es
broader: Consensual non-monogamy
related: Relationship anarchists
has top concept: Relationship orientation
replaces: relationshipAnarchy
issued: 2021-06-30
modified: 2025-02-23
type: Concept
in scheme: v3
change note: Version 4.1.0

Scissoring
preferred label: Tribadismo @es
alternative label: Frotar @es
alternative label: Golpearse las almejas @es
alternative label: Hacer la tijera @es
comment: Typically, a sexual activity in which two women rub their genitalia against one another while intertwining their legs.
comment: Una actividad sexual en la que, normalmente, dos mujeres frotan sus genitales una contra la otra mientras entrelazan sus piernas. @es
broader: Frottage
broader: Sex (Act)
related: Tribadism
has top concept: Sex (Act)
replaces: scissoring
issued: 2021-06-30
modified: 2025-02-23
type: Concept
in scheme: v3
change note: Version 4.1.0

Transgenderqueer people
preferred label: Personas transgenderqueer @es
comment: Someone who is both trans and genderqueer and who identifies as transgenderqueer.
comment: Alguien que es transgénero y genderqueer y que se identifica como transgénero queer. @es
broader: Genderqueer people
broader: Transgender people
broader: Gender minorities
related: Transgenderqueer identity
related: Genderqueer identity
has top concept: LGBTQ+ people
replaces: transgenderqueerPeople
issued: 2021-06-30
modified: 2025-02-23
type: Concept
in scheme: v3
change note: Version 4.1.0

Tribadism
preferred label: Tribadismo @es
alternative label: Tribbing
alternative label: Hacer la tijera @es
alternative label: Tijereando @es
alternative label: Hacer la tortilla @es
alternative label: Untar @es
alternative label: Raspar @es
alternative label: Rastillar @es
alternative label: Restregarse @es
comment: A mostly antiquated term used either to refer to scissoring, to any sexual activity between women, or to the general concept of being a lesbian ("lesbianism").
comment: Un término mayoritariamente anticuado utilizado para referirse a hacer tijeras, a cualquier actividad sexual entre mujeres o al concepto general de ser lesbiana ("lesbianismo"). @es
broader: LGBTQ+ historical terms
broader: Sex (Act)
related: Lesbianism
related: Tribades
related: Scissoring
has top concept: LGBTQ+ historical terms
replaces: tribadism
issued: 2021-06-30
modified: 2025-02-23
type: Concept
in scheme: v3
change note: Version 4.1.0

Xenogender identity
preferred label: Identidad xenogénero @es
comment: Non-binary gender identity that is not defined in relation to human understandings of gender (i.e., female or male, woman or man), but instead in relation to animals, plants, or other things
comment: Identidad de género no binaria que no se define en relación a la interpretación humana del género (es decir, femenino o masculino, mujer u hombre), sino en relación a animales, plantas u otras cosas. @es
broader: Gender identity
related: Non-binary people
related: Xenogender people
has top concept: Gender
replaces: xenogender
issued: 2021-06-30
modified: 2025-02-23
type: Concept
in scheme: v3
change note: Version 4.1.0

Xenogender people
preferred label: Personas xenogénero @es
comment: A person who identifies their gender in relation to non-human understandings of gender and relates to animals, plants, or other things.
comment: Una persona que identifica su género en relación a interpretaciones no humanas del género y se relaciona a animales, plantas u otras cosas. @es
related: Gender identity
related: Non-binary people
related: Xenogender identity
replaces: xenogenderPeople
issued: 2021-06-30
modified: 2025-02-23
type: Concept
in scheme: v3
change note: Version 4.1.0

Neopronouns
preferred label: Neopronombres @es
comment: Personal pronouns that are not officially (i.e., in dictionaries, style guides, etc.) recognized by the language that they are used in. Often intended to be gender neutral.
comment: Pronombres personales que no están reconocidos oficialmente (es decir, en diccionarios, guías de estilo, etc.) por el idioma en el que se usan. A menudo pretenden ser neutrales en cuanto al género. @es
narrower: Ae/Aer/Aerself (Pronouns)
narrower: Co/Co/Coself (Pronouns)
narrower: Cy/Cyb/Cyberself (Pronouns)
narrower: E/Em/Emself (Pronouns)
narrower: Ey/Em/Eirself (Pronouns)
narrower: Fe/Fem/Femself (Pronouns)
narrower: Fae/Faer/Faerself (Pronouns)
narrower: Fey/Fem/Femself (Pronouns)
narrower: Hu/Hum/Humself (Pronouns)
narrower: It/It/Itself (Pronouns)
narrower: Jee/Jem/Jemself (Pronouns)
narrower: Kit/Kit/Kitself (Pronouns)
narrower: Ne/Nir/Nemself (Pronouns)
narrower: Ne/Nem/Nis (Pronouns)
narrower: Peh/Pehm/Pehself (Pronouns)
narrower: Per/Per/Perself (Pronouns)
narrower: Sie/Hir/Hirself (Pronouns)
narrower: Se/Ser/Serself (Pronouns)
narrower: Shi/Hir/Hirself (Pronouns)
narrower: Si/Hyr/Hyrself (Pronouns)
narrower: Thon/Thon/Thonself (Pronouns)
narrower: Ve/Ver/Verself (Pronouns)
narrower: Ve/Vem/Verself (Pronouns)
narrower: Voi/Void/Voidself (Pronouns)
narrower: Vi/Ver/Virself (Pronouns)
narrower: Vi/Vim/Virself (Pronouns)
narrower: Xie/Xer/Xerself (Pronouns)
narrower: Xe/Xyr/Xemself (Pronouns)
narrower: Xey/Xem/Xyr (Pronouns)
narrower: Xey/Xem/Xeir (Pronouns)
narrower: Yo/Yo/Yosself (Pronouns)
narrower: Ze/Zir/Zirself (Pronouns)
narrower: Ze/Hir/Hirself (Pronouns)
narrower: Ze/Zem/Zirself (Pronouns)
narrower: Ze/Mer/Zemself (Pronouns)
narrower: Zee/Zed/Zedself (Pronouns)
narrower: Zie/Zir/Zirself (Pronouns)
narrower: Zie/Zem/Zirself (Pronouns)
narrower: Zie/Hir/Hirself (Pronouns)
narrower: Zme/Zmyr/Zmyrself (Pronouns)
related: Pronouns
replaces: neopronouns
issued: 2021-07-01
modified: 2026-02-23
type: Concept
in scheme: v3
change note: Version 4.1.0

Ae/Aer/Aerself (Pronouns)
alternative label: Ae (Pronouns)
alternative label: Ae/Aer/Aerself
comment: A set of pronouns. Used in this manner: Ae went to the Homosaurus website. I watched aer browse the Homosaurus. Ae uses the Homosaurus aerself.
broader: Pronouns
broader: Neopronouns
has top concept: Pronouns
replaces: aePronouns
issued: 2021-07-01
modified: 2025-02-23
type: Concept
in scheme: v3
change note: Version 4.1.0

Co/Co/Coself (Pronouns)
alternative label: Co (Pronouns)
comment: A set of pronouns. Used in this manner: Co went to the Homosaurus website. I watched co browse the Homosaurus. Co uses the Homosaurus coself.
broader: Pronouns
broader: Neopronouns
has top concept: Pronouns
replaces: coPronouns
issued: 2021-07-01
modified: 2025-02-23
type: Concept
in scheme: v3
change note: Version 4.1.0

Cy/Cyb/Cyberself (Pronouns)
alternative label: Cy (Pronouns)
alternative label: Cy/Cyb/Cyberself
comment: A set of pronouns. Used in this manner: Cy went to the Homosaurus website. I watched cyb browse the Homosaurus. Cy uses the Homosaurus cyberself.
broader: Pronouns
broader: Neopronouns
has top concept: Pronouns
replaces: cyPronouns
issued: 2021-07-01
modified: 2025-02-23
type: Concept
in scheme: v3
change note: Version 4.1.0

E/Em/Emself (Pronouns)
alternative label: E (Pronouns)
alternative label: E/Em/Emself
comment: A set of pronouns. Used in this manner: E went to the Homosaurus website. I watched em browse the Homosaurus. E uses the Homosaurus emself.
broader: Pronouns
broader: Neopronouns
has top concept: Pronouns
replaces: ePronouns
issued: 2021-07-01
modified: 2025-02-23
type: Concept
in scheme: v3
change note: Version 4.1.0

Ey/Em/Eirself (Pronouns)
alternative label: Ey (Pronouns)
alternative label: Ey/Em/Eirself
comment: A set of pronouns. Used in this manner: Ey went to the Homosaurus website. I watched em browse the Homosaurus. Ey uses the Homosaurus eirself.
broader: Pronouns
broader: Neopronouns
has top concept: Pronouns
replaces: eyPronouns
issued: 2021-07-01
modified: 2025-02-23
type: Concept
in scheme: v3
change note: Version 4.1.0

Fe/Fem/Femself (Pronouns)
alternative label: Fe (Pronouns)
alternative label: Fe/Fem/Femself
comment: A set of pronouns. Used in this manner: Fe went to the Homosaurus website. I watched fem browse the Homosaurus. Fe uses the Homosaurus femself.
broader: Pronouns
broader: Neopronouns
has top concept: Pronouns
replaces: fePronouns
issued: 2021-07-01
modified: 2025-02-23
type: Concept
in scheme: v3
change note: Version 4.1.0

Fae/Faer/Faerself (Pronouns)
alternative label: Fae (Pronouns)
alternative label: Fae/Faer/Faerself
comment: A set of pronouns. Used in this manner: Fae went to the Homosaurus website. I watched faer browse the Homosaurus. Fae uses the Homosaurus faerself.
broader: Pronouns
broader: Neopronouns
has top concept: Pronouns
replaces: faePronouns
issued: 2021-07-01
modified: 2025-02-23
type: Concept
in scheme: v3
change note: Version 4.1.0

Fey/Fem/Femself (Pronouns)
alternative label: Fey (Pronouns)
alternative label: Fey/Fem/Femself
comment: A set of pronouns. Used in this manner: Fey went to the Homosaurus website. I watched fem browse the Homosaurus. Fey uses the Homosaurus femself.
broader: Pronouns
broader: Neopronouns
has top concept: Pronouns
replaces: feyPronouns
issued: 2021-07-01
modified: 2025-02-23
type: Concept
in scheme: v3
change note: Version 4.1.0

He/Him/Himself (Pronouns)
preferred label: Él/Lo (pronombres) @es
alternative label: He (Pronouns)
alternative label: He/Him (Pronouns)
alternative label: Él (pronombres) @es
comment: A set of pronouns. Used in this manner: He went to the Homosaurus website. I watched him browse the Homosaurus. He uses the Homosaurus himself.
comment: Un conjunto de pronombres. Utilizado de esta manera: Él fue al sitio web de Homosaurus. Lo vi explorar el Homosaurus. Él mismo usa el Homosaurus. @es
broader: Pronouns
has top concept: Pronouns
replaces: hePronouns
issued: 2021-07-01
modified: 2025-02-23
type: Concept
in scheme: v3
change note: Version 4.1.0

Hu/Hum/Humself (Pronouns)
alternative label: Hu (Pronouns)
alternative label: Hu/Hum/Humself
comment: A set of pronouns. Used in this manner: Hu went to the Homosaurus website. I watched hum browse the Homosaurus. Hu uses the Homosaurus humself.
broader: Pronouns
broader: Neopronouns
has top concept: Pronouns
replaces: huPronouns
issued: 2021-07-01
modified: 2025-02-23
type: Concept
in scheme: v3
change note: Version 4.1.0

It/It/Itself (Pronouns)
alternative label: It (Pronouns)
comment: A set of pronouns. Used in this manner: It went to the Homosaurus website. I watched it browse the Homosaurus. It uses the Homosaurus itself.
broader: Pronouns
broader: Neopronouns
has top concept: Pronouns
replaces: itPronouns
issued: 2021-07-01
modified: 2025-02-23
type: Concept
in scheme: v3
change note: Version 4.1.0

Jee/Jem/Jemself (Pronouns)
alternative label: Jee (Pronouns)
comment: A set of pronouns. Used in this manner: Jee went to the Homosaurus website. I watched jem browse the Homosaurus. Jee uses the Homosaurus jemself.
broader: Pronouns
broader: Neopronouns
has top concept: Pronouns
replaces: jeePronouns
issued: 2021-07-01
modified: 2025-02-23
type: Concept
in scheme: v3
change note: Version 4.1.0

Kit/Kit/Kitself (Pronouns)
alternative label: Kit (Pronouns)
comment: A set of pronouns. Used in this manner: Kit went to the Homosaurus website. I watched kit browse the Homosaurus. Kit uses the Homosaurus kitself.
broader: Pronouns
broader: Neopronouns
has top concept: Pronouns
replaces: kitPronouns
issued: 2021-07-01
modified: 2025-02-23
type: Concept
in scheme: v3
change note: Version 4.1.0

Ne/Nir/Nemself (Pronouns)
alternative label: Ne/Nir (Pronouns)
alternative label: Ne/Nir/Nemself
comment: A set of pronouns. Used in this manner: Ne went to the Homosaurus website. I watched nir browse the Homosaurus. Ne uses the Homosaurus nemself.
broader: Pronouns
broader: Neopronouns
has top concept: Pronouns
replaces: neNirPronouns
issued: 2021-07-01
modified: 2025-02-23
type: Concept
in scheme: v3
change note: Version 4.1.0

Ne/Nem/Nis (Pronouns)
alternative label: Ne/Nem (Pronouns)
alternative label: Ne/Nem/Nis
comment: A set of pronouns. Used in this manner: Ne went to the Homosaurus website. I watched nem browse the Homosaurus. Ne uses the Homosaurus nis.
broader: Pronouns
broader: Neopronouns
has top concept: Pronouns
replaces: neNemPronouns
issued: 2021-07-01
modified: 2025-02-23
type: Concept
in scheme: v3
change note: Version 4.1.0

Peh/Pehm/Pehself (Pronouns)
alternative label: Peh (Pronouns)
alternative label: Peh/Pehm/Pehself
comment: A set of pronouns. Used in this manner: Peh went to the Homosaurus website. I watched pehm browse the Homosaurus. Peh uses the Homosaurus pehself.
broader: Pronouns
broader: Neopronouns
has top concept: Pronouns
replaces: pehPronouns
issued: 2021-07-01
modified: 2025-02-23
type: Concept
in scheme: v3
change note: Version 4.1.0

Per/Per/Perself (Pronouns)
alternative label: Per (Pronouns)
alternative label: Per/Pers/Perself
comment: A set of pronouns. Used in this manner: Per went to the Homosaurus website. I watched per browse the Homosaurus. Per uses the Homosaurus perself.
broader: Pronouns
broader: Neopronouns
has top concept: Pronouns
replaces: perPronouns
issued: 2021-07-01
modified: 2025-02-23
type: Concept
in scheme: v3
change note: Version 4.1.0

Sie/Hir/Hirself (Pronouns)
alternative label: Sie (Pronouns)
comment: A set of pronouns. Used in this manner: Sie went to the Homosaurus website. I watched hir browse the Homosaurus. Sie uses the Homosaurus hirself.
broader: Pronouns
broader: Neopronouns
has top concept: Pronouns
replaces: siePronouns
issued: 2021-07-01
modified: 2025-02-23
type: Concept
in scheme: v3
change note: Version 4.1.0

Se/Ser/Serself (Pronouns)
alternative label: Se (Pronouns)
alternative label: Se/Ser/Serself
comment: A set of pronouns. Used in this manner: Se went to the Homosaurus website. I watched ser browse the Homosaurus. Se uses the Homosaurus serself.
broader: Pronouns
broader: Neopronouns
has top concept: Pronouns
replaces: sePronouns
issued: 2021-07-01
modified: 2025-02-23
type: Concept
in scheme: v3
change note: Version 4.1.0

She/Her/Herself (Pronouns)
preferred label: Ella/La (Pronombre) @es
alternative label: She (Pronouns)
alternative label: She/Her (Pronouns)
alternative label: Ella (pronombre) @es
alternative label: Ella/La @es
comment: A set of pronouns. Used in this manner: She went to the Homosaurus website. I watched her browse the Homosaurus. She uses the Homosaurus herself.
comment: Un conjunto de pronombres. Utilizados de la siguiente manera: Ella visitó el website del Homosaurus. Yo la vi navegar el Homosaurus. Ella utiliza el Homosaurus por sí misma. @es
broader: Pronouns
has top concept: Pronouns
replaces: shePronouns
issued: 2021-07-01
modified: 2025-02-23
type: Concept
in scheme: v3
change note: Version 4.1.0

Shi/Hir/Hirself (Pronouns)
alternative label: Shi (Pronouns)
alternative label: Shi/Hir/Hirself
comment: A set of pronouns. Used in this manner: Shi went to the Homosaurus website. I watched hir browse the Homosaurus. Shi uses the Homosaurus hirself.
broader: Pronouns
broader: Neopronouns
has top concept: Pronouns
replaces: shiPronouns
issued: 2021-07-01
modified: 2025-02-23
type: Concept
in scheme: v3
change note: Version 4.1.0

Si/Hyr/Hyrself (Pronouns)
alternative label: Si (Pronouns)
alternative label: Si/Hyr/Hyrself
comment: A set of pronouns. Used in this manner: Si went to the Homosaurus website. I watched hyr browse the Homosaurus. Si uses the Homosaurus hyrself.
broader: Pronouns
broader: Neopronouns
has top concept: Pronouns
replaces: siPronouns
issued: 2021-07-01
modified: 2025-02-23
type: Concept
in scheme: v3
change note: Version 4.1.0

They/Them/Themselves (Pronouns)
preferred label: Elle/Le @es
alternative label: They/Them/Themselves
comment: A set of pronouns. Used in this manner: They went to the Homosaurus website. I watched them browse the Homosaurus. They use the Homosaurus themselves.
comment: Un conjunto de pronombres. Utilizados de la siguiente manera: Elle visitó el website del Homosaurus. Yo le vi navegar el Homosaurus. Elle utiliza el Homosaurus por sí misme. @es
broader: Pronouns
has top concept: Pronouns
replaces: theyThemThemselvesPronouns
issued: 2021-07-01
modified: 2025-02-23
type: Concept
in scheme: v3
change note: Version 4.1.0

They/Them/Themself (Pronouns)
preferred label: Elle/Le @es
alternative label: They/Them/Themself
comment: A set of pronouns. Used in this manner: They went to the Homosaurus website. I watched them browse the Homosaurus. They use the Homosaurus themself.
comment: Un conjunto de pronombres. Utilizados de la siguiente manera: Elle visitó el website del Homosaurus. Yo le vi navegar el Homosaurus. Elle utiliza el Homosaurus por sí misme. @es
broader: Pronouns
has top concept: Pronouns
replaces: theyThemThemselfPronouns
issued: 2021-07-01
modified: 2025-02-23
type: Concept
in scheme: v3
change note: Version 4.1.0

Thon/Thon/Thonself (Pronouns)
alternative label: Thon (Pronouns)
alternative label: Thon/Thons/Thonself
comment: A set of pronouns. Used in this manner: Thon went to the Homosaurus website. I watched thon browse the Homosaurus. Thon uses the Homosaurus thonself.
broader: Pronouns
broader: Neopronouns
has top concept: Pronouns
replaces: thonPronouns
issued: 2021-07-01
modified: 2025-02-23
type: Concept
in scheme: v3
change note: Version 4.1.0

Ve/Ver/Verself (Pronouns)
alternative label: Ve/Ver (Pronouns)
alternative label: Ve/Ver/Verself
comment: A set of pronouns. Used in this manner: Ve went to the Homosaurus website. I watched ver browse the Homosaurus. Ve uses the Homosaurus verself.
broader: Pronouns
broader: Neopronouns
has top concept: Pronouns
replaces: veVerPronouns
issued: 2021-07-01
modified: 2025-02-23
type: Concept
in scheme: v3
change note: Version 4.1.0

Ve/Vem/Verself (Pronouns)
alternative label: Ve/Vem (Pronouns)
alternative label: Ve/Vem/Verself
comment: A set of pronouns. Used in this manner: Ve went to the Homosaurus website. I watched vem browse the Homosaurus. Ve uses the Homosaurus verself.
broader: Pronouns
broader: Neopronouns
has top concept: Pronouns
replaces: veVemPronouns
issued: 2021-07-01
modified: 2025-02-23
type: Concept
in scheme: v3
change note: Version 4.1.0

Voi/Void/Voidself (Pronouns)
alternative label: Voi (Pronouns)
alternative label: Voi/Void/Voidself
comment: A set of pronouns. Used in this manner: Voi went to the Homosaurus website. I watched void browse the Homosaurus. Voi uses the Homosaurus voidself.
broader: Pronouns
broader: Neopronouns
has top concept: Pronouns
replaces: voiPronouns
issued: 2021-07-01
modified: 2025-02-23
type: Concept
in scheme: v3
change note: Version 4.1.0

Vi/Ver/Virself (Pronouns)
alternative label: Vi/Ver (Pronouns)
alternative label: Vi/Ver/Virself
comment: A set of pronouns. Used in this manner: Vi went to the Homosaurus website. I watched ver browse the Homosaurus. Vi uses the Homosaurus virself.
broader: Pronouns
broader: Neopronouns
has top concept: Pronouns
replaces: viVerPronouns
issued: 2021-07-01
modified: 2025-02-23
type: Concept
in scheme: v3
change note: Version 4.1.0

Vi/Vim/Virself (Pronouns)
alternative label: Vi/Vim (Pronouns)
alternative label: Vi/Vim/Virself
comment: A set of pronouns. Used in this manner: Vi went to the Homosaurus website. I watched vim browse the Homosaurus. Vi uses the Homosaurus virself.
broader: Pronouns
broader: Neopronouns
has top concept: Pronouns
replaces: viVimPronouns
issued: 2021-07-01
modified: 2025-02-23
type: Concept
in scheme: v3
change note: Version 4.1.0

Xie/Xer/Xerself (Pronouns)
alternative label: Xie (Pronouns)
alternative label: Xie/Xer/Xerself
comment: A set of pronouns. Used in this manner: Xie went to the Homosaurus website. I watched xer browse the Homosaurus. Xie uses the Homosaurus xerself.
broader: Pronouns
broader: Neopronouns
has top concept: Pronouns
replaces: xiePronouns
issued: 2021-07-01
modified: 2025-02-23
type: Concept
in scheme: v3
change note: Version 4.1.0

Xe/Xyr/Xemself (Pronouns)
alternative label: Xe (Pronouns)
alternative label: Xe/Xyr/Xemself
comment: A set of pronouns. Used in this manner: Xe went to the Homosaurus website. I watched xyr browse the Homosaurus. Xe uses the Homosaurus xemself.
broader: Pronouns
broader: Neopronouns
has top concept: Pronouns
replaces: xePronouns
issued: 2021-07-01
modified: 2025-02-23
type: Concept
in scheme: v3
change note: Version 4.1.0

Xey/Xem/Xyr (Pronouns)
alternative label: Xey/Xem/Xyr
comment: A set of pronouns. Used in this manner: Xey went to the Homosaurus website. I watched xem browse the Homosaurus. Xey uses the Homosaurus xyr.
broader: Pronouns
broader: Neopronouns
has top concept: Pronouns
replaces: xeyXemXyrPronouns
issued: 2021-07-01
modified: 2025-02-23
type: Concept
in scheme: v3
change note: Version 4.1.0

Xey/Xem/Xeir (Pronouns)
alternative label: Xey/Xem/Xeir
comment: A set of pronouns. Used in this manner: Xey went to the Homosaurus website. I watched xem browse the Homosaurus. Xey uses the Homosaurus xeir.
broader: Pronouns
broader: Neopronouns
has top concept: Pronouns
replaces: xeyXemXeirPronouns
issued: 2021-07-01
modified: 2025-02-23
type: Concept
in scheme: v3
change note: Version 4.1.0

Yo/Yo/Yosself (Pronouns)
alternative label: Yo (Pronouns)
alternative label: Yo/Yos/Yosself
comment: A set of pronouns. Used in this manner: Yo went to the Homosaurus website. I watched yo browse the Homosaurus. Yo uses the Homosaurus yosself.
broader: Pronouns
broader: Neopronouns
has top concept: Pronouns
replaces: yoPronouns
issued: 2021-07-01
modified: 2025-02-23
type: Concept
in scheme: v3
change note: Version 4.1.0

Ze/Zir/Zirself (Pronouns)
alternative label: Ze (Pronouns)
alternative label: Ze/Zir/Zirself
comment: A set of pronouns. Used in this manner: Ze went to the Homosaurus website. I watched zir browse the Homosaurus. Ze uses the Homosaurus zirself.
broader: Pronouns
broader: Neopronouns
has top concept: Pronouns
replaces: zePronouns
issued: 2021-07-01
modified: 2025-02-23
type: Concept
in scheme: v3
change note: Version 4.1.0

Ze/Hir/Hirself (Pronouns)
alternative label: Ze/Hir (Pronouns)
alternative label: Ze/Hir/Hirself
comment: A set of pronouns. Used in this manner: Ze went to the Homosaurus website. I watched hir browse the Homosaurus. Ze uses the Homosaurus hirself.
broader: Pronouns
broader: Neopronouns
has top concept: Pronouns
replaces: zeHirPronouns
issued: 2021-07-01
modified: 2025-02-23
type: Concept
in scheme: v3
change note: Version 4.1.0

Ze/Zem/Zirself (Pronouns)
alternative label: Ze/Zem (Pronouns)
alternative label: Ze/Zem/Zirself
comment: A set of pronouns. Used in this manner: Ze went to the Homosaurus website. I watched zem browse the Homosaurus. Ze uses the Homosaurus zirself.
broader: Pronouns
broader: Neopronouns
has top concept: Pronouns
replaces: zeZemPronouns
issued: 2021-07-01
modified: 2025-02-23
type: Concept
in scheme: v3
change note: Version 4.1.0

Ze/Mer/Zemself (Pronouns)
alternative label: Ze/Mer (Pronouns)
alternative label: Ze/Mer/Zemself
comment: A set of pronouns. Used in this manner: Ze went to the Homosaurus website. I watched mer browse the Homosaurus. Ze uses the Homosaurus zemself.
broader: Pronouns
broader: Neopronouns
has top concept: Pronouns
replaces: zeMerPronouns
issued: 2021-07-01
modified: 2025-02-23
type: Concept
in scheme: v3
change note: Version 4.1.0

Zee/Zed/Zedself (Pronouns)
alternative label: Zee/Zed (Pronouns)
alternative label: Zee/Zed/Zedself
comment: A set of pronouns. Used in this manner: Zee went to the Homosaurus website. I watched zed browse the Homosaurus. Zee uses the Homosaurus zedself.
broader: Pronouns
broader: Neopronouns
has top concept: Pronouns
replaces: zeeZedPronouns
issued: 2021-07-01
modified: 2025-02-23
type: Concept
in scheme: v3
change note: Version 4.1.0

Zie/Zir/Zirself (Pronouns)
alternative label: Zee/Zir (Pronouns)
alternative label: Zie/Zir/Zirself
comment: A set of pronouns. Used in this manner: Zie went to the Homosaurus website. I watched zir browse the Homosaurus. Zie uses the Homosaurus zirself.
broader: Pronouns
broader: Neopronouns
has top concept: Pronouns
replaces: zeeZirPronouns
issued: 2021-07-01
modified: 2025-02-23
type: Concept
in scheme: v3
change note: Version 4.1.0

Zie/Zem/Zirself (Pronouns)
alternative label: Zie/Zem (Pronouns)
alternative label: Zie/Zem/Zirself
comment: A set of pronouns. Used in this manner: Zie went to the Homosaurus website. I watched zem browse the Homosaurus. Zie uses the Homosaurus zirself.
broader: Pronouns
broader: Neopronouns
has top concept: Pronouns
replaces: zieZemPronouns
issued: 2021-07-01
modified: 2025-02-23
type: Concept
in scheme: v3
change note: Version 4.1.0

Zie/Hir/Hirself (Pronouns)
alternative label: Zie/Hir (Pronouns)
alternative label: Zie/Hir/Hirself
comment: A set of pronouns. Used in this manner: Zie went to the Homosaurus website. I watched hir browse the Homosaurus. Zie uses the Homosaurus hirself.
broader: Pronouns
broader: Neopronouns
has top concept: Pronouns
replaces: zieHirPronouns
issued: 2021-07-01
modified: 2025-02-23
type: Concept
in scheme: v3
change note: Version 4.1.0

Zme/Zmyr/Zmyrself (Pronouns)
alternative label: Zme (Pronouns)
alternative label: Zme/Zmyr/Zmyrself
comment: A set of pronouns. Used in this manner: Zme went to the Homosaurus website. I watched zmyr browse the Homosaurus. Zme uses the Homosaurus zmyrself.
broader: Pronouns
broader: Neopronouns
has top concept: Pronouns
replaces: zmePronouns
issued: 2021-07-01
modified: 2025-02-23
type: Concept
in scheme: v3
change note: Version 4.1.0

LGBTQ+ employment
preferred label: Empleo LGBTQ+ @es
alternative label: Employment (LGBTQ)
comment: Employment of LGBTQ+ individuals.
comment: El empleo de personas LGBTQ+. @es
narrower: Lesbian employment
narrower: Gay employment
narrower: Bisexual employment
narrower: Transgender employment
narrower: Queer employment
narrower: LGBTQ+ people in the workplace
narrower: Intersex employment
narrower: Asexual employment
related: LGBTQ+-owned businesses
related: Lesbian-owned businesses
related: Gay-owned businesses
related: Bisexual-owned businesses
related: Transgender-owned businesses
related: Queer-owned businesses
related: LGBTQ+-focused businesses
related: Lesbian-focused businesses
related: Gay-focused businesses
related: Bisexual-focused businesses
related: Transgender-focused businesses
related: Queer-focused businesses
related: LGBTQ+ chefs
related: Two-Spirit employment
issued: 2021-11-02
modified: 2025-02-23
type: Concept
in scheme: v3
change note: Version 4.1.0

Lesbian employment
preferred label: Empleo lésbico @es
comment: Employment of lesbians.
comment: El empleo de lesbianas. @es
broader: LGBTQ+ employment
related: Gay employment
related: Bisexual employment
related: Transgender employment
related: Queer employment
related: Lesbian chefs
has top concept: LGBTQ+ employment
issued: 2021-11-02
modified: 2025-02-23
type: Concept
in scheme: v3
change note: Version 4.1.0

Gay employment
preferred label: Empleo gay @es
comment: Employment of gay men.
comment: El empleo de hombres gay. @es
broader: LGBTQ+ employment
related: Lesbian employment
related: Bisexual employment
related: Transgender employment
related: Queer employment
related: Gay chefs
has top concept: LGBTQ+ employment
issued: 2021-11-02
modified: 2025-02-23
type: Concept
in scheme: v3
change note: Version 4.1.0

Bisexual employment
preferred label: Drama bisexual @es
comment: Employment of bisexual people.
comment: Obras de ficción escritas para ser puestas en escena; utilícese en referencia a obras dramáticas que se centran en personajes o temas bisexuales. @es
broader: LGBTQ+ employment
related: Lesbian employment
related: Gay employment
related: Transgender employment
related: Queer employment
related: Bisexual chefs
has top concept: LGBTQ+ employment
issued: 2021-11-02
modified: 2025-02-23
type: Concept
in scheme: v3
change note: Version 4.1.0

Transgender employment
preferred label: Empleo transgénero @es
comment: Employment of transgender people.
comment: Empleo de personas transgénero. @es
broader: LGBTQ+ employment
related: Lesbian employment
related: Gay employment
related: Bisexual employment
related: Queer employment
related: Transgender chefs
has top concept: LGBTQ+ employment
issued: 2021-11-02
modified: 2025-02-23
type: Concept
in scheme: v3
change note: Version 4.1.0

Queer employment
preferred label: Empleo queer @es
comment: Employment of queer people.
comment: Empleo de personas queer. @es
broader: LGBTQ+ employment
related: Lesbian employment
related: Gay employment
related: Bisexual employment
related: Transgender employment
related: Queer chefs
has top concept: LGBTQ+ employment
issued: 2021-11-02
modified: 2025-02-23
type: Concept
in scheme: v3
change note: Version 4.1.0

LGBTQ+ authors
preferred label: Autores LGBTQ+ @es
alternative label: Authors (LGBTQ)
alternative label: Autores (LGBTQ) @es
comment: LGBTQ+ creators of written works.
comment: Creadores de obras escritas que se conocen por ser personas LGBTQ+. @es
broader: LGBTQ+ people
narrower: Lesbian authors
narrower: Gay authors
narrower: Bisexual authors
narrower: Transgender authors
narrower: Queer authors
narrower: Asexual authors
narrower: Aromantic authors
narrower: Intersex authors
narrower: Demisexual authors
narrower: Megasexual authors
narrower: Greyromantic authors
narrower: LGBTQ+ poets
related: LGBTQ+ drama
related: LGBTQ+ fiction
related: LGBTQ+ books
related: LGBTQ+ literature
related: LGBTQ+ poetry
related: LGBTQ+ literary criticism
related: LGBTQ+ autobiographies
related: Two-Spirit authors
related: LGBTQ+ fanfiction
related: LGBTQ+ people's writings
has top concept: LGBTQ+ people
issued: 2021-11-02
modified: 2025-03-13
type: Concept
in scheme: v3
change note: Version 4.1.0

Lesbian authors
preferred label: Autoras lesbianas @es
comment: Lesbian creators of written works.
comment: Creadoras de obras escritas conocidas por ser lesbianas. @es
broader: LGBTQ+ authors
related: Lesbian drama
related: Lesbian fiction
related: Lesbian literature
related: Lesbian poetry
related: Lesbian literary criticism
related: Lesbian autobiographies
related: Lesbians in fandom
related: Lesbian biographies
related: Lesbians' writings
has top concept: LGBTQ+ people
issued: 2021-11-02
modified: 2025-03-13
type: Concept
in scheme: v3
change note: Version 4.1.0

Gay authors
preferred label: Autores gay @es
comment: Gay creators of written works.
comment: Creadores de obras escritas conocidos por ser gay. @es
broader: LGBTQ+ authors
related: Gay drama
related: Gay fiction
related: Gay literature
related: Gay poetry
related: Gay literary criticism
related: Gay autobiographies
related: Gay men in fandom
related: Gay men's writings
has top concept: LGBTQ+ people
issued: 2021-11-02
modified: 2025-03-13
type: Concept
in scheme: v3
change note: Version 4.1.0

Bisexual authors
preferred label: Autores bisexuales @es
comment: Bisexual creators of written works.
comment: Creadores de obras escritas conocidos por ser bisexuales. @es
broader: LGBTQ+ authors
related: Bisexual drama
related: Bisexual fiction
related: Bisexual literature
related: Bisexual poetry
related: Bisexual literary criticism
related: Bisexual autobiographies
related: Bisexual people in fandom
related: Bisexual biographies
related: Bisexual people's writings
has top concept: LGBTQ+ people
issued: 2021-11-02
modified: 2025-03-13
type: Concept
in scheme: v3
change note: Version 4.1.0

Transgender authors
preferred label: Autores transgénero @es
comment: Transgender creators of written works.
comment: Creadores de obras escritas conocidos por ser transgénero. @es
broader: LGBTQ+ authors
related: Transgender drama
related: Transgender fiction
related: Transgender literature
related: Transgender poetry
related: Transgender literary criticism
related: Transgender autobiographies
related: Transgender people in fandom
related: Transgender biographies
has top concept: LGBTQ+ people
issued: 2021-11-02
modified: 2025-02-23
type: Concept
in scheme: v3
change note: Version 4.1.0

Queer authors
preferred label: Autores queer @es
comment: Queer creators of written works.
comment: Creadores de obras escritas conocidos por ser queer. @es
broader: LGBTQ+ authors
related: Queer drama
related: Queer fiction
related: Queer literature
related: Queer poetry
related: Queer literary criticism
related: Queer autobiographies
related: Queer people in fandom
related: Queer biographies
related: Queer people's writings
has top concept: LGBTQ+ people
issued: 2021-11-02
modified: 2025-03-13
type: Concept
in scheme: v3
change note: Version 4.1.0

LGBTQ+ autobiographies
preferred label: Autobiografías LGBTQ+ @es
alternative label: Autobiographies (LGBTQ)
alternative label: LGBTQ+ autobios
alternative label: LGBTQ+ memoirs
alternative label: Autobiografías LGBTQ @es
alternative label: Memorias LGBTQ @es
alternative label: Memorias LGBTQ+ @es
comment: Accounts of LGBTQ+ peoples' lives written by those people. For written accounts of LGBTQ+ people's lives that were not written by the subject, use "LGBTQ+ biographies."
comment: Relatos de vida de personas escritos por esas mismas personas; utilícese para autobiografías escritas por autores LGBTQ+. @es
narrower: Lesbian autobiographies
narrower: Gay autobiographies
narrower: Bisexual autobiographies
narrower: Transgender autobiographies
narrower: Queer autobiographies
narrower: Aromantic autobiographies
narrower: Asexual autobiographies
narrower: Demisexual autobiographies
narrower: Megasexual autobiographies
narrower: Greyromantic autobiographies
narrower: Intersex autobiographies
related: LGBTQ+ biographies
related: LGBTQ+ authors
related: LGBTQ+ history
related: Two-Spirit autobiographies
issued: 2021-11-02
modified: 2025-02-23
type: Concept
in scheme: v3
change note: Version 4.1.0

Lesbian autobiographies
preferred label: Autobiografías lésbicas @es
alternative label: Lesbian autobios
alternative label: Lesbian memoirs
alternative label: Autobiografías de lesbianas @es
alternative label: Memorias lesbianas @es
comment: Accounts of lesbians' lives written by those people. For written accounts of lesbians' lives that were not written by the subject, use "Lesbian biographies."
comment: Relatos de vida de personas escritos por esas mismas personas; utilícese para autobiografías escritas por autoras lesbianas. @es
broader: LGBTQ+ autobiographies
related: Lesbian biographies
related: Lesbian authors
has top concept: LGBTQ+ autobiographies
issued: 2021-11-02
modified: 2025-02-23
type: Concept
in scheme: v3
change note: Version 4.1.0

Gay autobiographies
preferred label: Autobiografías gay @es
alternative label: Gay autobios
alternative label: Gay memoirs
alternative label: Memorias gay @es
comment: Accounts of gay men's lives written by those people. For written accounts of gay men's lives that were not written by the subject, use "Gay biographies."
comment: Relatos de vida de personas escritos por esas mismas personas; utilícese para autobiografías escritas por autores gay. @es
broader: LGBTQ+ autobiographies
related: Gay biographies
related: Gay authors
has top concept: LGBTQ+ autobiographies
issued: 2021-11-02
modified: 2025-02-23
type: Concept
in scheme: v3
change note: Version 4.1.0

Bisexual autobiographies
preferred label: Autobiografías bisexuales @es
alternative label: Bisexual autobios
alternative label: Bisexual memoirs
comment: Accounts of bisexual peoples' lives written by those people. For written accounts of bisexual people's lives that were not written by the subject, use "Bisexual biographies."
comment: Relatos de vida de personas escritos por esas mismas personas; utilícese para autobiografías escritas por autores bisexuales. @es
broader: LGBTQ+ autobiographies
related: Bisexual biographies
related: Bisexual authors
has top concept: LGBTQ+ autobiographies
issued: 2021-11-02
modified: 2025-02-23
type: Concept
in scheme: v3
change note: Version 4.1.0

Transgender autobiographies
preferred label: Autobiografías transgénero @es
alternative label: Transgender autobios
alternative label: Transgender memoirs
alternative label: Trans autobiographies
alternative label: Trans autobios
alternative label: Trans memoirs
alternative label: Memorias transgénero @es
comment: Accounts of trans peoples' lives written by those people. For written accounts of trans people's lives that were not written by the subject, use "Transgender biographies."
comment: Relatos de vida de personas escritos por esas mismas personas; utilícese para autobiografías escritas por autores transgénero. @es
broader: LGBTQ+ autobiographies
related: Transgender biographies
related: Transgender authors
has top concept: LGBTQ+ autobiographies
issued: 2021-11-02
modified: 2025-02-23
type: Concept
in scheme: v3
change note: Version 4.1.0

Queer autobiographies
preferred label: Autobiografías queer @es
alternative label: Queer autobios
alternative label: Queer memoirs
alternative label: Memorias queer @es
comment: Accounts of queer peoples' lives written by those people. For written accounts of queer people's lives that were not written by the subject, use "Queer biographies."
comment: Relatos de vida de personas escritos por esas mismas personas; utilícese para autobiografías escritas por autores queer. @es
broader: LGBTQ+ autobiographies
related: Queer biographies
related: Queer authors
has top concept: LGBTQ+ autobiographies
issued: 2021-11-02
modified: 2025-02-23
type: Concept
in scheme: v3
change note: Version 4.1.0

LGBTQ+-owned businesses
preferred label: Negocios propiedad de personas LGBTQ+ @es
alternative label: LGBTQ-owned businesses
comment: Businesses owned by LGBTQ+ people.
comment: Empresas pertenecientes a personas LGBTQ+. @es
narrower: Lesbian-owned businesses
narrower: Gay-owned businesses
narrower: Bisexual-owned businesses
narrower: Transgender-owned businesses
narrower: Queer-owned businesses
narrower: Asexual-owned businesses
narrower: Intersex-owned businesses
related: LGBTQ+ employment
related: LGBTQ+-focused businesses
related: Lesbian-focused businesses
related: Gay-focused businesses
related: Bisexual-focused businesses
related: Transgender-focused businesses
related: Queer-focused businesses
related: LGBTQ+ people in the workplace
related: Police raids on LGBTQ+-related establishments
related: Two-Spirit-owned businesses
issued: 2021-11-02
modified: 2025-02-23
type: Concept
in scheme: v3
change note: Version 4.1.0

Lesbian-owned businesses
preferred label: Negocios propiedad de lesbianas @es
comment: Businesses owned by lesbians.
comment: Negocios pertenecientes a lesbianas. @es
broader: LGBTQ+-owned businesses
related: LGBTQ+ employment
related: Gay-owned businesses
related: Bisexual-owned businesses
related: Transgender-owned businesses
related: Queer-owned businesses
related: Lesbians in the workplace
has top concept: LGBTQ+-owned businesses
issued: 2021-11-02
modified: 2025-02-23
type: Concept
in scheme: v3
change note: Version 4.1.0

Gay-owned businesses
preferred label: Negocios propiedad de hombres gay @es
comment: Businesses owned by gay people.
comment: Empresas pertenecientes a hombres gay. @es
broader: LGBTQ+-owned businesses
related: LGBTQ+ employment
related: Lesbian-owned businesses
related: Bisexual-owned businesses
related: Transgender-owned businesses
related: Queer-owned businesses
related: Gay men in the workplace
has top concept: LGBTQ+-owned businesses
issued: 2021-11-02
modified: 2025-02-23
type: Concept
in scheme: v3
change note: Version 4.1.0

Bisexual-owned businesses
preferred label: Negocios propiedad de bisexuales @es
comment: Businesses owned by bisexual people.
comment: Empresas pertenecientes a personas bisexuales. @es
broader: LGBTQ+-owned businesses
related: LGBTQ+ employment
related: Lesbian-owned businesses
related: Gay-owned businesses
related: Transgender-owned businesses
related: Queer-owned businesses
related: Bisexual people in the workplace
has top concept: LGBTQ+-owned businesses
issued: 2021-11-02
modified: 2025-02-23
type: Concept
in scheme: v3
change note: Version 4.1.0

Transgender-owned businesses
preferred label: Negocios propiedad de personas transgénero @es
comment: Businesses owned by transgender people.
comment: Empresas pertenecientes a personas transgénero. @es
broader: LGBTQ+-owned businesses
related: LGBTQ+ employment
related: Lesbian-owned businesses
related: Gay-owned businesses
related: Bisexual-owned businesses
related: Queer-owned businesses
related: Transgender people in the workplace
has top concept: LGBTQ+-owned businesses
issued: 2021-11-02
modified: 2025-02-23
type: Concept
in scheme: v3
change note: Version 4.1.0

Queer-owned businesses
preferred label: Negocios propriedad de personas queer @es
comment: Businesses owned by queer people.
comment: Empresas pertenecientes a personas queer. @es
broader: LGBTQ+-owned businesses
related: LGBTQ+ employment
related: Lesbian-owned businesses
related: Gay-owned businesses
related: Bisexual-owned businesses
related: Transgender-owned businesses
related: Queer people in the workplace
has top concept: LGBTQ+-owned businesses
issued: 2021-11-02
modified: 2025-02-23
type: Concept
in scheme: v3
change note: Version 4.1.0

LGBTQ+-focused businesses
preferred label: Negocios orientados a personas LGBTQ+ @es
comment: Businesses focusing on LGBTQ+ clientele and products related to LGBTQ+ communities.
comment: Empresas enfocadas en clientela LGBTQ+ y productos relacionados con comunidades LGBTQ+. @es
narrower: Lesbian-focused businesses
narrower: Gay-focused businesses
narrower: Bisexual-focused businesses
narrower: Transgender-focused businesses
narrower: Queer-focused businesses
narrower: Asexual-focused businesses
narrower: Intersex-focused businesses
related: LGBTQ+ employment
related: LGBTQ+-owned businesses
related: LGBTQ+ people in the workplace
related: Police raids on LGBTQ+-related establishments
related: Two-Spirit-focused businesses
issued: 2021-11-02
modified: 2025-02-23
type: Concept
in scheme: v3
change note: Version 4.1.0

Lesbian-focused businesses
preferred label: Negocios orientados a lesbianas @es
comment: Businesses focusing on lesbian clientele and products related to lesbian communities.
comment: Empresas enfocadas en clientela lésbica y productos relacionados con comunidades lésbicas. @es
broader: LGBTQ+-focused businesses
related: LGBTQ+ employment
related: LGBTQ+-owned businesses
related: Gay-focused businesses
related: Bisexual-focused businesses
related: Transgender-focused businesses
related: Queer-focused businesses
related: Lesbians in the workplace
has top concept: LGBTQ+-focused businesses
issued: 2021-11-02
modified: 2025-02-23
type: Concept
in scheme: v3
change note: Version 4.1.0

Gay-focused businesses
preferred label: Negocios orientados a hombres gay @es
comment: Businesses focusing on gay clientele and products related to gay communities.
comment: Empresas enfocadas en clientela gay y productos relacionados con las comunidades gay. @es
broader: LGBTQ+-focused businesses
related: LGBTQ+ employment
related: LGBTQ+-owned businesses
related: Lesbian-focused businesses
related: Bisexual-focused businesses
related: Transgender-focused businesses
related: Queer-focused businesses
related: Gay men in the workplace
has top concept: LGBTQ+-focused businesses
issued: 2021-11-02
modified: 2025-02-23
type: Concept
in scheme: v3
change note: Version 4.1.0

Bisexual-focused businesses
preferred label: Negocios orientados a bisexuales @es
comment: Businesses focusing on bisexual clientele and products related to bisexual communities.
comment: Empresas enfocadas en clientela bisexual y productos relacionados con comunidades bisexuales. @es
broader: LGBTQ+-focused businesses
related: LGBTQ+ employment
related: LGBTQ+-owned businesses
related: Lesbian-focused businesses
related: Gay-focused businesses
related: Transgender-focused businesses
related: Queer-focused businesses
related: Bisexual people in the workplace
has top concept: LGBTQ+-focused businesses
issued: 2021-11-02
modified: 2025-02-23
type: Concept
in scheme: v3
change note: Version 4.1.0

Transgender-focused businesses
preferred label: Negocios orientados a personas transgénero @es
comment: Businesses focusing on transgender clientele and products related to transgender communities.
comment: Empresas enfocadas en clientela transgénero y productos relacionados con comunidades transgénero. @es
broader: LGBTQ+-focused businesses
related: LGBTQ+ employment
related: LGBTQ+-owned businesses
related: Lesbian-focused businesses
related: Gay-focused businesses
related: Bisexual-focused businesses
related: Queer-focused businesses
related: Transgender people in the workplace
has top concept: LGBTQ+-focused businesses
issued: 2021-11-02
modified: 2025-02-23
type: Concept
in scheme: v3
change note: Version 4.1.0

Queer-focused businesses
preferred label: Negocios orientados a personas queer @es
comment: Businesses focusing on queer clientele and products related to queer communities.
comment: Empresas enfocadas en clientela queer y productos relacionados con comunidades queer. @es
broader: LGBTQ+-focused businesses
related: LGBTQ+ employment
related: LGBTQ+-owned businesses
related: Lesbian-focused businesses
related: Gay-focused businesses
related: Bisexual-focused businesses
related: Transgender-focused businesses
related: Queer people in the workplace
has top concept: LGBTQ+-focused businesses
issued: 2021-11-02
modified: 2025-02-23
type: Concept
in scheme: v3
change note: Version 4.1.0

Asexual authors
preferred label: Autores asexuales @es
alternative label: Ace authors
alternative label: Ace writers
alternative label: Asexual writers
alternative label: Autores ace @es
alternative label: Escritores ace @es
alternative label: Escritores asexuales @es
alternative label: Autoras ace @es
alternative label: Escritoras ace @es
alternative label: Escritoras asexuales @es
comment: Asexual creators of written works.
comment: Creadores de obras escritas conocidos por ser asexuales. @es
broader: LGBTQ+ authors
related: Asexual fiction
related: Asexual people in fandom
related: Asexual poetry
related: Asexual literature
related: Asexual autobiographies
related: Asexual biographies
related: Asexual literary criticism
related: Asexual people's writings
has top concept: LGBTQ+ people
issued: 2021-11-09
modified: 2025-03-13
type: Concept
in scheme: v3
change note: Version 4.1.0

Aromantic authors
preferred label: Autores arrománticos @es
alternative label: Aro authors
alternative label: Aro writers
alternative label: Aromantic writers
alternative label: Autores aro @es
alternative label: Escritores aro @es
alternative label: Escritores arrománticos @es
alternative label: Autoras aro @es
alternative label: Escritoras aro @es
alternative label: Escritoras arrománticas @es
comment: Aromantic creators of written works.
comment: Creadores de obras escritas conocidos por ser arrománticos. @es
broader: LGBTQ+ authors
related: Aromantic fiction
related: Aromantic people in fandom
related: Aromantic poetry
related: Aromantic literature
related: Aromantic autobiographies
related: Aromantic biographies
related: Aromantic literary criticism
related: Aromantic people's writings
has top concept: LGBTQ+ people
issued: 2021-11-09
modified: 2025-03-13
type: Concept
in scheme: v3
change note: Version 4.1.0

Intersex authors
preferred label: Autores intersex @es
alternative label: Intersex writers
alternative label: Escritores intersex @es
comment: Intersex creators of written works.
comment: Creadores de obras escritas conocidos por ser intersex. @es
broader: LGBTQ+ authors
related: Intersex fiction
related: Intersex literature
related: Intersex biographies
related: Intersex people's writings
has top concept: LGBTQ+ people
issued: 2021-11-09
modified: 2025-03-13
type: Concept
in scheme: v3
change note: Version 4.1.0

Two-Spirit authors
preferred label: Autores dos espíritus @es
alternative label: 2S authors
alternative label: 2S writers
alternative label: Two Spirit authors
alternative label: Two Spirit writers
alternative label: Two Spirited authors
alternative label: Two Spirited writers
alternative label: Two-Spirit writers
alternative label: Two-Spirited authors
alternative label: Two-Spirited writers
alternative label: Escritores dos espíritus @es
comment: Two-Spirit creators of written works.
comment: Creadoras de obras escritas conocidas por ser dos espíritus. @es
broader: Two-Spirit people
narrower: Two-Spirit poets
related: LGBTQ+ authors
related: Two-Spirit literature
related: Two-Spirit autobiographies
related: Two-Spirit biographies
related: Two-Spirit people's writings
has top concept: Gender
issued: 2021-11-09
modified: 2025-03-13
type: Concept
in scheme: v3
change note: Version 4.1.0

Two-Spirit fiction
preferred label: Ficción dos espíritus @es
alternative label: 2S fiction
alternative label: Two Spirit fiction
alternative label: Two Spirited fiction
alternative label: Two-Spirited fiction
comment: Written works describing imagined events or people; use in reference to fictional works focusing on Two-Spirit characters or themes.
comment: Obras de ficción escritas donde figuran personajes dos espíritus o se abordan temas dos espíritus. @es
broader: Two-Spirit literature
related: LGBTQ+ fiction
related: Two-Spirit people in fandom
has top concept: Two-Spirit literature
issued: 2021-11-09
modified: 2026-02-23
type: Concept
in scheme: v3
change note: Version 4.1.0

Intersex fiction
preferred label: Ficción intersex @es
comment: Written works of fiction featuring intersex characters or addressing intersex themes.
comment: Obras escritas de ficción que presentan personajes intersex o abordan temas intersex. @es
broader: LGBTQ+ fiction
broader: Intersex people in fandom
narrower: Intersex fantasy fiction
narrower: Intersex horror fiction
narrower: Intersex mystery and detective fiction
narrower: Intersex romance fiction
narrower: Intersex science fiction
related: Bisexual fiction
related: Gay fiction
related: Lesbian fiction
related: LGBTQ+ books
related: Queer fiction
related: Transgender fiction
related: Intersex authors
related: Aromantic fiction
related: Asexual fiction
related: Greyromantic fiction
has top concept: Subcultures
issued: 2021-11-09
modified: 2026-02-23
type: Concept
in scheme: v3
change note: Version 4.1.0

Aromantic fiction
preferred label: Ficción arromántica @es
alternative label: Aro fiction
alternative label: Ficción aro @es
comment: Written works describing imagined events or people; use in reference to fictional works focusing on aromantic characters or themes.
comment: Obras escritas que describen eventos o personas imaginadas; utilícese en referencia a obras de ficción que se centran en personajes o temas arrománticos. @es
broader: LGBTQ+ fiction
narrower: Aromantic fantasy fiction
narrower: Aromantic horror fiction
narrower: Aromantic mystery and detective fiction
narrower: Aromantic romance fiction
narrower: Aromantic science fiction
related: Bisexual fiction
related: Gay fiction
related: Lesbian fiction
related: LGBTQ+ books
related: Queer fiction
related: Transgender fiction
related: Aromantic authors
related: Intersex fiction
related: Asexual fiction
related: Aromantic people in fandom
has top concept: Subcultures
issued: 2021-11-09
modified: 2025-10-31
type: Concept
in scheme: v3
change note: Version 4.1.0

Asexual fiction
preferred label: Ficción asexual @es
alternative label: Ace fiction
alternative label: Ficción ace @es
comment: Written works describing imagined events or people; use in reference to fictional works focusing on asexual characters or themes.
comment: Obras de ficción escritas donde figuran personajes asexuales o se abordan temas asexuales. @es
broader: LGBTQ+ fiction
narrower: Asexual fantasy fiction
narrower: Asexual mystery and detective fiction
narrower: Asexual romance fiction
narrower: Asexual science fiction
related: Bisexual characters
related: Bisexual fiction
related: Bisexual literature
related: Gay fiction
related: Lesbian fiction
related: LGBTQ+ books
related: Queer fiction
related: Transgender fiction
related: Asexual authors
related: Intersex fiction
related: Aromantic fiction
related: Asexual people in fandom
related: Bisexual people in fandom
related: Asexual literature
related: Greyromantic fiction
has top concept: Subcultures
issued: 2021-11-09
modified: 2026-02-23
type: Concept
in scheme: v3
change note: Version 4.1.0

LGBTQ+ cultural heritage institutions
preferred label: Instituciones de legado cultural LGBTQ+ @es
alternative label: Cultural heritage institutions (LGBTQ)
alternative label: GLAM (LGBTQ)
alternative label: GLAMS (LGBTQ)
alternative label: LGBTQ+ GLAM
alternative label: LGBTQ+ GLAMS
alternative label: Instituciones de legado cultural (LGBTQ) @es
comment: A broad grouping term for galleries, libraries, archives, museums, and special collections (GLAMS) that hold materials primarily pertaining to LGBTQ+ people or intended for use by LGBTQ+ people.
comment: Un término amplio para agrupar a galerías, bibliotecas, archivos, museos y colecciones especiales (GLAMS, por sus siglas en inglés) que contienen materiales principalmente relacionados con personas LGBTQ+ o destinados a ser utilizados por personas LGBTQ+. @es
narrower: LGBTQ+ archives
narrower: LGBTQ+ libraries
narrower: LGBTQ+ museums
narrower: LGBTQ+ special collections
related: LGBTQ+ artists
related: LGBTQ+ arts
related: LGBTQ+ literature
related: LGBTQ+ theater
related: LGBTQ+ culture
related: LGBTQ+ history
issued: 2021-11-23
modified: 2025-02-23
type: Concept
in scheme: v3
change note: Version 4.1.0

Gender creative
preferred label: Género creativo @es
comment: Term used to describe people, typically children, who do not conform to traditional gender norms and instead creatively interweave their internal and external experiences to understand their gender identity and expression. May also be used to describe a way of raising children outside of traditional gender norms.
comment: Término utilizado para describir a personas, generalmente niños, que no se ajustan a las normas de género tradicionales y, en cambio, entrelazan creativamente sus experiencias internas y externas para comprender su identidad y expresión de género. También puede utilizarse para describir una forma de criar a los niños fuera de las normas tradicionales de género. @es
broader: Gender expression
broader: Gender identity
related: Androgyny
related: LGBTQ+ children
related: Gender bending
related: Gender non-conforming people
related: Gender roles
related: LGBTQ+ youth
related: Gender non-conforming identity
related: Non-binary children
has top concept: Gender
issued: 2021-11-23
modified: 2025-02-23
type: Concept
in scheme: v3
change note: Version 4.1.0

Aromantic families
preferred label: Familias arrománticas @es
alternative label: Aro families
alternative label: Familias aro @es
comment: Families, whether biological, adoptive, or chosen, in which one or more individuals identify as aromantic.
comment: Familias, ya sean biológicas, adoptivas o elegidas, en las que una o más personas se autoidentifican como arrománticas. @es
broader: LGBTQ+ families
related: Aromantic people
related: Aromantic parents
related: Children of aromantic people
has top concept: LGBTQ+ families
issued: 2021-11-23
modified: 2025-02-23
type: Concept
in scheme: v3
change note: Version 4.1.0

Asexual families
preferred label: Familias asexuales @es
alternative label: Ace families
alternative label: Familias ace @es
comment: Families, whether biological, adoptive, or chosen, in which one or more individuals identify as asexual.
comment: Familias, ya sean biológicas, adoptivas o elegidas, en las que una o más personas se autoidentifican como asexuales. @es
broader: LGBTQ+ families
related: Asexual people
related: Asexual parents
related: Children of asexual people
has top concept: LGBTQ+ families
issued: 2021-11-23
modified: 2025-02-23
type: Concept
in scheme: v3
change note: Version 4.1.0

Intersex families
preferred label: Familias intersex @es
comment: Families, whether biological, adoptive, or chosen, in which one or more individuals are intersex.
comment: Familias, ya sean biológicas, adoptivas o elegidas, en las que una o más personas son intersex. @es
broader: LGBTQ+ families
related: Intersex people
related: Intersex parents
related: Children of intersex people
has top concept: LGBTQ+ families
issued: 2021-11-23
modified: 2025-02-23
type: Concept
in scheme: v3
change note: Version 4.1.0

Two-Spirit families
preferred label: Familias dos espíritus @es
alternative label: 2S families
alternative label: Two Spirit families
alternative label: Two Spirited families
alternative label: Two-Spirited families
comment: Families, whether biological, adoptive, or chosen, in which one or more individuals identify as Two-Spirit.
comment: Familias, ya sean biológicas, adoptivas o elegidas, en las que una o más personas se autoidentifican como dos espíritus. @es
broader: Two-Spirit people
related: Children of Two-Spirit people
related: Two-Spirit fathers
related: Two-Spirit mothers
has top concept: Gender
issued: 2021-11-23
modified: 2025-02-23
type: Concept
in scheme: v3
change note: Version 4.1.0

Aromantic parents
preferred label: Madres y padres arrománticos @es
alternative label: Aro parents
alternative label: Padres aro @es
alternative label: Madres aro @es
alternative label: Madres arrománticos @es
alternative label: Padres arrománticos @es
comment: Parents who are aromantic.
comment: Padres y/o madres que son arrománticos. @es
broader: LGBTQ+ parents
related: Aromantic people
related: Aromantic families
related: Children of aromantic people
has top concept: LGBTQ+ families
issued: 2021-11-23
modified: 2025-02-23
type: Concept
in scheme: v3
change note: Version 4.1.0

Asexual parents
preferred label: Madres y padres asexuales @es
alternative label: Ace parents
alternative label: Padres ace @es
alternative label: Madres ace @es
alternative label: Padres asexuales @es
alternative label: Madres asexuales @es
comment: Parents who are asexual.
comment: Padres y/o madres que son asexuales. @es
broader: LGBTQ+ parents
narrower: Asexual mothers
related: Asexual people
related: Asexual families
related: Children of asexual people
has top concept: LGBTQ+ families
issued: 2021-11-23
modified: 2025-02-23
type: Concept
in scheme: v3
change note: Version 4.1.0

Intersex parents
preferred label: Madres y padres intersex @es
alternative label: Madres intersex @es
alternative label: Padres intersex @es
comment: Parents who are intersex.
comment: Padres y/o madres que son intersex. @es
broader: LGBTQ+ parents
narrower: Intersex mothers
related: Intersex people
related: Intersex families
related: Children of intersex people
related: Intersex fathers
has top concept: LGBTQ+ families
issued: 2021-11-23
modified: 2025-02-23
type: Concept
in scheme: v3
change note: Version 4.1.0

Two-Spirit parents
preferred label: Madres y padres dos espíritus @es
alternative label: 2S parents
alternative label: Two Spirit parents
alternative label: Two Spirited parents
alternative label: Two-Spirited parents
alternative label: Madres dos espíritus @es
alternative label: Padres dos espíritus @es
comment: Two-Spirit people who are parents.
comment: Padres y/o madres que son dos espíritus. @es
broader: Two-Spirit people
broader: Parents
narrower: Two-Spirit fathers
narrower: Two-Spirit mothers
related: Children of Two-Spirit people
has top concept: Gender
issued: 2021-11-23
modified: 2025-02-23
type: Concept
in scheme: v3
change note: Version 4.1.0

Children of aromantic people
preferred label: Hijos de personas aromáticas @es
alternative label: Children of aro people
alternative label: Hijos de personas arro @es
alternative label: Hijas de personas aromáticas @es
alternative label: Hijas de personas arro|| @es
comment: Children who have one or more aromantic parent.
comment: Hijos o hijas que tienen uno o más padres arománticos. @es
broader: Children of LGBTQ+ people
related: Aromantic people
related: Aromantic families
related: Aromantic parents
has top concept: Family members
issued: 2021-11-23
modified: 2025-02-23
type: Concept
in scheme: v3
change note: Version 4.1.0

Children of asexual people
preferred label: Hijos de personas asexuales @es
alternative label: Children of ace people
alternative label: Hijos de personas ace @es
alternative label: Hijas de personas ace @es
alternative label: Hijas de personas asexuales @es
comment: Children who have one or more asexual parent.
comment: Hijos o hijas que tienen uno o más madres o padres asexuales. @es
broader: Children of LGBTQ+ people
narrower: Sons of asexual people
related: Asexual people
related: Asexual families
related: Asexual parents
has top concept: Family members
issued: 2021-11-23
modified: 2025-02-23
type: Concept
in scheme: v3
change note: Version 4.1.0

Children of intersex people
preferred label: Hijos de personas intersexuales @es
alternative label: Hijas de personas intersex @es
comment: Children who have one or more intersex parent.
comment: Hijos o hijas que tienen uno o más madres o padres intersexuales. @es
broader: Children of LGBTQ+ people
related: Intersex people
related: Intersex families
related: Intersex parents
related: Sons of intersex people
has top concept: Family members
issued: 2021-11-23
modified: 2025-02-23
type: Concept
in scheme: v3
change note: Version 4.1.0

Children of Two-Spirit people
preferred label: Hijos de personas dos espíritus @es
alternative label: Children of 2S people
alternative label: Children of Two Spirit people
alternative label: Children of Two Spirited people
alternative label: Children of Two-Spirited people
alternative label: Hijas de personas dos espíritus @es
alternative label: Hijos de personas 2S @es
alternative label: Hijas de personas 2S @es
comment: Children who have one or more Two-Spirit parent.
comment: Hijos o hijas que tienen uno o más madres o padres de dos espíritus. @es
broader: Children
related: Two-Spirit families
related: Two-Spirit parents
has top concept: Family members
issued: 2021-11-23
modified: 2025-02-23
type: Concept
in scheme: v3
change note: Version 4.1.0

Anti-Two-Spirit violence
preferred label: Violencia anti dos espíritus @es
alternative label: Anti-2S violence
alternative label: Anti-Two Spirit violence
alternative label: Anti-Two Spirited violence
alternative label: Anti-Two-Spirited violence
alternative label: Violencia hacia personas dos espíritus @es
alternative label: Violencia hacia dos espíritus @es
comment: Behavior involving physical force intended to harm or kill Two-Spirit people on the basis of their identity.
comment: Comportamiento que involucra fuerza física destinada a hacer daño o a matar a personas Dos Espíritus por su identidad. @es
broader: Anti-LGBTQ+ violence
related: Hate crimes
has top concept: Anti-LGBTQ+ violence
issued: 2021-11-23
modified: 2025-02-23
type: Concept
in scheme: v3
change note: Version 4.1.0

Anti-intersex violence
preferred label: Violencia anti-intersex @es
comment: Behavior involving physical force intended to harm or kill intersex people because they are intersex.
comment: Comportamiento que involucra fuerza física destinada a hacer daño o a matar a personas intersexuales por su identidad. @es
broader: Anti-LGBTQ+ violence
related: Hate crimes
related: Intersexphobia
has top concept: Anti-LGBTQ+ violence
issued: 2021-11-23
modified: 2025-02-23
type: Concept
in scheme: v3
change note: Version 4.1.0

LGBTQ+ chefs
preferred label: Cocineros LGBTQ+ @es
alternative label: Chefs (LGBTQ)
alternative label: Cocineros (LGBTQ) @es
alternative label: Chefs LGBTQ+ @es
comment: LGBTQ+ people who are trained, professional cooks, typically holding a leadership role in the kitchen in which they are employed.
comment: Personas LGBTQ+ que son cocineros profesionales capacitados y que generalmente desempeñan un papel de liderazgo en la cocina en la que trabajan. @es
broader: LGBTQ+ people
narrower: Lesbian chefs
narrower: Gay chefs
narrower: Bisexual chefs
narrower: Transgender chefs
narrower: Queer chefs
narrower: Intersex chefs
narrower: Asexual chefs
related: LGBTQ+ employment
related: Two-Spirit chefs
has top concept: LGBTQ+ people
issued: 2021-12-07
modified: 2025-02-23
type: Concept
in scheme: v3
change note: Version 4.1.0

Lesbian chefs
preferred label: Cocineras lesbianas @es
comment: Lesbians who are trained, professional cooks, typically holding a leadership role in the kitchen in which they are employed.
comment: Lesbianas que son cocineras profesionales capacitadas y que normalmente desempeñan un papel de liderazgo en la cocina en la que trabajan. @es
broader: LGBTQ+ chefs
related: Lesbian employment
related: Gay chefs
related: Bisexual chefs
related: Transgender chefs
related: Queer chefs
related: Intersex chefs
related: Asexual chefs
has top concept: LGBTQ+ people
issued: 2021-12-07
modified: 2025-02-23
type: Concept
in scheme: v3
change note: Version 4.1.0

Gay chefs
preferred label: Cocineros gay @es
comment: Gay men who are trained, professional cooks, typically holding a leadership role in the kitchen in which they are employed.
comment: Hombres gay que son cocineros profesionales entrenados y que generalmente desempeñan un papel de liderazgo en la cocina en la que trabajan. @es
broader: LGBTQ+ chefs
related: Gay employment
related: Lesbian chefs
related: Bisexual chefs
related: Transgender chefs
related: Queer chefs
related: Intersex chefs
related: Asexual chefs
has top concept: LGBTQ+ people
issued: 2021-12-07
modified: 2025-02-23
type: Concept
in scheme: v3
change note: Version 4.1.0

Bisexual chefs
preferred label: Cocineros bisexuales @es
alternative label: Chefs bisexuales @es
alternative label: Cocineras bisexuales @es
comment: Bisexual people who are trained, professional cooks, typically holding a leadership role in the kitchens in which they are employed.
comment: Personas bisexuales que son cocineras profesionales y capacitadas, quienes normalmente desempeñan un papel de liderazgo en las cocinas en las que trabajan. @es
broader: LGBTQ+ chefs
related: Bisexual employment
related: Lesbian chefs
related: Gay chefs
related: Transgender chefs
related: Queer chefs
related: Intersex chefs
related: Asexual chefs
has top concept: LGBTQ+ people
issued: 2021-12-07
modified: 2025-02-23
type: Concept
in scheme: v3
change note: Version 4.1.0

Transgender chefs
preferred label: Cocineros transgénero @es
comment: Transgender people who are trained, professional cooks, typically holding a leadership role in the kitchen in which they are employed.
comment: Personas transgénero que son cocineras profesionales capacitadas y que normalmente desempeñan un papel de liderazgo en la cocina en la que trabajan. @es
broader: LGBTQ+ chefs
related: Transgender employment
related: Lesbian chefs
related: Gay chefs
related: Bisexual chefs
related: Queer chefs
related: Intersex chefs
related: Asexual chefs
has top concept: LGBTQ+ people
issued: 2021-12-07
modified: 2025-02-23
type: Concept
in scheme: v3
change note: Version 4.1.0

Queer chefs
preferred label: Cocineros queer @es
alternative label: Chef queer @es
comment: Queer people who are trained, professional cooks, typically holding a leadership role in the kitchen in which they are employed.
comment: Personas queer que son cocineras profesionales y capacitadas, que normalmente desempeñan un papel de liderazgo en la cocina en la que trabajan. @es
broader: LGBTQ+ chefs
related: Queer employment
related: Lesbian chefs
related: Gay chefs
related: Bisexual chefs
related: Transgender chefs
related: Intersex chefs
related: Asexual chefs
has top concept: LGBTQ+ people
issued: 2021-12-07
modified: 2025-02-23
type: Concept
in scheme: v3
change note: Version 4.1.0

Intersex chefs
preferred label: Cocineros intersex @es
comment: Intersex people who are trained, professional cooks, typically holding a leadership role in the kitchen in which they are employed.
comment: Personas intersex que son cocineras profesionales y capacitadas, que normalmente desempeñan un papel de liderazgo en la cocina en la que trabajan. @es
broader: LGBTQ+ chefs
related: Lesbian chefs
related: Gay chefs
related: Bisexual chefs
related: Transgender chefs
related: Queer chefs
related: Asexual chefs
has top concept: LGBTQ+ people
issued: 2021-12-07
modified: 2025-02-23
type: Concept
in scheme: v3
change note: Version 4.1.0

Two-Spirit chefs
preferred label: Cocineros dos espíritus @es
alternative label: 2S chefs
alternative label: Two Spirit chefs
alternative label: Two Spirited chefs
alternative label: Two-Spirited chefs
comment: Two-Spirit people who are trained, professional cooks, typically holding a leadership role in the kitchen in which they are employed.
comment: Personas dos espíritus que son cocineras profesionales capacitadas y que normalmente desempeñan un papel de liderazgo en la cocina en la que trabajan. @es
broader: Two-Spirit people
related: LGBTQ+ chefs
has top concept: Gender
issued: 2021-12-07
modified: 2025-02-23
type: Concept
in scheme: v3
change note: Version 4.1.0

Vers (Sex)
preferred label: Vers
alternative label: Versatile
alternative label: Versátil @es
comment: Slang term for individuals who alternate between being the giving partner and the receiving partner in sexual encounters; typically used as an adjective (e.g., "They're vers.").
comment: Término de la jerga para personas que alternan entre ser la pareja que da y la que recibe en encuentros sexuales; normalmente se utiliza como adjetivo (por ejemplo, "Ella es vers"). @es
broader: Sexual identity
broader: Sexual roles
related: Bottoms (Sex)
related: Switches (Sex)
related: Tops (Sex)
has top concept: Sexual identity
issued: 2021-12-07
modified: 2025-02-23
type: Concept
in scheme: v3
change note: Version 4.1.0

t4t
alternative label: T4T (Trans for Trans)
alternative label: TFT
alternative label: Trans4Trans
alternative label: tft
alternative label: T4T @es
alternative label: Trans for trans @es
comment: Abbreviated form of the phrase "trans for trans," a label used to describe trans people who prioritize engaging in romantic, sexual, or other relationships with other trans people.
comment: Forma abreviada de la frase en inglés "trans for trans", traducida como "trans para trans", una etiqueta utilizada para describir a las personas trans que priorizan entablar relaciones románticas, sexuales o de otro tipo con otras personas trans. @es
related: Partners of transgender people
related: Transgender people
related: Transgender community
issued: 2021-12-07
modified: 2025-02-23
type: Concept
in scheme: v3
change note: Version 4.1.0

Clocking (Gender)
preferred label: Fichaje (género) @es
alternative label: Clocking (Transgender)
alternative label: Clocking
comment: Slang term for the act of identifying (or clocking) someone in public as trans, crossdressing, or in drag when that person is intending to pass or be read by others as cisgender, typically for their personal safety. Clocking is often understood to be a threat (of violence or public outing) against the person being clocked. Use the term "Reading (Gender)" to refer to shared identification or recognized kinship between two individuals who are both gender minorities.
comment: Término de la jerga para el acto de identificar (o fichar) a alguien en público como trans, trasformista o drag cuando esa persona tiene la intención de pasar o ser interpretada por otros como cisgénero, generalmente por su seguridad personal. A menudo se entiende que el fichaje es una amenaza (de violencia o salida pública) contra la persona que está siendo fichada. Utilícese el término "Fichaje (Género)" para referirse a la identificación compartida o el parentesco reconocido entre dos personas que pertenecen a minorías de género. @es
related: Stealth (Transgender)
related: Crossdressers
related: Passing (Gender)
related: Transgender people
related: Transsexual people
related: Transvestites
issued: 2021-12-07
modified: 2025-02-23
type: Concept
in scheme: v3
change note: Version 4.1.0

Blaqueer people
preferred label: Personas blaqueer @es
alternative label: BlaQ people
alternative label: Personas Blaq @es
alternative label: Blaqueer @es
comment: Black queer people who recognize their queer identity as salient to their Blackness and vice versa; only use to describe individuals who identify as Blaqueer or BlaQ.
comment: Personas negras queer que reconocen su identidad queer como imprescindible para su negritud y viceversa; utilícese para describir a personas que se autoidentifican como Blaqueer o BlaQ. @es
broader: Black LGBTQ+ people
has top concept: LGBTQ+ people
issued: 2021-12-07
modified: 2025-02-23
type: Concept
in scheme: v3
change note: Version 4.1.0

Closeted LGBTQ+ people
preferred label: Personas LGBTQ+ en el clóset @es
alternative label: Closeted people (LGBTQ)
alternative label: Personas en el clóset (LGBTQ) @es
comment: LGBTQ+ people who do not identify as such to others.
comment: Personas LGBTQ+ que no se autoidentifican como tales ante los demás. @es
broader: LGBTQ+ people
narrower: Closeted bisexual people
narrower: Closeted gay men
narrower: Closeted lesbians
narrower: Closeted transgender people
narrower: Closeted queer people
narrower: Closeted intersex people
narrower: Closeted asexual people
narrower: Closeted non-binary people
related: Stealth (Transgender)
related: Coming out
related: Down-low
related: Outing (LGBTQ+ culture)
related: Secrecy
related: Closeted Two-Spirit people
related: Beards (Gay culture)
has top concept: LGBTQ+ people
issued: 2021-12-08
modified: 2025-02-23
type: Concept
in scheme: v3
change note: Version 4.1.0

Closeted transgender people
preferred label: Personas transgénero en el clóset @es
alternative label: Closeted trans people
alternative label: Personas trans en el clóset @es
comment: Transgender people who do not identify as such to others.
comment: Personas transgénero que no se autoidentifican como tales ante los demás. @es
broader: Transgender people
broader: Closeted LGBTQ+ people
related: Closeted bisexual people
related: Closeted gay men
related: Closeted lesbians
related: Stealth (Transgender)
related: Coming out
related: Outing (LGBTQ+ culture)
related: Secrecy
related: Closeted queer people
related: Closeted asexual people
has top concept: LGBTQ+ people
issued: 2021-12-08
modified: 2025-02-23
type: Concept
in scheme: v3
change note: Version 4.1.0

Closeted queer people
preferred label: Personas queer en el clóset @es
comment: Queer people who do not identify as such to others.
comment: Personas queer que no se autoidentifican como tales ante los demás. @es
broader: Queer people
broader: Closeted LGBTQ+ people
related: Closeted bisexual people
related: Closeted gay men
related: Closeted lesbians
related: Stealth (Transgender)
related: Coming out
related: Down-low
related: Outing (LGBTQ+ culture)
related: Secrecy
related: Closeted transgender people
related: Closeted asexual people
has top concept: LGBTQ+ people
issued: 2021-12-08
modified: 2025-02-23
type: Concept
in scheme: v3
change note: Version 4.1.0

Closeted intersex people
preferred label: Personas intersexuales en el clóset @es
alternative label: Personas intersex en el clóset @es
comment: Intersex people who do not disclose the fact that they are intersex to others.
comment: Personas intersexuales que no revelan a los demás el hecho de que son intersex. @es
broader: Closeted LGBTQ+ people
related: Stealth (Transgender)
related: Coming out
related: Down-low
related: Outing (LGBTQ+ culture)
related: Secrecy
related: Closeted asexual people
has top concept: LGBTQ+ people
issued: 2021-12-08
modified: 2025-02-23
type: Concept
in scheme: v3
change note: Version 4.1.0

Closeted Two-Spirit people
preferred label: Personas dos espíritus en el clóset @es
alternative label: Closeted 2S people
alternative label: Closeted Two Spirit people
alternative label: Closeted Two Spirited people
alternative label: Closeted Two-Spirited people
comment: Two-Spirit people who do not identify as such to others.
comment: Personas de dos espíritus que no se autoidentifican como tales ante los demás. @es
broader: Two-Spirit people
related: Stealth (Transgender)
related: Coming out
related: Down-low
related: Outing (LGBTQ+ culture)
related: Secrecy
related: Closeted LGBTQ+ people
has top concept: Gender
issued: 2021-12-08
modified: 2025-02-23
type: Concept
in scheme: v3
change note: Version 4.1.0

Beards (Gay culture)
alternative label: Beards
comment: Individuals who pose as the date or partner of someone they are not in a relationship with, typically to prevent that person's sexuality from becoming public knowledge; most commonly used to refer to a woman pretending to be dating a gay man.
broader: Gay culture
related: Down-low
related: Dutch boys
related: Fag hags
related: Goldilocks (Gay culture)
related: Secrecy
related: Closeted LGBTQ+ people
has top concept: Subcultures
issued: 2021-12-08
modified: 2025-02-23
type: Concept
in scheme: v3
change note: Version 4.1.0

2SLGBTQ+
alternative label: LGBTQ2S+
comment: Abbreviation used to describe Two-Spirit people, lesbians, gay men, bisexual people, transgender people, queer people, and other gender and sexual minorities as a group; commonly used in Canada to emphasize the particularities of Indigenous people's experiences.
comment: Abreviatura utilizada para describir a las personas dos espíritus, lesbiana, gay, bisexuales, transgénero, queer y otras minorías sexuales y de género como grupo; comúnmente utilizada en Canadá para situar y centrar las experiencias particulares de las personas indígenas. @es
narrower: LGBTQ+
related: Bisexual community
related: Gay community
related: Lesbian community
related: Queer community
related: Transgender community
issued: 2021-12-14
modified: 2025-02-23
type: Concept
in scheme: v3
change note: Version 4.1.0

Packers (Phallus)
preferred label: Packers @es
alternative label: Prótesis de pene @es
comment: Padding or phallic objects designed to be worn in the front of an individual's pants or underwear to give the appearance of having a bulge.
comment: Objetos acolchados o fálicos diseñados para usarse en la parte delantera de los pantalones o la ropa interior de una persona para dar la apariencia de tener un protuberancia. @es
broader: Gender expression
related: Packing (Phallus)
related: Penis
has top concept: Gender
issued: 2021-12-14
modified: 2025-02-23
type: Concept
in scheme: v3
change note: Version 4.1.0

Alloromanticism
preferred label: Alorromanticismo @es
comment: A romantic orientation characterized by the occurrence of romantic attraction or desire in a frequent and consistent manner, often alongside sexual attraction.
comment: Una orientación romántica caracterizada por la atracción o el deseo romántico de manera frecuente y constante, a menudo junto con la atracción sexual. @es
broader: Romantic orientation
narrower: Biromanticism
narrower: Homoromanticism
narrower: Heteroromanticism
narrower: Panromanticism
related: Aromanticism
related: Alloromantic people
has top concept: Romantic orientation
issued: 2021-12-14
modified: 2025-02-23
type: Concept
in scheme: v3
change note: Version 4.1.0

Biromanticism
preferred label: Birromanticismo @es
comment: A romantic orientation characterized by the occurrence of romantic attraction or desire in a frequent and consistent manner toward more than one sex or gender.
comment: Orientación romántica caracterizada por la atracción o el deseo romántico de forma frecuente y constante hacia más de un sexo o género. @es
broader: Alloromanticism
broader: Romantic orientation
related: Biromantic people
has top concept: Romantic orientation
issued: 2021-12-14
modified: 2025-02-23
type: Concept
in scheme: v3
change note: Version 4.1.0

Homoromanticism
preferred label: Homoromanticismo @es
comment: A romantic orientation characterized by the occurrence of romantic attraction or desire in a frequent and consistent manner toward members of the same sex or gender.
comment: Una orientación romántica caracterizada por la ocurrencia de atracción o deseo romántico de manera frecuente y consistente hacia miembros del mismo sexo o género. @es
broader: Alloromanticism
broader: Romantic orientation
related: Homoromantic people
has top concept: Romantic orientation
issued: 2021-12-14
modified: 2025-02-23
type: Concept
in scheme: v3
change note: Version 4.1.0

Heteroromanticism
preferred label: Heteroromanticismo @es
comment: A romantic orientation characterized by the occurrence of romantic attraction or romantic desire in a frequent and consistent manner toward members of the opposite sex or gender.
comment: Una orientación romántica caracterizada por la ocurrencia de atracción romántica o deseo romántico de manera frecuente y consistente hacia miembros del sexo o género opuesto. @es
broader: Alloromanticism
broader: Romantic orientation
related: Heteroromantic people
has top concept: Romantic orientation
issued: 2021-12-14
modified: 2025-02-23
type: Concept
in scheme: v3
change note: Version 4.1.0

Panromanticism
preferred label: Panromanticismo @es
comment: A romantic orientation characterized by the occurrence of romantic attraction or romantic desire in a frequent and consistent manner irrespective of sex or gender.
comment: Una orientación romántica caracterizada por la ocurrencia de atracción romántica o deseo romántico de manera frecuente y consistente, independientemente del sexo o género. @es
broader: Alloromanticism
broader: Romantic orientation
related: Panromantic people
has top concept: Romantic orientation
issued: 2021-12-14
modified: 2025-02-23
type: Concept
in scheme: v3
change note: Version 4.1.0

Biracial lesbians
preferred label: Lesbianas birraciales @es
alternative label: Bi-racial lesbians
alternative label: Lesbianas bi-raciales @es
comment: Lesbians who belong to two or more racial groups. Only use to describe people who self-identify as biracial.
comment: Lesbianas que pertenecen a dos o más grupos raciales. Utilícese únicamente para personas que se autoidentifiquen como birraciales. @es
broader: Biracial LGBTQ+ people
has top concept: LGBTQ+ people
issued: 2022-01-18
modified: 2025-02-23
type: Concept
in scheme: v3
change note: Version 4.1.0

Biracial gay men
preferred label: Hombres gay birraciales @es
alternative label: Bi-racial gay men
alternative label: Gay bi-racial men
alternative label: Gay biracial men
alternative label: Hombres gay bi-raciales @es
alternative label: Gays bi-raciales @es
alternative label: Hombres bi-raciales gay @es
alternative label: Hombres birraciales gay @es
comment: Gay men who belong to two or more racial groups. Only use to describe people who self-identify as biracial.
comment: Hombres gay que pertenecen a dos o más grupos raciales. Utilícese únicamente para personas que se autoidentifiquen como birraciales. @es
broader: Biracial LGBTQ+ people
has top concept: LGBTQ+ people
issued: 2022-01-18
modified: 2025-02-23
type: Concept
in scheme: v3
change note: Version 4.1.0

Biracial bisexual people
preferred label: Personas bisexuales birraciales @es
alternative label: Bi-racial bisexual people
alternative label: Bisexual bi-racial people
alternative label: Bisexual biracial people
comment: Bisexual people who belong to two or more racial groups. Only use to describe people who self-identify as biracial.
comment: Personas bisexuales que pertenecen a dos o más grupos raciales. Utilícese únicamente para personas que se autoidentifiquen como birraciales. @es
broader: Biracial LGBTQ+ people
has top concept: LGBTQ+ people
issued: 2022-01-18
modified: 2025-02-23
type: Concept
in scheme: v3
change note: Version 4.1.0

Biracial transgender people
preferred label: Personas transgénero birraciales @es
alternative label: Bi-racial transgender people
alternative label: Transgender bi-racial people
alternative label: Transgender biracial people
alternative label: Personas bi-raciales transgénero @es
alternative label: Personas transgénero bi-raciales @es
alternative label: Personas birraciales transgénero @es
comment: Transgender people who belong to two or more racial groups. Only use to describe people who self-identify as biracial.
comment: Personas transgénero que pertenecen a dos o más grupos raciales. Utilícese únicamente para personas que se autoidentifiquen como birraciales. @es
broader: Biracial LGBTQ+ people
has top concept: LGBTQ+ people
issued: 2022-01-18
modified: 2025-02-23
type: Concept
in scheme: v3
change note: Version 4.1.0

Biracial queer people
preferred label: Personas queer birraciales @es
alternative label: Bi-racial queer people
alternative label: Queer bi-racial people
alternative label: Queer biracial people
alternative label: Personas queer bi-raciales @es
alternative label: Personas birraciales queer @es
alternative label: Personas bi-raciales queer @es
comment: Queer people who belong to two or more racial groups. Only use to describe people who self-identify as biracial.
comment: Personas queer que pertenecen a dos o más grupos raciales. Utilícese únicamente para personas que se autoidentifiquen como birraciales. @es
broader: Biracial LGBTQ+ people
has top concept: LGBTQ+ people
issued: 2022-01-18
modified: 2025-02-23
type: Concept
in scheme: v3
change note: Version 4.1.0

Multiracial lesbians
preferred label: Lesbianas multirraciales @es
alternative label: Multi-racial lesbians
comment: Lesbians who belong to two or more racial groups.
comment: Lesbianas que pertenecen a dos o más grupos raciales. Utilícese únicamente para personas que se autoidentifiquen como multirraciales. @es
broader: Multiracial LGBTQ+ people
related: Multiracial gay men
related: Multiracial bisexual people
related: Multiracial transgender people
related: Multiracial queer people
has top concept: LGBTQ+ people
issued: 2022-01-18
modified: 2025-02-23
type: Concept
in scheme: v3
change note: Version 4.1.0

Multiracial gay men
preferred label: Hombres gay multirraciales @es
alternative label: Gay multi-racial men
alternative label: Gay multiracial men
alternative label: Multi-racial gay men
alternative label: Hombres multirraciales gay @es
comment: Gay men who belong to two or more racial groups.
comment: Hombres gay que pertenecen a dos o más grupos raciales. Utilícese únicamente para personas que se autoidentifiquen como multirraciales. @es
broader: Multiracial LGBTQ+ people
related: Multiracial lesbians
related: Multiracial bisexual people
related: Multiracial transgender people
related: Multiracial queer people
has top concept: LGBTQ+ people
issued: 2022-01-18
modified: 2025-02-23
type: Concept
in scheme: v3
change note: Version 4.1.0

Multiracial bisexual people
preferred label: Personas bisexuales multirraciales @es
alternative label: Bisexual multi-racial people
alternative label: Bisexual multiracial people
alternative label: Multi-racial bisexual people
alternative label: Personas multirraciales bisexuales @es
comment: Bisexual people who belong to two or more racial groups.
comment: Personas bisexuales que pertenecen a dos o más grupos raciales. Utilícese únicamente para personas que se autoidentifiquen como multirraciales. @es
broader: Multiracial LGBTQ+ people
related: Multiracial lesbians
related: Multiracial gay men
related: Multiracial transgender people
related: Multiracial queer people
has top concept: LGBTQ+ people
issued: 2022-01-18
modified: 2025-02-23
type: Concept
in scheme: v3
change note: Version 4.1.0

Multiracial transgender people
preferred label: Personas transgénero multirraciales @es
alternative label: Multi-racial transgender people
alternative label: Transgender multi-racial people
alternative label: Transgender multiracial people
alternative label: Personas multirraciales transgénero @es
comment: Transgender people who belong to two or more racial groups.
comment: Personas transgénero que pertenecen a dos o más grupos raciales. Utilícese únicamente para personas que se autoidentifiquen como multirraciales. @es
broader: Multiracial LGBTQ+ people
related: Multiracial lesbians
related: Multiracial gay men
related: Multiracial bisexual people
related: Multiracial queer people
has top concept: LGBTQ+ people
issued: 2022-01-18
modified: 2025-02-23
type: Concept
in scheme: v3
change note: Version 4.1.0

Multiracial queer people
preferred label: Personas queer multirraciales @es
alternative label: Multi-racial queer people
alternative label: Queer multi-racial people
alternative label: Queer multiracial people
alternative label: Personas multirraciales queer @es
comment: Queer people who belong to two or more racial groups.
comment: Personas queer que pertenecen a dos o más grupos raciales. Utilícese únicamente para personas que se autoidentifiquen como multirraciales. @es
broader: Multiracial LGBTQ+ people
related: Multiracial lesbians
related: Multiracial gay men
related: Multiracial bisexual people
related: Multiracial transgender people
has top concept: LGBTQ+ people
issued: 2022-01-18
modified: 2025-02-23
type: Concept
in scheme: v3
change note: Version 4.1.0

Homoeroticism
preferred label: Homoerotismo @es
alternative label: Homoerotic
alternative label: Homoerótico @es
comment: Sexual attraction or erotic desire between members of the same sex or gender; typically used to describe temporary, latent, or unfulfilled desire rather than a more permanent sexual identity or orientation.
comment: Atracción sexual o deseo erótico entre miembros del mismo sexo o género; normalmente se utiliza para describir un deseo temporal, latente o insatisfecho en lugar de una identidad u orientación sexual más permanente. @es
broader: Eroticism
related: Physical affection
related: Sexual excitement
related: Sexuality
related: Actorfic
related: Bandslash
related: Kirk/Spock
has top concept: Eroticism
issued: 2022-01-18
modified: 2025-02-23
type: Concept
in scheme: v3
change note: Version 4.1.0

Content warnings
preferred label: Advertencias de contenido @es
alternative label: Trigger warnings
alternative label: Advertencias @es
comment: Statements used to caution individuals that materials may be disturbing or offensive. Includes warnings assigned to fanworks (usually by the creator) that give information about possibly upsetting, triggering, or controversial elements within a work.
comment: Declaraciones utilizadas para advertir a personas que los materiales pueden ser perturbadores u ofensivos. Incluye advertencias asignadas a obras de fanwork (generalmente por el creador) que brindan información sobre elementos posiblemente perturbadores, desencadenantes o controversiales dentro de una obra. @es
broader: Fanworks
narrower: Rape/non-con (Content warning)
narrower: Underage (Content warning)
has top concept: Subcultures
issued: 2022-01-18
modified: 2025-02-23
type: Concept
in scheme: v3
change note: Version 4.1.0

Costumes
preferred label: Disfraces @es
comment: Sets of clothing worn to emulate a particular person, place, thing, or time period.
comment: Conjuntos de ropa que se usan para emular a una persona, lugar, cosa o período de tiempo particular. @es
broader: Clothing
related: Drag
related: Halloween (LGBTQ+ culture)
related: Fursuits
has top concept: Gender
issued: 2022-01-18
modified: 2025-02-23
type: Concept
in scheme: v3
change note: Version 4.1.0

Indigiqueer people
preferred label: Personas indigequeer @es
comment: Indigenous queer people who recognize their queer identity as salient to their Indigenous identity and vice versa; some but not all Indigiqueer people also identify as Two-Spirit; only use to describe individuals who self-identify as Indigiqueer.
comment: Personas indígenas queer que reconocen su identidad queer como parte importante de su identidad indígena y viceversa; algunas, pero no todas, las personas indigequeer también se identifican como dos espíritus; utilícese únicamente para describir a personas que se autoidentifiquen como indigequeer. @es
broader: Indigenous LGBTQ+ people
broader: Queer people
related: Aboriginal Australian LGBTQ+ people
related: Inuit LGBTQ+ people
related: Papuan LGBTQ+ people
related: Native American LGBTQ+ people
related: Two-Spirit people
related: Indigiqueer
has top concept: LGBTQ+ people
issued: 2022-01-19
modified: 2025-02-23
type: Concept
in scheme: v3
change note: Version 4.1.0

Indigiqueer
preferred label: Indigequeer @es
comment: Term used to describe the identity of people who are both Indigenous and queer and view those identities as inherently related and interconnected.
comment: Término utilizado para describir la identidad de personas que son tanto indígenas como queer y ven esas identidades como inherentemente relacionadas e interconectadas. @es
broader: Non-Euro-American gender and sexual identities
related: Aboriginal Australian LGBTQ+ people
related: Inuit LGBTQ+ people
related: Takatāpui
related: Papuan LGBTQ+ people
related: Native American LGBTQ+ people
related: Two-Spirit people
related: Indigiqueer people
has top concept: Gender
issued: 2022-01-19
modified: 2025-02-23
type: Concept
in scheme: v3
change note: Version 4.1.0

Two-Spirit community
preferred label: Comunidad dos espíritus @es
alternative label: 2S community
alternative label: Two Spirit community
alternative label: Two Spirited community
alternative label: Two-Spirited community
comment: A group of Two-Spirit people united by their shared identity.
comment: Grupos de personas que comparten la experiencia de la identidad dos espíritus. @es
related: LGBTQ+ communities
related: Two-Spirit people
related: Two-Spirit community centers
issued: 2022-01-19
modified: 2025-02-23
type: Concept
in scheme: v3
change note: Version 4.1.0

Pacific Islander American LGBTQ+ people
preferred label: Personas LGBTQ+ del Pacífico estadounidenses @es
alternative label: AAPI LGBTQ+ people
alternative label: LGBTQ+ AAPIs
alternative label: LGBTQ+ Pacific Islander American people
alternative label: LGBTQ+ Pacific Islander Americans
alternative label: Pacific Islander American people (LGBTQ)
alternative label: Pacific Islander Americans (LGBTQ)
alternative label: Personas del Pacífico estadounidenses LGBTQ+ @es
comment: LGBTQ+ people who identify as both Pacific Islanders (or of Pacific Islander ancestry) and American.
comment: Personas LGBTQ+ que se identifican a la vez como isleñas del Pacífico (o de ascendencia isleña del Pacífico) y estadounidenses. @es
broader: LGBTQ+ people of shared ethnic or national identities
broader: LGBTQ+ people of color
broader: Indigenous LGBTQ+ people
narrower: Pacific Islander American lesbians
narrower: Pacific Islander American gay men
narrower: Pacific Islander American bisexual people
narrower: Pacific Islander American transgender people
narrower: Pacific Islander American queer people
narrower: Pacific Islander American intersex people
narrower: Pacific Islander American asexual people
narrower: Pacific Islander American non-binary people
has top concept: LGBTQ+ people
issued: 2022-01-24
modified: 2025-02-23
type: Concept
in scheme: v3
change note: Version 4.1.0

LGBTQ+ special collections
preferred label: Colecciones especiales LGBTQ+ @es
alternative label: Hidden collections (LGBTQ)
alternative label: LGBTQ+ hidden collections
alternative label: Special collections (LGBTQ)
alternative label: Colecciones especiales LGBTQ @es
alternative label: Colecciones especiales (LGBTQ) @es
alternative label: Colecciones ocultas (LGBTQ) @es
comment: Special collections that hold materials primarily pertaining to LGBTQ+ people or intended for use by LGBTQ+ people. Special collections tend to be a blend of institutional types (e.g., an archives with a museum component). This term should be applied to institutions that refer to themselves as special collections; otherwise, use the term "LGBTQ+ cultural heritage institutions."
comment: Colecciones especiales que contienen materiales principalmente relacionados con personas LGBTQ+ o destinados a ser utilizados por personas LGBTQ+. Las colecciones especiales tienden a ser una combinación de tipos institucionales (por ejemplo, archivos con un componente de museo). Este término debe aplicarse a instituciones que se refieran a sí mismas como colecciones especiales; de lo contrario, utilícese el término "instituciones de patrimonio cultural LGBTQ+". @es
broader: LGBTQ+ cultural heritage institutions
related: LGBTQ+ libraries
related: LGBTQ+ museums
related: LGBTQ+ theater
related: LGBTQ+ archivists
has top concept: LGBTQ+ cultural heritage institutions
issued: 2022-01-24
modified: 2026-02-23
type: Concept
in scheme: v3
change note: Version 4.1.0

Chasers
preferred label: Perseguidores @es
alternative label: Cazadores @es
comment: Individuals who express fetishistic interest in and pursue sexual encounters with others based solely on their affiliation with a (typically marginalized) group that the chaser does not belong to. Often coupled with other terms to identify the type of chaser.
comment: Personas que expresan interés fetichista y buscan encuentros sexuales con otros basándose únicamente en su afiliación con un grupo (normalmente marginado) al que el perseguidor no pertenece. A menudo se combina con otros términos para identificar el tipo de perseguidor. @es
broader: BDSM
broader: Sexual preference
has top concept: Eroticism
issued: 2022-01-24
modified: 2025-02-23
type: Concept
in scheme: v3
change note: Version 4.1.0

LGBTQ+ immigrants
preferred label: Inmigrantes LGBTQ+ @es
alternative label: Immigrants (LGBTQ)
alternative label: Inmigrantes (LGBTQ) @es
comment: LGBTQ+ people who have moved to another country.
comment: Personas LGBTQ+ que se han mudado a otro país. @es
broader: LGBTQ+ people
related: LGBTQ+ immigration rights
related: LGBTQ+ migrants
related: LGBTQ+ refugees
related: Official documentation
related: Passports
related: Undocumented LGBTQ+ residents
related: LGBTQ+ asylum seekers
has top concept: LGBTQ+ people
issued: 2022-01-24
modified: 2025-02-23
type: Concept
in scheme: v3
change note: Version 4.1.0

Gender transgression
preferred label: Transgresión de género @es
comment: Behaviors, acts, or forms of expression that contradict or do not conform to a given culture's norms surrounding gender.
comment: Comportamientos, actos o formas de expresión que contradicen o no se conforman a las normas de una cultura determinada en torno al género. @es
broader: Gender expression
related: Gender
related: Gender bending
related: Gender roles
related: Genderfuck
related: Gender minorities
related: LGBTQ+ fashion
has top concept: Gender
issued: 2022-02-14
modified: 2025-02-23
type: Concept
in scheme: v3
change note: Version 4.1.0

Gender minorities
preferred label: Minorías de género @es
alternative label: Gender variance
alternative label: Gender variant people
alternative label: Non-normative genders
comment: Individuals whose gender identities and practices differ from those of the dominant culture. Use the term "Sexual minorities" for individuals whose sexual identities, orientations, and practices differ from those of the dominant culture.
comment: Personas cuyas identidades y prácticas de género difieren de las de la cultura dominante. Utilícese el término "minorías sexuales" para personas cuyas identidades, orientaciones y prácticas sexuales difieren de las personas de la cultura dominante. @es
narrower: Agender people
narrower: Androgynous people
narrower: Crossdressers
narrower: Demigender people
narrower: Genderfluid people
narrower: Gender non-conforming people
narrower: Genderqueer people
narrower: Pangender people
narrower: Transgender people
narrower: Transvestites
narrower: Trigender people
narrower: Transgenderqueer people
related: Gender
related: Gender diversity
related: Gender identity
related: Gender roles
related: Genderfuck
related: Sexual minorities
related: Gender transgression
related: Romantic minorities
issued: 2022-02-14
modified: 2025-02-23
type: Concept
in scheme: v3
change note: Version 4.1.0

Trans inclusivity
preferred label: Inclusión trans @es
alternative label: Trans affirming
alternative label: Trans inclusion
alternative label: Trans inclusive
alternative label: Trans supportive
alternative label: Trans-inclusive
comment: The practice or policy of providing equal access and support to trans people.
comment: La práctica o política de brindar igualdad de acceso y apoyo a las personas trans. @es
broader: Inclusivity
related: Transgender people
has top concept: Inclusivity
issued: 2022-02-14
modified: 2025-02-23
type: Concept
in scheme: v3
change note: Version 4.1.0

Trans exclusivity
preferred label: Exclusión trans @es
alternative label: Trans exclusion
alternative label: Trans exclusive
alternative label: Trans-exclusive
comment: The practice or policy of denying equal access and support to trans people.
comment: La práctica o política de negar la igualdad de acceso y apoyo a las personas trans. @es
broader: Anti-transgender discrimination
broader: Inclusivity
related: Bathroom bans
related: Transphobia
related: Womyn
related: Anti-transgender legislation
related: Anti-gender movement
has top concept: LGBTQ+ discrimination
issued: 2022-02-14
modified: 2025-02-23
type: Concept
in scheme: v3
change note: Version 4.1.0

Transmasculinity
preferred label: Transmasculinidad @es
comment: Masculine-aligned identities or practices of trans people.
comment: Identidades o prácticas masculinas de personas trans. @es
broader: Gender expression
broader: Masculinities
related: Transmasculine people
related: Trans men
related: Demiboys
has top concept: Gender
issued: 2022-02-14
modified: 2025-02-23
type: Concept
in scheme: v3
change note: Version 4.1.0

Transfemininity
preferred label: Transfeminidad @es
comment: Feminine-aligned identities or practices of trans people.
comment: Identidades o prácticas alineadas con lo femenino de personas trans. @es
broader: Femininities
broader: Gender expression
related: Transfeminine people
related: Trans women
related: Demigirls
has top concept: Gender
issued: 2022-02-14
modified: 2025-02-23
type: Concept
in scheme: v3
change note: Version 4.1.0

Hermaphrodites
preferred label: Hermafroditas @es
comment: A term originating from Greek mythology that refers to beings that are both fully female and fully male. The term was once adopted in the medical realm to describe people with intersex variations generally (and later to describe someone with both ovarian and testicular tissue specifically), but it is now recognized to be stigmatizing, imprecise, and misleading. Many people in the intersex community consider the use of this term to be pathologizing and deeply offensive, while other intersex people have chosen to reclaim the term to describe themselves and their bodies. Do not use this term to describe an individual unless they explicitly identify with it and have chosen to use it.
comment: Término originado en la mitología griega que se refiere a seres que son tanto completamente femeninos como completamente masculinos. El término fue adoptado alguna vez en el ámbito médico para describir a personas con variaciones intersex en general (y más tarde para describir a alguien con tejido tanto ovárico como testicular específicamente), pero ahora se reconoce como estigmatizante, impreciso y engañoso. Muchas personas de la comunidad intersex consideran que el uso de este término es patologizante y profundamente ofensivo, mientras que otras personas intersex han optado por reclamar el término para describirse a sí mismas y a sus cuerpos. No utilice este término para describir a una persona a menos que se identifique explícitamente con él y haya elegido utilizarlo. @es
broader: LGBTQ+ historical terms
related: Intersex
related: Intersex people
has top concept: LGBTQ+ historical terms
issued: 2022-02-14
modified: 2025-02-23
type: Concept
in scheme: v3
change note: Version 4.1.0

Alloromantic people
preferred label: Personas alorrománticas @es
comment: Individuals who experience romantic attraction or desire in a frequent and consistent manner, often alongside sexual attraction.
comment: Personas que experimentan atracción o deseo romántico de manera frecuente y constante, a menudo junto con la atracción sexual. @es
narrower: Biromantic people
narrower: Homoromantic people
narrower: Heteroromantic people
narrower: Panromantic people
related: Aromantic people
related: Alloromanticism
issued: 2022-02-14
modified: 2025-02-23
type: Concept
in scheme: v3
change note: Version 4.1.0

Biromantic people
preferred label: Personas birrománticas @es
comment: Individuals who experience romantic attraction or desire in a frequent and consistent manner toward people of more than one sex or gender.
comment: Personas que experimentan atracción o deseo romántico de forma frecuente y constante hacia personas de más de un sexo o género. @es
broader: Alloromantic people
broader: Romantic minorities
related: Aromantic people
related: Biromanticism
related: Homoromantic people
related: Heteroromantic people
related: Panromantic people
has top concept: Alloromantic people
issued: 2022-02-14
modified: 2025-02-23
type: Concept
in scheme: v3
change note: Version 4.1.0

Homoromantic people
preferred label: Personas homorománticas @es
comment: Individuals who experience romantic attraction or desire in a frequent and consistent manner toward members of the same sex or gender.
comment: Personas que experimentan atracción o deseo romántico de manera frecuente y constante hacia miembros del mismo sexo o género. @es
broader: Alloromantic people
broader: Romantic minorities
related: Aromantic people
related: Homoromanticism
related: Biromantic people
related: Heteroromantic people
related: Panromantic people
has top concept: Alloromantic people
issued: 2022-02-14
modified: 2025-02-23
type: Concept
in scheme: v3
change note: Version 4.1.0

Heteroromantic people
preferred label: Personas heterorománticas @es
comment: Individuals who experience romantic attraction or romantic desire in a frequent and consistent manner toward members of the opposite sex or gender.
comment: Personas que experimentan atracción romántica o deseo romántico de manera frecuente y consistente hacia miembros del sexo o género opuesto. @es
broader: Alloromantic people
related: Aromantic people
related: Heteroromanticism
related: Biromantic people
related: Homoromantic people
related: Panromantic people
has top concept: Alloromantic people
issued: 2022-02-14
modified: 2025-02-23
type: Concept
in scheme: v3
change note: Version 4.1.0

Panromantic people
preferred label: Personas panrománticas @es
comment: Individuals who experience romantic attraction or romantic desire toward others in a frequent and consistent manner irrespective of sex or gender.
comment: Personas que experimentan atracción romántica o deseo romántico hacia otras personas de manera frecuente y consistente, independientemente de su sexo o género. @es
broader: Alloromantic people
broader: Romantic minorities
related: Aromantic people
related: Panromanticism
related: Biromantic people
related: Homoromantic people
related: Heteroromantic people
has top concept: Alloromantic people
issued: 2022-02-14
modified: 2025-02-23
type: Concept
in scheme: v3
change note: Version 4.1.0

Romantic orientation
preferred label: Orientación romántica @es
comment: The direction or nature of an individual's romantic attraction toward others.
comment: La dirección o naturaleza de la atracción romántica de una personas hacia otras. @es
narrower: Aromanticism
narrower: Alloromanticism
narrower: Biromanticism
narrower: Homoromanticism
narrower: Heteroromanticism
narrower: Panromanticism
narrower: Demiromanticism
narrower: Greyromanticism
related: Sexual orientation
related: Relationship orientation
related: Romantic minorities
issued: 2022-02-14
modified: 2025-02-23
type: Concept
in scheme: v3
change note: Version 4.1.0

Romantic minorities
preferred label: Minorías románticas @es
comment: Individuals whose romantic orientations and/or practices differ from those of the dominant culture.
comment: Personas cuyas orientaciones y/o prácticas románticas difieren de las de la cultura dominante. @es
narrower: Aromantic people
narrower: Biromantic people
narrower: Homoromantic people
narrower: Panromantic people
narrower: Demiromantic people
narrower: Greyromantic people
related: Sexual minorities
related: Relationship minorities
related: Gender minorities
related: Romantic orientation
issued: 2022-02-14
modified: 2025-02-23
type: Concept
in scheme: v3
change note: Version 4.1.0

LGBTQ+ periodicals
preferred label: Revistas LGBTQ+ @es
alternative label: LGBTQ+ serials
alternative label: Periodicals (LGBTQ)
alternative label: Serials (LGBTQ)
comment: Publications or serials by or about LGBTQ+ people; use a more specific term if possible.
comment: Publicaciones o series escritas por o sobre personas LGBTQ+; utilícese un término más específico de ser posible. @es
narrower: AIDS periodicals
narrower: LGBTQ+ magazines
narrower: LGBTQ+ newsletters
narrower: LGBTQ+ newspapers
related: LGBTQ+ porn magazines
related: LGBTQ+ zines
related: LGBTQ+ publishers
issued: 2022-02-14
modified: 2026-02-23
type: Concept
in scheme: v3
change note: Version 4.1.0

LGBTQ+ culture
preferred label: Cultura LGBTQ+ @es
comment: Cultural experiences shared by members of LGBTQ+ communities or products of LGBTQ+ culture (e.g., art and media created by and for LGBTQ+ culture, activism focused on LGBTQ+ issues, slang commonly used in LGBTQ+ communities, etc.). Use a more specific term if possible.
comment: Experiencias culturales compartidas por miembros de comunidades LGBTQ+ o productos de la cultura LGBTQ+ (por ejemplo, arte y medios creados por y para la cultura LGBTQ+, activismo centrado en cuestiones LGBTQ+, jerga comúnmente utilizada en comunidades LGBTQ+, etc.). Utilícese un término más específico de ser posible. @es
broader: Subcultures
narrower: Lesbian culture
narrower: Gay culture
narrower: LGBTQ+ arts
narrower: LGBTQ+ literature
narrower: Transgender culture
narrower: Queer culture
narrower: Bisexual culture
narrower: Asexual culture
narrower: Intersex culture
related: LGBTQ+ cultural heritage institutions
related: LGBTQ+ punk community
has top concept: Subcultures
issued: 2022-02-14
modified: 2025-02-23
type: Concept
in scheme: v3
change note: Version 4.1.0

Queer culture
preferred label: Cultura queer @es
comment: Cultural experiences shared by members of queer communities or products of queer culture (e.g., art and media created by and for queer people, activism focused on queer issues, slang commonly used in queer communities, etc.).
comment: Experiencias culturales compartidas por miembros de comunidades queer o productos de la cultura queer (por ejemplo, arte y medios creados por y para personas queer, activismo centrado en cuestiones queer, jerga comúnmente utilizada en comunidades queer, etc.). @es
broader: LGBTQ+ culture
narrower: Culturally queer
related: Lesbian culture
related: Gay culture
related: Transgender culture
related: Bisexual culture
has top concept: Subcultures
issued: 2022-02-14
modified: 2025-02-23
type: Concept
in scheme: v3
change note: Version 4.1.0

Bisexual culture
preferred label: Cultura bisexual @es
comment: Use to describe cultural experiences shared by members of bisexual communities or products of bisexual culture (e.g., art and media created by and for bisexual people, activism focused on bisexual issues, slang commonly used in bisexual communities, etc.).
comment: Utilícese para describir experiencias culturales compartidas por miembros de comunidades bisexuales o productos de la cultura bisexual (p. ej., arte y medios creados por y para personas bisexuales, activismo centrado en cuestiones bisexuales, jerga comúnmente utilizada en comunidades bisexuales, etc.). @es
broader: LGBTQ+ culture
related: Lesbian culture
related: Gay culture
related: Transgender culture
related: Queer culture
has top concept: Subcultures
issued: 2022-02-14
modified: 2025-02-23
type: Concept
in scheme: v3
change note: Version 4.1.0

Detransitioning
preferred label: Detransicionar @es
alternative label: Detransition
alternative label: Detransición @es
comment: Ceasing or reversing the process of gender transition for any reason, including personal safety, stigma, costs associated with transitioning, health concerns, to regain fertility, etc.
comment: Cesar o revertir el proceso de transición de género por cualquier motivo, incluida la seguridad personal, el estigma, los costos asociados con la transición, problemas de salud, para recuperar la fertilidad, etc. @es
broader: Transitioning (Gender)
related: Transitioning status
related: Retransitioning
related: Desistance (Gender)
has top concept: Transitioning (Gender)
issued: 2022-02-14
modified: 2026-02-23
type: Concept
in scheme: v3
change note: Version 4.1.0

Retransitioning
preferred label: Retransicionar @es
alternative label: Retransition
alternative label: Retransición @es
comment: Restarting the process of gender transition after a period of detransitioning.
comment: Reiniciar el proceso de transición de género después de un período de detransición. @es
broader: Transitioning (Gender)
related: Transitioning status
related: Detransitioning
related: Desistance (Gender)
has top concept: Transitioning (Gender)
issued: 2022-02-14
modified: 2026-02-23
type: Concept
in scheme: v3
change note: Version 4.1.0

Desistance (Gender)
preferred label: Desistimiento (Género) @es
comment: No longer identifying as transgender, or, more broadly, no longer identifying as some particular gender.
comment: Ya no identificarse como transgénero o, en términos más generales, ya no identificarse con algún género en particular. @es
broader: Transitioning (Gender)
related: Transitioning status
related: Detransitioning
related: Retransitioning
has top concept: Transitioning (Gender)
issued: 2022-02-14
modified: 2026-02-23
type: Concept
in scheme: v3
change note: Version 4.1.0

Facial gender affirming surgery
preferred label: Cirugía facial de afirmación de género @es
alternative label: Facial gender affirmation surgery
alternative label: Facial gender confirmation surgery
alternative label: Facial gender confirming surgery
alternative label: Cirugía facial de confirmación de género @es
comment: Any of various surgeries that involve modifying the face or facial features to affirm the patient's gender.
comment: Cualquiera de las diversas cirugías que implican modificar el rostro o los rasgos faciales para afirmar el género del paciente. @es
broader: Gender-affirming surgery
narrower: Facial masculinization surgery
narrower: Facial feminization surgery
related: Transitioning status
related: Transitioning (Gender)
related: Tracheal shave
has top concept: Medical care
issued: 2022-02-14
modified: 2025-02-23
type: Concept
in scheme: v3
change note: Version 4.1.0

Facial masculinization surgery
preferred label: Cirugía de masculinización facial @es
preferred label: Facial masculinisation surgery
alternative label: FMS
comment: Any of various surgeries undertaken to masculinize the face or facial features.
comment: Cualquiera de las diversas cirugías realizadas para masculinizar el rostro o los rasgos faciales. @es
broader: Facial gender affirming surgery
related: Transitioning status
related: Transitioning (Gender)
related: Facial feminization surgery
has top concept: Medical care
issued: 2022-02-14
modified: 2025-02-23
type: Concept
in scheme: v3
change note: Version 4.1.0

Facial feminization surgery
preferred label: Cirugía de feminización facial @es
preferred label: Facial feminisation surgery
alternative label: FFS
alternative label: CFF @es
comment: Any of various surgeries undertaken to feminize the face or facial features.
comment: Cualquiera de las diversas cirugías realizadas para feminizar el rostro o los rasgos faciales. @es
broader: Facial gender affirming surgery
narrower: Tracheal shave
related: Transitioning status
related: Transitioning (Gender)
related: Facial masculinization surgery
has top concept: Medical care
issued: 2022-02-14
modified: 2025-02-23
type: Concept
in scheme: v3
change note: Version 4.1.0

Top surgery
preferred label: Cirugía de pecho @es
alternative label: Cirugía superior @es
comment: Colloquial term for gender-affirming surgical alterations of the chest.
comment: Término coloquial para las alteraciones quirúrgicas del tórax que afirman el género. @es
broader: Gender-affirming surgery
narrower: Breast augmentation
narrower: Mastectomy
narrower: Chest reconstruction surgery
related: Binding (Chest)
related: Bottom surgery
related: Transitioning (Gender)
has top concept: Medical care
issued: 2022-02-14
modified: 2025-02-23
type: Concept
in scheme: v3
change note: Version 4.1.0

Chest reconstruction surgery
preferred label: Cirugía de reconstrucción torácica @es
alternative label: Chest wall reconstruction
alternative label: Reconstrucción de la pared toráxica @es
comment: Reconstruction of the chest, typically following a mastectomy, to give the chest a more masculine appearance.
comment: Reconstrucción del tórax, generalmente después de una mastectomía, para darle al tórax una apariencia más masculina. @es
broader: Top surgery
related: Transitioning (Gender)
related: Mastectomy
related: Chest
has top concept: Medical care
issued: 2022-02-14
modified: 2025-02-23
type: Concept
in scheme: v3
change note: Version 4.1.0

Feminizing vocal surgery
preferred label: Cirugía vocal feminizante @es
alternative label: VFS
alternative label: Vocal feminization surgery
alternative label: Voice feminization surgery
alternative label: Cirugía de feminización vocal @es
comment: Any of various surgical procedures undertaken to feminize the voice.
comment: Cualquiera de los diversos procedimientos quirúrgicos realizados para feminizar la voz. @es
broader: Gender-affirming surgery
related: Transitioning (Gender)
related: Voice
related: Voice therapy (Gender)
related: Masculinizing vocal surgery
has top concept: Medical care
issued: 2022-02-14
modified: 2025-02-23
type: Concept
in scheme: v3
change note: Version 4.1.0

Masculinizing vocal surgery
preferred label: Cirugía de masculinización de la voz @es
alternative label: Masculinization laryngoplasty
alternative label: Vocal masculinization surgery
alternative label: Voice masculinization surgery
alternative label: Cirugía vocal masculinizante @es
comment: Any of various surgical procedures undertaken to masculinize the voice.
comment: Cualquiera de los diversos procedimientos quirúrgicos realizados para masculinizar la voz. @es
broader: Gender-affirming surgery
related: Transitioning (Gender)
related: Voice
related: Voice therapy (Gender)
related: Feminizing vocal surgery
has top concept: Medical care
issued: 2022-02-14
modified: 2025-02-23
type: Concept
in scheme: v3
change note: Version 4.1.0

Clitoroplasty
preferred label: Clitoroplastia @es
alternative label: Reducción de clitoris @es
comment: Surgical construction of the clitoris, often undertaken as a form of gender affirming surgery.
comment: Construcción quirúrgica del clítoris, a menudo realizada como una forma de cirugía de afirmación de género. @es
broader: Bottom surgery
related: Clitoris
related: Neovagina
related: Transitioning (Gender)
related: Labiaplasty
related: Vaginoplasty
has top concept: Medical care
issued: 2022-02-14
modified: 2025-02-23
type: Concept
in scheme: v3
change note: Version 4.1.0

Labiaplasty
preferred label: Labioplastia @es
alternative label: Labioplasty
comment: Surgical construction of the labia.
comment: Construcción quirúrgica de la labia @es
broader: Bottom surgery
related: Neovagina
related: Transitioning (Gender)
related: Vagina
related: Vulva
related: Clitoroplasty
related: Vaginoplasty
has top concept: Medical care
issued: 2022-02-14
modified: 2025-02-23
type: Concept
in scheme: v3
change note: Version 4.1.0

Metoidioplasty
preferred label: Metoidioplastia @es
alternative label: Meta
alternative label: Metaoidioplasty
alternative label: Meto
alternative label: Meto|| @es
comment: Surgical procedure in which the urethra is elongated and placed along a neophallus, typically to allow for standing urination.
comment: Procedimiento quirúrgico en el que la uretra se alarga y se coloca a lo largo de un neofalo, generalmente para permitir orinar de pie. @es
broader: Bottom surgery
related: Penis
related: Testicle
related: Transitioning (Gender)
related: Scrotoplasty
related: Vaginectomy
related: Phalloplasty
related: Stand-to-Pee devices
related: Neophallus
has top concept: Medical care
issued: 2022-02-14
modified: 2025-02-23
type: Concept
in scheme: v3
change note: Version 4.1.0

Scrotoplasty
preferred label: Escrotoplastia @es
alternative label: Oscheoplasty
comment: Surgical construction of the scrotum.
comment: Construcción quirúrgica del escroto. @es
broader: Bottom surgery
related: Penis
related: Testicle
related: Transitioning (Gender)
related: Metoidioplasty
related: Vaginectomy
related: Phalloplasty
related: Neophallus
has top concept: Medical care
issued: 2022-02-14
modified: 2025-02-23
type: Concept
in scheme: v3
change note: Version 4.1.0

Vaginectomy
preferred label: Vaginectomía @es
comment: Surgical removal of the vagina.
comment: Extirpación quirúrgica de la vagina. @es
broader: Bottom surgery
related: Clitoris
related: Transitioning (Gender)
related: Vagina
related: Vulva
related: Metoidioplasty
related: Scrotoplasty
related: Phalloplasty
related: Neophallus
has top concept: Medical care
issued: 2022-02-14
modified: 2025-02-23
type: Concept
in scheme: v3
change note: Version 4.1.0

Tracheal shave
preferred label: Afeitado traqueal @es
alternative label: Adam's apple reduction
alternative label: Chondrolaryngoplasty
alternative label: TCR
alternative label: Thyroid cartilage reduction
alternative label: Trache shave
alternative label: Trachea shave
comment: A surgery in which the laryngeal prominence, colloquially referred to as the Adam's apple, is reduced in size, often as part of facial feminization surgery for transfeminine people. Cisgender men and cisgender women may also undergo tracheal shaves if they feel their laryngeal prominence is too prominent.
comment: Una cirugía en la que se reduce de tamaño la prominencia laríngea, coloquialmente conocida como la nuez de Adán, a menudo como parte de una cirugía de feminización facial para personas transfemeninas. Los hombres y las mujeres cisgénero también pueden someterse a un afeitado traqueal si sienten que su prominencia laríngea es demasiado prominente. @es
broader: Facial feminization surgery
related: Transitioning (Gender)
related: Facial gender affirming surgery
has top concept: Medical care
issued: 2022-02-15
modified: 2025-02-23
type: Concept
in scheme: v3
change note: Version 4.1.0

Phalloplasty
preferred label: Faloplastia @es
alternative label: Phallo
alternative label: Vagina-preserving phalloplasty
alternative label: Flaplatia preservando la vagina @es
comment: Surgical construction of the penis.
comment: Construcción quirúrgica del pene. @es
broader: Bottom surgery
related: Penis
related: Transitioning (Gender)
related: Metoidioplasty
related: Scrotoplasty
related: Vaginectomy
related: Neophallus
has top concept: Medical care
issued: 2022-02-15
modified: 2025-02-23
type: Concept
in scheme: v3
change note: Version 4.1.0

Vaginoplasty
preferred label: Vaginoplastia @es
alternative label: Intestinal vaginoplasty
alternative label: Penile inversion vaginoplasty
alternative label: Phallus-preserving vaginoplasty
alternative label: Zero depth vaginoplasty
alternative label: Ginetoplastia feminizante @es
comment: Surgical construction of the vagina.
comment: Construcción quirúrgica de la vagina. @es
broader: Bottom surgery
related: Neovagina
related: Transitioning (Gender)
related: Vagina
related: Vulva
related: Clitoroplasty
related: Labiaplasty
has top concept: Medical care
issued: 2022-02-15
modified: 2025-02-23
type: Concept
in scheme: v3
change note: Version 4.1.0

Stand-to-Pee devices
alternative label: STP devices
alternative label: STPs
alternative label: Stand to pee devices
comment: Devices designed to allow individuals to pee while standing up; often used by trans men or transmasculine people to pee in public urinals without risking their safety.
broader: Gender expression
related: Binding (Chest)
related: Metoidioplasty
related: Neophallus
has top concept: Gender
issued: 2022-02-15
modified: 2025-02-23
type: Concept
in scheme: v3
change note: Version 4.1.0

LGBTQ+ asylum seekers
preferred label: Solicitantes de asilo LGBTQ+ @es
alternative label: Asylum seekers (LGBTQ)
alternative label: Solicitantes de asilo (LGBTQ) @es
comment: LGBTQ+ people who have left their home countries and are seeking protection from persecution and/or human rights violations in other countries but have not yet been legally recognized as refugees.
comment: Personas LGBTQ+ que han abandonado sus países de origen y buscan protección en otros países contra la persecución y/o violaciones de derechos humanos, pero que aún no han sido reconocidas legalmente como refugiadas. @es
broader: LGBTQ+ people
related: LGBTQ+ immigration rights
related: LGBTQ+ migrants
related: LGBTQ+ refugees
related: Official documentation
related: Passports
related: Undocumented LGBTQ+ residents
related: LGBTQ+ immigrants
has top concept: LGBTQ+ people
issued: 2022-02-15
modified: 2025-02-23
type: Concept
in scheme: v3
change note: Version 4.1.0

LGBTQ+ disabled people
preferred label: Personas LGBTQ+ discapacitadas @es
alternative label: Disabled people (LGBTQ)
alternative label: LGBTQ+ people with disabilities
alternative label: LGBTQ+ people with physical disabilities
alternative label: LGBTQ+ people with visual disabilities
alternative label: People with disabilities (LGBTQ)
alternative label: Personas con discapacidades (LGBTQ) @es
alternative label: Personas LGBTQ+ con discapacidades @es
alternative label: Personas LGBTQ+ con discapacidades físicas @es
alternative label: Personas discapacitadas (LGBTQ) @es
comment: LGBTQ+ people who are disabled.
comment: Personas LGBTQ+ con discapacidad. @es
broader: LGBTQ+ people
narrower: LGBTQ+ blind people
narrower: Lesbian disabled people
narrower: Gay disabled men
narrower: Bisexual disabled people
narrower: Transgender disabled people
narrower: Queer disabled people
narrower: LGBTQ+ hard of hearing people
narrower: LGBTQ+ Deaf people
narrower: LGBTQ+ wheelchair users
narrower: Non-binary disabled people
narrower: LGBTQ+ neurodivergent people
narrower: Asexual disabled people
narrower: Intersex disabled people
narrower: Demisexual disabled people
narrower: Megasexual disabled people
narrower: Aromantic disabled people
narrower: Greyromantic disabled people
related: LGBTQ+ Deaf culture
related: LGBTQ+ people with chronic illnesses
related: Crip
related: LGBTQ+ people who use substances for medical purposes
related: Queercrip
related: Two-Spirit disabled people
has top concept: LGBTQ+ people
issued: 2022-02-15
modified: 2025-02-23
type: Concept
in scheme: v3
change note: Version 4.1.0

Lesbian disabled people
preferred label: Lesbianas discapacitadas @es
alternative label: Disabled lesbians
alternative label: Lesbians with disabilities
alternative label: Discapacitadas lesbianas @es
alternative label: Lesbianas con discapacidades @es
comment: Lesbians who are disabled.
comment: Lesbianas con discapacidad. @es
broader: LGBTQ+ disabled people
narrower: Lesbian hard of hearing people
narrower: Lesbian Deaf people
narrower: Lesbian blind people
related: Lesbians with chronic illnesses
has top concept: LGBTQ+ people
issued: 2022-02-15
modified: 2025-02-23
type: Concept
in scheme: v3
change note: Version 4.1.0

Gay disabled men
preferred label: Personas gay discapacitadas @es
alternative label: Disabled gay men
alternative label: Gay men with disabilities
alternative label: Gay disabled people
alternative label: Disabled gay people
alternative label: Gay people with disabilities
alternative label: Hombres discapacitados gay @es
alternative label: Hombres gay con discapacidades @es
comment: Gay men who are disabled.
comment: Hombres gay con discapacidad. @es
broader: LGBTQ+ disabled people
narrower: Gay hard of hearing men
narrower: Gay Deaf men
narrower: Gay blind men
related: Gay men with chronic illnesses
has top concept: LGBTQ+ people
issued: 2022-02-15
modified: 2025-02-23
type: Concept
in scheme: v3
change note: Version 4.1.0

Bisexual disabled people
preferred label: Personas bisexuales discapacitadas @es
alternative label: Bisexual people with disabilities
alternative label: Disabled bisexual people
alternative label: Personas discapacitadas bisexuales @es
alternative label: Personas bisexuales con discapacidades @es
comment: Bisexual people who are disabled.
comment: Personas bisexuales con discapacidad. @es
broader: LGBTQ+ disabled people
narrower: Bisexual hard of hearing people
narrower: Bisexual Deaf people
narrower: Bisexual blind people
related: Bisexual people with chronic illnesses
has top concept: LGBTQ+ people
issued: 2022-02-17
modified: 2025-02-23
type: Concept
in scheme: v3
change note: Version 4.1.0

Transgender disabled people
preferred label: Personas transgénero discapacitadas @es
alternative label: Disabled transgender people
alternative label: Transgender people with disabilities
alternative label: Personas discapacitadas transgénero @es
alternative label: Personas transgénero con discapacidades @es
comment: Transgender people who are disabled.
comment: Personas transgénero con discapacidad. @es
broader: LGBTQ+ disabled people
narrower: Transgender hard of hearing people
narrower: Transgender Deaf people
narrower: Transgender blind people
related: Transgender people with chronic illnesses
has top concept: LGBTQ+ people
issued: 2022-02-17
modified: 2025-02-23
type: Concept
in scheme: v3
change note: Version 4.1.0

Queer disabled people
preferred label: Personas queer discapacitadas @es
alternative label: Disabled queer people
alternative label: Queer people with disabilities
alternative label: Personas discapacitadas queer @es
alternative label: Personas queer con discapacidades @es
comment: Queer people who are disabled.
comment: Personas queer con discapacidad. @es
broader: LGBTQ+ disabled people
narrower: Queer hard of hearing people
narrower: Queer Deaf people
narrower: Queer blind people
related: Queer people with chronic illnesses
has top concept: LGBTQ+ people
issued: 2022-02-17
modified: 2025-02-23
type: Concept
in scheme: v3
change note: Version 4.1.0

LGBTQ+ hard of hearing people
preferred label: Personas LGBTQ+ con problemas de audición @es
alternative label: Hard of hearing people (LGBTQ)
alternative label: Hearing impaired people (LGBTQ)
alternative label: HoH people (LGBTQ)
alternative label: LGBTQ+ HoH people
alternative label: LGBTQ+ hearing impaired people
alternative label: Personas LGBTQ+ con dificultades de audición @es
alternative label: Personas LGBTQ+ con dificultades auditivas @es
comment: LGBTQ+ people with significant or total hearing loss who may or may not consider themselves d/Deaf.
comment: Personas LGBTQ+ con pérdida auditiva significativa o total, que pueden o no considerarse S/sordas. @es
broader: LGBTQ+ disabled people
narrower: Lesbian hard of hearing people
narrower: Gay hard of hearing men
narrower: Bisexual hard of hearing people
narrower: Transgender hard of hearing people
narrower: Queer hard of hearing people
narrower: Asexual hard of hearing people
related: LGBTQ+ Deaf culture
related: Two-Spirit hard of hearing people
has top concept: LGBTQ+ people
issued: 2022-02-17
modified: 2026-02-23
type: Concept
in scheme: v3
change note: Version 4.1.0

Lesbian hard of hearing people
preferred label: Lesbianas con problemas de audición @es
alternative label: Hearing impaired lesbians
alternative label: HoH lesbians
alternative label: Lesbian HoH people
alternative label: Lesbian hearing impaired people
alternative label: Lesbianas con dificultades de audición @es
alternative label: Lesbianas con dificultades auditivas @es
comment: Lesbians with significant or total hearing loss who may or may not consider themselves d/Deaf.
comment: Lesbianas con pérdida auditiva significativa o total que pueden o no considerarse S/sordas. @es
broader: Lesbian disabled people
broader: LGBTQ+ hard of hearing people
related: Lesbian Deaf people
related: LGBTQ+ Deaf culture
has top concept: LGBTQ+ people
issued: 2022-02-17
modified: 2025-02-23
type: Concept
in scheme: v3
change note: Version 4.1.0

Gay hard of hearing men
preferred label: Hombres gay con problemas de audición @es
alternative label: Gay HoH people
alternative label: Hearing impaired gay men
alternative label: HoH gay men
alternative label: Gay HoH men
alternative label: Gay hard of hearing people
alternative label: HoH gay people
alternative label: Gay hearing impaired men
alternative label: Hombres gay con dificultades de audición @es
alternative label: Hombres gay con dificultades auditivas @es
comment: Gay men with significant or total hearing loss who may or may not consider themselves d/Deaf.
comment: Hombres gay con pérdida auditiva significativa o total que pueden o no considerarse S/sordos. @es
broader: Gay disabled men
broader: LGBTQ+ hard of hearing people
related: Gay Deaf men
related: LGBTQ+ Deaf culture
has top concept: LGBTQ+ people
issued: 2022-02-17
modified: 2025-02-23
type: Concept
in scheme: v3
change note: Version 4.1.0

Bisexual hard of hearing people
preferred label: Niñas bisexuales @es
alternative label: Bisexual HoH people
alternative label: Bisexual hearing impaired people
alternative label: Hearing impaired bisexual people
alternative label: HoH bisexual people
comment: Bisexual people with significant or total hearing loss who may or may not consider themselves d/Deaf.
comment: Niñas (normalmente niñas menores de 18 años) que son bisexuales. @es
broader: Bisexual disabled people
broader: LGBTQ+ hard of hearing people
related: Bisexual Deaf people
related: LGBTQ+ Deaf culture
has top concept: LGBTQ+ people
issued: 2022-02-17
modified: 2025-02-23
type: Concept
in scheme: v3
change note: Version 4.1.0

Transgender hard of hearing people
preferred label: Personas transgénero con problemas de audición @es
alternative label: Hearing impaired transgender people
alternative label: HoH transgender people
alternative label: Transgender HoH people
alternative label: Transgender hearing impaired people
alternative label: Personas transgénero con dificultades de audición @es
alternative label: Personas transgénero con dificultades auditivas @es
comment: Transgender people with significant or total hearing loss who may or may not consider themselves d/Deaf.
comment: Personas transgénero con pérdida auditiva significativa o total, que pueden o no considerarse S/sordas. @es
broader: Transgender disabled people
broader: LGBTQ+ hard of hearing people
related: Transgender Deaf people
related: LGBTQ+ Deaf culture
has top concept: LGBTQ+ people
issued: 2022-02-17
modified: 2025-02-23
type: Concept
in scheme: v3
change note: Version 4.1.0

Queer hard of hearing people
preferred label: Personas queer con problemas de audición @es
alternative label: Hearing impaired queer people
alternative label: HoH queer people
alternative label: Queer HoH people
alternative label: Queer hearing impaired people
alternative label: Personas queer con dificultades de audición @es
alternative label: Personas queer con dificultades auditivas @es
comment: Queer people with significant or total hearing loss who may or may not consider themselves d/Deaf.
comment: Personas queer con pérdida auditiva significativa o total, que pueden o no considerarse S/sordas. @es
broader: Queer disabled people
broader: LGBTQ+ hard of hearing people
related: Queer Deaf people
related: LGBTQ+ Deaf culture
has top concept: LGBTQ+ people
issued: 2022-02-17
modified: 2025-02-23
type: Concept
in scheme: v3
change note: Version 4.1.0

LGBTQ+ Deaf people
preferred label: Personas LGBTQ+ sordas @es
alternative label: Deaf people (LGBTQ)
alternative label: Personas sordas (LGBTQ) @es
comment: LGBTQ+ people with significant or total hearing loss. Some but not all Deaf people prefer to capitalize Deaf in recognition of the cultural and linguistic identity they share with other Deaf people.
comment: Personas LGBTQ+ con pérdida auditiva significativa o total. Algunas personas sordas, pero no todas, prefieren escribir “Sorda/o” con mayúscula en reconocimiento de la identidad cultural y lingüística que comparten con otras personas sordas. @es
broader: LGBTQ+ disabled people
narrower: Lesbian Deaf people
narrower: Gay Deaf men
narrower: Bisexual Deaf people
narrower: Transgender Deaf people
narrower: Queer Deaf people
narrower: Asexual Deaf people
related: LGBTQ+ Deaf culture
related: Two-Spirit Deaf people
has top concept: LGBTQ+ people
issued: 2022-02-17
modified: 2026-02-23
type: Concept
in scheme: v3
change note: Version 4.1.0

Lesbian Deaf people
preferred label: Personas lesbianas sordas @es
alternative label: Deaf lesbians
alternative label: Sordas lesbianas @es
comment: Lesbians with significant or total hearing loss. Some but not all Deaf people prefer to capitalize Deaf in recognition of the cultural and linguistic identity they share with other Deaf people.
comment: Lesbianas con pérdida auditiva significativa o total. Algunas personas sordas, pero no todas, prefieren escribir “Sorda/o” con mayúscula en reconocimiento de la identidad cultural y lingüística que comparten con otras personas sordas. @es
broader: Lesbian disabled people
broader: LGBTQ+ Deaf people
related: Lesbian hard of hearing people
related: LGBTQ+ Deaf culture
has top concept: LGBTQ+ people
issued: 2022-02-17
modified: 2025-02-23
type: Concept
in scheme: v3
change note: Version 4.1.0

Gay Deaf men
preferred label: Personas gay sordas @es
alternative label: Deaf gay men
alternative label: Gay Deaf people
alternative label: Deaf gay people
alternative label: Hombres gay sordos @es
comment: Gay men with significant or total hearing loss. Some but not all Deaf people prefer to capitalize Deaf in recognition of the cultural and linguistic identity they share with other Deaf people.
comment: Hombres gay con pérdida auditiva significativa o total. Algunas personas sordas, pero no todas, prefieren escribir “Sorda/o” con mayúscula en reconocimiento de la identidad cultural y lingüística que comparten con otras personas sordas. @es
broader: Gay disabled men
broader: LGBTQ+ Deaf people
related: Gay hard of hearing men
related: LGBTQ+ Deaf culture
has top concept: LGBTQ+ people
issued: 2022-02-17
modified: 2025-02-23
type: Concept
in scheme: v3
change note: Version 4.1.0

Bisexual Deaf people
preferred label: Personas bisexuales sordas @es
alternative label: Deaf bisexual people
alternative label: Sordos bisexuales @es
alternative label: Personas sordas bisexuales @es
alternative label: Sordas bisexuales @es
comment: Bisexual people with significant or total hearing loss. Some but not all Deaf people prefer to capitalize Deaf in recognition of the cultural and linguistic identity they share with other Deaf people.
comment: Personas bisexuales con pérdida auditiva significativa o total. Algunas personas sordas, pero no todas, prefieren escribir “Sorda/o” con mayúscula en reconocimiento de la identidad cultural y lingüística que comparten con otras personas sordas. @es
broader: Bisexual disabled people
broader: LGBTQ+ Deaf people
related: Bisexual hard of hearing people
related: LGBTQ+ Deaf culture
has top concept: LGBTQ+ people
issued: 2022-02-17
modified: 2025-02-23
type: Concept
in scheme: v3
change note: Version 4.1.0

Transgender Deaf people
preferred label: Personas transgénero sordas @es
alternative label: Deaf transgender people
alternative label: Personas sordas transgénero @es
comment: Transgender people with significant or total hearing loss. Some but not all Deaf people prefer to capitalize Deaf in recognition of the cultural and linguistic identity they share with other Deaf people.
comment: Personas transgénero con pérdida auditiva significativa o total. Algunas personas sordas, pero no todas, prefieren escribir “Sorda/o” con mayúscula en reconocimiento de la identidad cultural y lingüística que comparten con otras personas sordas. @es
broader: Transgender disabled people
broader: LGBTQ+ Deaf people
related: Transgender hard of hearing people
related: LGBTQ+ Deaf culture
has top concept: LGBTQ+ people
issued: 2022-02-17
modified: 2025-02-23
type: Concept
in scheme: v3
change note: Version 4.1.0

Queer Deaf people
preferred label: Personas queer sordas @es
alternative label: Deaf queer people
alternative label: Personas sordas queer @es
comment: Queer people with significant or total hearing loss. Some but not all Deaf people prefer to capitalize Deaf in recognition of the cultural and linguistic identity they share with other Deaf people.
comment: Personas queer con pérdida auditiva significativa o total. Algunas personas sordas, pero no todas, prefieren escribir “Sorda/o” con mayúscula en reconocimiento de la identidad cultural y lingüística que comparten con otras personas sordas. @es
broader: Queer disabled people
broader: LGBTQ+ Deaf people
related: Queer hard of hearing people
related: LGBTQ+ Deaf culture
has top concept: LGBTQ+ people
issued: 2022-02-17
modified: 2025-02-23
type: Concept
in scheme: v3
change note: Version 4.1.0

Lesbian blind people
preferred label: Personas lesbianas ciegas @es
alternative label: Blind lesbians
alternative label: Ciegas lesbianas @es
comment: Lesbians with significant or total loss of vision.
comment: Lesbianas con pérdida significativa o total de visión. @es
broader: LGBTQ+ blind people
broader: Lesbian disabled people
has top concept: LGBTQ+ people
issued: 2022-02-17
modified: 2025-02-23
type: Concept
in scheme: v3
change note: Version 4.1.0

Gay blind men
preferred label: Hombres gay ciegos @es
alternative label: Blind gay men
alternative label: Gay blind people
alternative label: Blind gay people
comment: Gay men with significant or total loss of vision.
comment: Hombres gay con pérdida significativa o total de la visión. @es
broader: LGBTQ+ blind people
broader: Gay disabled men
has top concept: LGBTQ+ people
issued: 2022-02-17
modified: 2025-02-23
type: Concept
in scheme: v3
change note: Version 4.1.0

Bisexual blind people
preferred label: Personas bisexuales ciegas @es
alternative label: Blind bisexual people
alternative label: Personas ciegas bisexuales @es
alternative label: Ciegos bisexuales @es
alternative label: Ciegas bisexuales @es
comment: Bisexual people with significant or total loss of vision.
comment: Personas bisexuales con pérdida significativa o total de la visión. @es
broader: LGBTQ+ blind people
broader: Bisexual disabled people
has top concept: LGBTQ+ people
issued: 2022-02-17
modified: 2025-02-23
type: Concept
in scheme: v3
change note: Version 4.1.0

Transgender blind people
preferred label: Personas transgénero ciegas @es
alternative label: Blind transgender people
alternative label: Personas ciegas transgénero @es
comment: Transgender people with significant or total loss of vision.
comment: Personas transgénero con pérdida significativa o total de la visión. @es
broader: LGBTQ+ blind people
broader: Transgender disabled people
has top concept: LGBTQ+ people
issued: 2022-02-17
modified: 2025-02-23
type: Concept
in scheme: v3
change note: Version 4.1.0

Queer blind people
preferred label: Personas queer ciegas @es
alternative label: Blind queer people
alternative label: Personas ciegas queer @es
comment: Queer people with significant or total loss of vision.
comment: Personas queer con pérdida significativa o total de la visión. @es
broader: LGBTQ+ blind people
broader: Queer disabled people
has top concept: LGBTQ+ people
issued: 2022-02-17
modified: 2025-02-23
type: Concept
in scheme: v3
change note: Version 4.1.0

LGBTQ+ wheelchair users
preferred label: Usuarios LGBTQ+ de sillas de ruedas @es
alternative label: Wheelchair users (LGBTQ)
alternative label: Usuarios de sillas de ruedas (LGBTQ) @es
comment: LGBTQ+ people who use wheelchairs.
comment: Personas LGBTQ+ que utilizan sillas de ruedas. @es
broader: LGBTQ+ disabled people
narrower: Lesbian wheelchair users
narrower: Gay wheelchair users
narrower: Bisexual wheelchair users
narrower: Transgender wheelchair users
narrower: Queer wheelchair users
narrower: Asexual wheelchair users
narrower: Intersex wheelchair users
related: Two-Spirit wheelchair users
has top concept: LGBTQ+ people
issued: 2022-02-17
modified: 2025-02-23
type: Concept
in scheme: v3
change note: Version 4.1.0

LGBTQ+ Deaf culture
preferred label: Cultura sorda LGBTQ+ @es
alternative label: Deaf culture (LGBTQ)
alternative label: Cultura sorda (LGBTQ) @es
comment: The community of Deaf LGBTQ+ people who share a cultural and/or linguistic identity.
comment: La comunidad de personas sordas LGBTQ+ que comparten una identidad cultural y/o lingüística. @es
broader: LGBTQ+ communities
related: LGBTQ+ disabled people
related: LGBTQ+ hard of hearing people
related: Lesbian hard of hearing people
related: Gay hard of hearing men
related: Bisexual hard of hearing people
related: Transgender hard of hearing people
related: Queer hard of hearing people
related: LGBTQ+ Deaf people
related: Lesbian Deaf people
related: Gay Deaf men
related: Bisexual Deaf people
related: Transgender Deaf people
related: Queer Deaf people
related: Crip
has top concept: LGBTQ+ communities
issued: 2022-02-17
modified: 2026-02-23
type: Concept
in scheme: v3
change note: Version 4.1.0

LGBTQ+ people with chronic illnesses
preferred label: Personas LGBTQ+ con enfermedades crónicas @es
alternative label: Chronically ill people (LGBTQ)
alternative label: People with chronic illnesses (LGBTQ)
alternative label: Personas con enfermedades crónicas (LGBTQ) @es
alternative label: Enfermos crónicos LGBTQ+ @es
alternative label: Enfermos crónicos (LGBTQ) @es
comment: LGBTQ+ people who have long-term health conditions that require continued medical attention and/or significantly impact or limit daily life; some but not all people with chronic illnesses consider themselves disabled.
comment: Personas LGBTQ+ que tienen condiciones de salud a largo plazo que requieren atención médica continua y/o impactan o limitan significativamente la vida diaria; algunas, pero no todas, las personas con enfermedades crónicas se consideran discapacitadas. @es
broader: LGBTQ+ people
narrower: Lesbians with chronic illnesses
narrower: Gay men with chronic illnesses
narrower: Bisexual people with chronic illnesses
narrower: Transgender people with chronic illnesses
narrower: Queer people with chronic illnesses
narrower: Asexual people with chronic illnesses
narrower: Intersex people with chronic illnesses
related: LGBTQ+ disabled people
related: Crip
related: LGBTQ+ people who use substances for medical purposes
related: Queercrip
related: Two-Spirit people with chronic illnesses
has top concept: LGBTQ+ people
issued: 2022-02-17
modified: 2025-02-23
type: Concept
in scheme: v3
change note: Version 4.1.0

Lesbians with chronic illnesses
preferred label: Lesbianas con enfermedades crónicas @es
alternative label: Chronically ill lesbians
alternative label: Lesbianas enfermas crónicas @es
alternative label: Enfermas crónicas lesbianas @es
comment: Lesbians who have long-term health conditions that require continued medical attention and/or significantly impact or limit daily life; some but not all people with chronic illnesses consider themselves disabled.
comment: Lesbianas que tienen condiciones de salud a largo plazo que requieren atención médica continua y/o impactan o limitan significativamente la vida diaria; algunas, pero no todas, las personas con enfermedades crónicas se consideran discapacitadas. @es
broader: LGBTQ+ people with chronic illnesses
related: Lesbian disabled people
related: Lesbian wheelchair users
has top concept: LGBTQ+ people
issued: 2022-02-17
modified: 2025-02-23
type: Concept
in scheme: v3
change note: Version 4.1.0

Gay men with chronic illnesses
preferred label: Hombres gay de color @es
alternative label: Chronically ill gay men
comment: Gay men who have long-term health conditions that require continued medical attention and/or significantly impact or limit daily life; some but not all people with chronic illnesses consider themselves disabled.
comment: Hombres gay que no son blancos y que se autoidentifican como personas de color. @es
broader: LGBTQ+ people with chronic illnesses
related: Gay disabled men
related: Gay wheelchair users
has top concept: LGBTQ+ people
issued: 2022-02-17
modified: 2025-02-23
type: Concept
in scheme: v3
change note: Version 4.1.0

Bisexual people with chronic illnesses
preferred label: Personas bisexuales en el lugar de trabajo @es
alternative label: Chronically ill bisexual people
comment: Bisexual people who have long-term health conditions that require continued medical attention and/or significantly impact or limit daily life; some but not all people with chronic illnesses consider themselves disabled.
comment: La presencia de personas bisexuales en el lugar de trabajo, incluida la aceptación de los trabajadores bisexuales y los problemas a los que se enfrentan. @es
broader: LGBTQ+ people with chronic illnesses
related: Bisexual disabled people
related: Bisexual wheelchair users
has top concept: LGBTQ+ people
issued: 2022-02-17
modified: 2025-02-23
type: Concept
in scheme: v3
change note: Version 4.1.0

Transgender people with chronic illnesses
preferred label: Personas transgénero con enfermedades crónicas @es
alternative label: Chronically ill transgender people
alternative label: Personas con enfermedades crónicas transgénero @es
alternative label: Enfermos crónicos transgénero @es
alternative label: Enfermas crónicas transgénero @es
comment: Transgender people who have long-term health conditions that require continued medical attention and/or significantly impact or limit daily life; some but not all people with chronic illnesses consider themselves disabled.
comment: Personas transgénero que tienen condiciones de salud a largo plazo que requieren atención médica continua y/o impactan o limitan significativamente la vida diaria; algunas, pero no todas, las personas con enfermedades crónicas se consideran discapacitadas. @es
broader: LGBTQ+ people with chronic illnesses
related: Transgender people
related: Transgender disabled people
related: Transgender wheelchair users
has top concept: LGBTQ+ people
issued: 2022-02-17
modified: 2025-02-23
type: Concept
in scheme: v3
change note: Version 4.1.0

Queer people with chronic illnesses
preferred label: Personas queer con enfermedades crónicas @es
alternative label: Chronically ill queer people
alternative label: Personas con enfermedades crónicas queer @es
alternative label: Enfermos crónicos queer @es
comment: Queer people who have long-term health conditions that require continued medical attention and/or significantly impact or limit daily life; some but not all people with chronic illnesses consider themselves disabled.
comment: Personas queer que tienen condiciones de salud a largo plazo que requieren atención médica continua y/o impactan o limitan significativamente la vida diaria; algunas, pero no todas, las personas con enfermedades crónicas se consideran discapacitadas. @es
broader: LGBTQ+ people with chronic illnesses
related: Queer disabled people
related: Queer wheelchair users
has top concept: LGBTQ+ people
issued: 2022-02-17
modified: 2025-02-23
type: Concept
in scheme: v3
change note: Version 4.1.0

Anti-Two-Spirit discrimination
preferred label: Discriminación anti dos espíritus @es
alternative label: Anti-2S discrimination
alternative label: Anti-Two Spirit discrimination
alternative label: Anti-Two Spirited discrimination
alternative label: Anti-Two-Spirited discrimination
alternative label: Discriminación dos espíritus @es
alternative label: Anti dos espiritus @es
alternative label: Discriminación anti-2S @es
alternative label: Anti 2S @es
alternative label: Discriminación hacia dos espíritus @es
comment: The unjust or prejudicial treatment of Two-Spirit people due to their identity; may include the denial of legal rights, employment, and housing.
comment: El trato injusto o perjudicial hacia las personas Dos Espíritus por su identidad; puede incluir la negación de derechos legales, empleo y vivienda. @es
broader: LGBTQ+ discrimination
related: Intolerance towards LGBTQ+ people
related: LGBTQ+ phobia
related: Trans-exclusionary radical feminism
related: Anti-gender movement
has top concept: LGBTQ+ discrimination
issued: 2022-02-17
modified: 2025-02-23
type: Concept
in scheme: v3
change note: Version 4.1.0

Lesbian wheelchair users
preferred label: Usuarias lesbianas de sillas de ruedas @es
alternative label: Usuarias lésbicas de sillas de ruedas @es
comment: Lesbians who use wheelchairs.
comment: Lesbianas que utilizan sillas de ruedas. @es
broader: LGBTQ+ wheelchair users
related: Lesbians with chronic illnesses
has top concept: LGBTQ+ people
issued: 2022-02-24
modified: 2025-02-23
type: Concept
in scheme: v3
change note: Version 4.1.0

Gay wheelchair users
preferred label: Usuarios gay de sillas de ruedas @es
comment: Gay men who use wheelchairs.
comment: Hombres gay que utilizan sillas de ruedas. @es
broader: LGBTQ+ wheelchair users
related: Gay men with chronic illnesses
has top concept: LGBTQ+ people
issued: 2022-02-24
modified: 2025-02-23
type: Concept
in scheme: v3
change note: Version 4.1.0

Bisexual wheelchair users
preferred label: Usuarios bisexuales de sillas de ruedas @es
comment: Bisexual people who use wheelchairs.
comment: Personas bisexuales que utilizan sillas de ruedas. @es
broader: LGBTQ+ wheelchair users
related: Bisexual people with chronic illnesses
has top concept: LGBTQ+ people
issued: 2022-02-24
modified: 2025-02-23
type: Concept
in scheme: v3
change note: Version 4.1.0

Transgender wheelchair users
preferred label: Usarios transgénero de sillas de ruedas @es
comment: Transgender people who use wheelchairs.
comment: Personas transgénero que utilizan sillas de ruedas. @es
broader: LGBTQ+ wheelchair users
related: Transgender people with chronic illnesses
has top concept: LGBTQ+ people
issued: 2022-02-24
modified: 2025-02-23
type: Concept
in scheme: v3
change note: Version 4.1.0

Queer wheelchair users
preferred label: Usarios queer de sillas de ruedas @es
comment: Queer people who use wheelchairs.
comment: Personas queer que utilizan sillas de ruedas. @es
broader: LGBTQ+ wheelchair users
related: Queer people with chronic illnesses
has top concept: LGBTQ+ people
issued: 2022-02-24
modified: 2025-02-23
type: Concept
in scheme: v3
change note: Version 4.1.0

Crip
comment: A shortened form of the word "cripple" that has been reclaimed by disabled people to express pride and identify their political and community ties. Only use in reference to individuals or organizations that self-identify as crip. Because of the many intersections between crip theory/culture and queer theory/culture, the two are often but not always viewed as related.
broader: Reclaimed terms
narrower: Crip time
related: Queer (Verb)
related: LGBTQ+ disabled people
related: LGBTQ+ Deaf culture
related: LGBTQ+ people with chronic illnesses
related: Queercrip
has top concept: LGBTQ+ slang
issued: 2022-02-24
modified: 2025-04-23
type: Concept
in scheme: v3
change note: Version 4.1.0

Transmisogyny
preferred label: Transmisoginia @es
comment: The intersection of transphobia and misogyny as directed toward trans women and transfeminine people.
comment: La intersección de la transfobia y la misoginia dirigida hacia las mujeres trans y las personas transfemeninas. @es
narrower: Trans-exclusionary radical feminism
related: Anti-transgender discrimination
related: Intolerance towards LGBTQ+ people
related: Misogyny
related: Transphobia
related: Transmisogynoir
related: Misogynoir
related: QTPOC
related: Transfeminism
issued: 2022-02-24
modified: 2025-02-23
type: Concept
in scheme: v3
change note: Version 4.1.0

Anti-intersex discrimination
preferred label: Discriminación anti-intersex @es
comment: The unjust or prejudicial treatment of intersex people due to the fact that they are intersex; may include the denial of legal rights, employment, and housing.
comment: El trato injusto o perjudicial hacia las personas intersexuales por el hecho de ser intersex; puede incluir la negación de derechos legales, empleo y vivienda. @es
broader: LGBTQ+ discrimination
related: Intolerance towards LGBTQ+ people
related: Intersexphobia
related: Anti-gender movement
has top concept: LGBTQ+ discrimination
issued: 2022-02-28
modified: 2025-02-23
type: Concept
in scheme: v3
change note: Version 4.1.0

Neophallus
preferred label: Neofalo @es
comment: A surgically constructed penis; typically made using tissue grafts from other parts of the body.
comment: Un pene construido quirúrgicamente; por lo general, se elabora con tejido injertado de otras partes del cuerpo. @es
broader: Gender-affirming surgery
broader: Penis
related: Transitioning (Gender)
related: Metoidioplasty
related: Scrotoplasty
related: Vaginectomy
related: Phalloplasty
related: Stand-to-Pee devices
has top concept: Medical care
issued: 2022-02-28
modified: 2025-02-23
type: Concept
in scheme: v3
change note: Version 4.1.0

Masquerading
preferred label: Disfrazarte @es
comment: Term used in the 18th and 19th centuries to describe the act of dressing in disguise, often to emulate another gender. Only use in historical contexts.
comment: Término utilizado en los siglos XVIII y XIX para describir el acto de vestirse disfrazado, a menudo para emular a otro género. Utilícese únicamente en contextos históricos. @es
broader: LGBTQ+ historical terms
related: Clothing
related: Crossdressing
related: Drag
related: Transvestism
has top concept: LGBTQ+ historical terms
issued: 2022-02-28
modified: 2025-02-23
type: Concept
in scheme: v3
change note: Version 4.1.0

Endosex
alternative label: Dyadic
alternative label: Non-intersex
alternative label: Perisex
alternative label: No-intersex @es
comment: The state of individuals born with the sexual anatomy, reproductive system, and chromosomes associated with their assigned sex (i.e., not intersex).
comment: El estado de las personas que nacen con la anatomía sexual, el sistema reproductivo y los cromosomas asociados con su sexo asignado (es decir, no intersexual). @es
broader: Sex (Body)
related: Sex assigned at birth
related: Assigned sex
related: Endosex people
has top concept: Sex (Body)
issued: 2022-02-28
modified: 2025-02-23
type: Concept
in scheme: v3
change note: Version 4.1.0

Endosex people
preferred label: Personas endosex @es
alternative label: Dyadic people
alternative label: Non-intersex people
alternative label: Perisex people
alternative label: Personas no-intersex @es
comment: Individuals born with the sexual anatomy, reproductive system, and chromosomes associated with their assigned sex (i.e., people who are not intersex).
comment: Personas que nacen con la anatomía sexual, el sistema reproductivo y los cromosomas asociados con su sexo asignado (es decir, personas que no son intersex). @es
related: Sex assigned at birth
related: Assigned sex
related: Endosex
issued: 2022-02-28
modified: 2025-02-23
type: Concept
in scheme: v3
change note: Version 4.1.0

Studs (Lesbian culture)
preferred label: Studs @es
comment: Masculine identity associated with Black lesbian communities in the United States.
comment: Identidad masculina asociada a las comunidades de lesbianas negras en Estados Unidos. @es
issued: 2022-02-28
modified: 2025-03-20
type: Concept
in scheme: v3
change note: Version 4.1.0

Gender ambiguity
preferred label: Ambigüedad de género @es
comment: Gender expression that does not conform to a single, distinct gender identity.
comment: Expresión de género que no se ajusta a una identidad de género única e inconfundible. @es
broader: Gender expression
related: Gender
related: Gender roles
has top concept: Gender
issued: 2022-02-28
modified: 2025-02-23
type: Concept
in scheme: v3
change note: Version 4.1.0

Reading (LGBTQ+ culture)
preferred label: Lectura (cultura LGBTQ+) @es
alternative label: Reading (cultura LGBTQ+) @es
comment: Slang term used in drag and ballroom communities to describe the act of playfully or wittily insulting someone's appearance or behavior; described by drag queen Dorian Corey as "the art form of the insult."
comment: Término de la jerga utilizado en las comunidades de drag y ballroom para describir el acto de insultar de manera jocosa o ingeniosa la apariencia o el comportamiento de alguien; descrito por la drag queen Dorian Corey como "el arte del insulto". @es
related: Ball culture
related: Drag community
related: Reading (Gender)
related: Queer coding
issued: 2022-02-28
modified: 2025-02-23
type: Concept
in scheme: v3
change note: Version 4.1.0

Passing (Sexuality)
preferred label: Passing (sexualidad) @es
alternative label: Passing (Sexual identity)
alternative label: Passing (Sexual orientation)
alternative label: Pasando @es
alternative label: Pasar desapercibido @es
comment: The ability of a person who is not heterosexual to "pass," or be accepted or regarded as heterosexual by others. "Passing" has historically been used to describe an individual's ability to "pass" as a certain race or ethnicity, though the term was later appropriated by the LGBTQ+ community.
comment: La capacidad de una persona que no es heterosexual de "pasar", ser aceptada o considerada heterosexual por otras personas. "Pasar" se ha utilizado históricamente para describir la capacidad de una persona de "pasar" como una determinada raza o etnia, aunque eventualmente la comunidad LGBTQ+ se apropió del término. @es
related: Passing (Gender)
related: Sexual identity
related: Sexuality
issued: 2022-02-28
modified: 2025-02-23
type: Concept
in scheme: v3
change note: Version 4.1.0

Critical race theory
preferred label: Teoría crítica de la raza @es
alternative label: CRT
comment: A multidiscplinary field of study and intellectual framework used by scholars and activists to examine the intersections of race, class, and law in the United States, as well as to challenge mainstream U.S. liberal approaches to racial justice. Key concepts of CRT include the argument that race is a social construct with no biological basis and that racism and disparate racial outcomes are the result of complex, changing, and often subtle social and institutional dynamics, rather than individuals' explicit and intentional prejudices.
comment: Un campo de estudio multidisciplinario y un marco teórico intelectual utilizado por académicos y activistas para examinar las intersecciones de la raza, la clase y el derecho en los Estados Unidos, así como para desafiar los principales enfoques liberales estadounidenses sobre la justicia racial. Los conceptos claves del CRT incluyen el argumento de que la raza es una construcción social sin base biológica y que el racismo y los resultados raciales dispares son el resultado de dinámicas sociales e institucionales complejas, cambiantes y a menudo sutiles, en lugar de prejuicios explícitos e intencionales de los individuos. @es
broader: Theories
related: Transmisogynoir
related: Racism
related: Anti-Blackness
related: Anti-racism
related: White time
has top concept: Theories
issued: 2022-03-29
modified: 2025-04-23
type: Concept
in scheme: v3
change note: Version 4.1.0

Transmisogynoir
preferred label: Transmisoginoir @es
comment: Term coined by coined by Trudy of the womanist blog Gradient Lair to describe the intersection of transphobia, misogyny, and anti-Black racism as directed toward Black trans women.
comment: Término acuñado por Trudy del blog mujerista Gradient Lair para describir la intersección de la transfobia, la misoginia y el racismo anti-negro dirigido hacia las mujeres trans negras. @es
related: Anti-transgender discrimination
related: Intolerance towards LGBTQ+ people
related: Misogyny
related: Transphobia
related: Transmisogyny
related: Critical race theory
related: Misogynoir
related: Racism
related: Anti-Blackness
issued: 2022-03-29
modified: 2025-02-23
type: Concept
in scheme: v3
change note: Version 4.1.0

Misogynoir
preferred label: Misoginia negra @es
alternative label: Misoginia hacia las mujeres negras @es
comment: Term coined by scholar Moya Bailey to describe the intersection of misogyny and anti-Black racism as directed toward Black women.
comment: El término original en inglés "misogynoir" fue acuñado por la académica Moya Bailey para describir la intersección de la misoginia y el racismo anti-negro dirigido hacia las mujeres negras. @es
related: Misogyny
related: Transmisogyny
related: Transmisogynoir
related: Racism
related: Anti-Blackness
issued: 2022-03-29
modified: 2025-02-23
type: Concept
in scheme: v3
change note: Version 4.1.0

Zaps
comment: Popularized by the gay liberation group Gays Activists Alliance, zaps are public demonstrations focused on confronting or embarrassing specific politicians or public officials while calling attention to the liberation movement.
comment: Popularizados por el grupo de liberación gay Alianza de Activistas Gay, los zaps son manifestaciones públicas centradas en confrontar o avergonzar a políticos o funcionarios públicos específicos mientras llaman atención sobre el movimiento de liberación. @es
broader: LGBTQ+ demonstrations
related: LGBTQ+ political activists
related: LGBTQ+ movement
has top concept: LGBTQ+ activism
issued: 2022-03-29
modified: 2025-02-23
type: Concept
in scheme: v3
change note: Version 4.1.0

Drag performers
preferred label: Intérpretes de drag @es
comment: Performers who dress and/or use makeup to produce, emphasize, and/or exaggerate traits associated with a certain gender, which may or may not be the gender the performer primarily identifies with.
comment: Artistas que se visten y/o utilizan maquillaje para producir, enfatizar y/o exagerar rasgos asociados con un determinado género, que puede o no ser el género con el que el artista se identifica principalmente. @es
related: Drag
related: Drag community
related: Drag kings
related: Drag queens
related: Drag shows
related: Drag pageants
issued: 2022-03-29
modified: 2025-02-23
type: Concept
in scheme: v3
change note: Version 4.1.0

LGBTQ+ witches
preferred label: Brujas LGBTQ+ @es
alternative label: LGBTQ+ Wiccans
comment: LGBTQ+ practitioners of Wicca or other Pagan religions who self-identify as witches.
comment: Practicantes LGBTQ+ de Wicca u otras religiones paganas que se autoidentifican como brujas. @es
broader: LGBTQ+ Pagans
narrower: Lesbian witches
narrower: Gay witches
narrower: Bisexual witches
narrower: Transgender witches
narrower: Queer witches
narrower: Intersex witches
narrower: Asexual witches
related: Goddess movement
has top concept: LGBTQ+ African religions
issued: 2022-03-29
modified: 2025-02-23
type: Concept
in scheme: v3
change note: Version 4.1.0

Lesbian witches
preferred label: Brujas lesbianas @es
alternative label: Lesbian Wiccans
alternative label: Witches (Lesbians)
alternative label: Brujas (lesbianas) @es
comment: Lesbians who practice Wicca or other Pagan religions and self-identify as witches.
comment: Lesbianas que practican Wicca u otras religiones paganas y se autoidentifican como brujas. @es
broader: LGBTQ+ witches
related: Goddess movement
related: Lesbian Pagans
has top concept: LGBTQ+ African religions
issued: 2022-03-29
modified: 2025-02-23
type: Concept
in scheme: v3
change note: Version 4.1.0

Gay witches
preferred label: Brujos gay @es
alternative label: Gay Wiccans
alternative label: Brujas gay @es
comment: Gay men who practice Wicca or other Pagan religions and self-identify as witches.
comment: Hombres gay que practican Wicca u otras religiones paganas y que se autoidentifican como brujos. @es
broader: LGBTQ+ witches
related: Gay Pagans
related: Goddess movement
has top concept: LGBTQ+ African religions
issued: 2022-03-29
modified: 2025-02-23
type: Concept
in scheme: v3
change note: Version 4.1.0

Bisexual witches
preferred label: Bruja/os bisexuales @es
alternative label: Bisexual Wiccans
alternative label: Wiccanos bisexuales @es
alternative label: Wiccanas bisexuales @es
comment: Bisexual practitioners of Wicca or other Pagan religions who self-identify as witches.
comment: Practicantes bisexuales de Wicca u otras religiones paganas que se autoidentifican como brujas. @es
broader: LGBTQ+ witches
related: Bisexual Pagans
related: Goddess movement
has top concept: LGBTQ+ African religions
issued: 2022-03-29
modified: 2025-02-23
type: Concept
in scheme: v3
change note: Version 4.1.0

Transgender witches
preferred label: Brujas transgénero @es
alternative label: Transgender Wiccans
comment: Transgender practitioners of Wicca or other Pagan religions who self-identify as witches.
comment: Practicantes transgénero de Wicca u otras religiones paganas que se autoidentifican como brujas. @es
broader: LGBTQ+ witches
related: Goddess movement
related: Transgender Pagans
has top concept: LGBTQ+ African religions
issued: 2022-03-29
modified: 2025-02-23
type: Concept
in scheme: v3
change note: Version 4.1.0

Queer witches
preferred label: Brujas queer @es
alternative label: Queer Wiccans
alternative label: Wiccanos queer @es
comment: Queer practitioners of Wicca or other Pagan religions who self-identify as witches.
comment: Practicantes queer de Wicca u otras religiones paganas que se autoidentifican como brujas. @es
broader: LGBTQ+ witches
related: Goddess movement
related: Queer Pagans
has top concept: LGBTQ+ African religions
issued: 2022-03-29
modified: 2025-02-23
type: Concept
in scheme: v3
change note: Version 4.1.0

Intersex witches
preferred label: Brujas intersex @es
alternative label: Intersex Wiccans
comment: Intersex practitioners of Wicca or other Pagan religions who self-identify as witches.
comment: Practicantes intersex de Wicca u otras religiones paganas que se autoidentifican como brujas. @es
broader: LGBTQ+ witches
related: Goddess movement
has top concept: LGBTQ+ African religions
issued: 2022-03-29
modified: 2025-02-23
type: Concept
in scheme: v3
change note: Version 4.1.0

Two-Spirit identity
preferred label: Identidad dos espíritus @es
alternative label: 2S identity
alternative label: Two Spirit identity
alternative label: Two Spirited identity
alternative label: Two-Spirited identity
comment: Identity term used by Indigenous people in North America to reconnect with the multiple gender and sexual roles in Indigenous cultures.
comment: Término de identidad utilizado por las comunidades indígenas de Norteamérica para reconectar con los múltiples roles de género y sexuales de las culturas indígenas. @es
broader: Non-Euro-American gender and sexual identities
related: Berdache
related: Native American LGBTQ+ people
related: Appropriation of Two-Spirit identity
has top concept: Gender
issued: 2022-03-29
modified: 2025-02-23
type: Concept
in scheme: v3
change note: Version 4.1.0

Monosexual people
preferred label: Personas monosexuales @es
alternative label: Monosexuals
alternative label: Monosexuales @es
comment: Individuals who are attracted to only one gender; includes gay people and straight people.
comment: Personas que se sienten atraídas por un solo género; incluye a personas homosexuales y heterosexuales. @es
related: Heterosexuals
related: Homosexuals
related: Sexual identity
related: Sexual orientation
related: Sexual preference
related: Mononormativity
related: Monosexuality
issued: 2022-03-31
modified: 2025-02-23
type: Concept
in scheme: v3
change note: Version 4.1.0

Monogamous people
preferred label: Personas monógamas @es
comment: Individuals who engage in sexual or romantic relationships with only one person at a time.
comment: Personas que mantienen relaciones sexuales o románticas con una sola persona a la vez. @es
related: Monogamy
related: Partner preference
related: Sexual relationships
related: Mononormativity
related: Compulsory monogamy
related: Monogamish
issued: 2022-03-31
modified: 2025-02-23
type: Concept
in scheme: v3
change note: Version 4.1.0

Allosexual people
preferred label: Personas alosexuales @es
comment: Individuals who generally experience sexual attraction or the desire for partnered sexual experiences.
comment: Personas que generalmente experimentan atracción sexual o deseo de tener experiencias sexuales en pareja. @es
related: Sexual preference
related: Sexual relationships
related: Allosexuality
related: Compulsory sexuality
issued: 2022-03-31
modified: 2025-02-23
type: Concept
in scheme: v3
change note: Version 4.1.0

Transgenderqueer identity
preferred label: Identidad transgenderqueer @es
alternative label: Transgenderqueerness
alternative label: Transgéneroqueer @es
comment: Identity term used to describe the intersection of trans identity and genderqueer identity.
comment: Término identitario utilizado para describir la intersección de la identidad trans y la identidad genderqueer. @es
broader: Gender identity
related: Transgender people
related: Transgenderqueer people
has top concept: Gender
issued: 2022-03-31
modified: 2025-02-23
type: Concept
in scheme: v3
change note: Version 4.1.0

Polysexual people
preferred label: Personas polisexuales @es
alternative label: Polysexuals
alternative label: Polisexuales @es
comment: Individuals who experience sexual attraction to more than one gender; includes bisexual and pansexual people.
comment: Personas que sienten atracción sexual por más de un género; incluye personas bisexuales y pansexuales. @es
broader: Bi+ people
broader: LGBTQ+ people
related: Bisexuality
related: Polysexuality
has top concept: LGBTQ+ people
issued: 2022-03-31
modified: 2025-02-23
type: Concept
in scheme: v3
change note: Version 4.1.0

Non-binary identity
preferred label: Identidad no binaria @es
alternative label: Nonbinary identity
alternative label: Identidad no-binaria @es
comment: Gender identity that exists outside of the gender binary; may be used as a specific gender identity or as an umbrella term in the Euro-American gender system for gender identities outside of the gender binary.
comment: Identidad de género que existe fuera del binario de género; puede utilizarse como una identidad de género específica o como un término general en el sistema de género euroamericano para identidades de género fuera del binario de género. @es
broader: Gender identity
related: Non-binary people
has top concept: Gender
issued: 2022-03-31
modified: 2025-02-23
type: Concept
in scheme: v3
change note: Version 4.1.0

Genderqueer identity
preferred label: Identidad genderqueer @es
alternative label: Genderqueerness
alternative label: Variante de género @es
alternative label: Género de amplia gama @es
comment: Gender identity that does not conform to the gender binary and emphasizes alignment with queer politics.
comment: Identidad de género que no se conforma al binario de género y enfatiza la alineación con la política queer. @es
broader: Gender identity
related: Genderqueer people
related: Queer people
related: Transgender people
related: Transgenderqueer people
has top concept: Gender
issued: 2022-03-31
modified: 2025-02-23
type: Concept
in scheme: v3
change note: Version 4.1.0

Gender non-conforming identity
preferred label: Identidad de género no conformista @es
alternative label: Gender nonconforming identity
alternative label: Gender-nonconforming identity
alternative label: Identidad de género no conforme @es
comment: Gender identity that does not conform to the gender binary, not to be confused with gender non-conforming practices engaged in by cisgender people.
comment: Identidad de género que no se conforma al binario de género, que no debe confundirse con las prácticas no conformes con el género que practican las personas cisgénero. @es
broader: Gender identity
related: Gender non-conforming people
related: Transgender people
related: Gender creative
related: Criminalization of gender non-conformity
has top concept: Gender
issued: 2022-03-31
modified: 2025-02-23
type: Concept
in scheme: v3
change note: Version 4.1.0

Demigender identity
preferred label: Identidad demigénero @es
comment: Umbrella term for gender identities that emphasize a partial connection to a certain gender or concept of gender.
comment: Término general para identidades de género que enfatizan una conexión parcial con un determinado género o concepto de género. @es
broader: Gender identity
related: Demigender people
related: Demisexuality
related: Demigirls
related: Demiboys
has top concept: Gender
issued: 2022-03-31
modified: 2025-02-23
type: Concept
in scheme: v3
change note: Version 4.1.0

Cissexuality
preferred label: Cisexualidad @es
comment: Term used to describe people who identify with the sex they were assigned at birth.
comment: Término utilizado para describir a las personas que se autoidentifican con el sexo que les fue asignado al nacer. @es
related: Cissexual people
related: Cisgender identity
issued: 2022-03-31
modified: 2025-02-23
type: Concept
in scheme: v3
change note: Version 4.1.0

Cisgender identity
preferred label: Identidad cisgénero @es
alternative label: Cis identity
alternative label: Identidad cis @es
comment: Term used to describe the identity of people who identify with the sex or gender they were assigned at birth.
comment: Término utilizado para describir la identidad de las personas que se autoidentifican con el sexo o género que les fue asignado al nacer. @es
broader: Gender identity
related: Cisgender men
related: Cisgender people
related: Cisgender women
related: Cissexuality
has top concept: Gender
issued: 2022-03-31
modified: 2025-02-23
type: Concept
in scheme: v3
change note: Version 4.1.0

Pansexuality
preferred label: Pansexualidad @es
comment: Sexual identity used to describe sexual and/or romantic attraction to people of all genders.
comment: Identidad sexual utilizada para describir la atracción sexual y/o romántica hacia personas de todos los géneros. @es
broader: Sexual identity
broader: Sexual orientation
broader: Polysexuality
related: Pansexual people
has top concept: Sexual identity
issued: 2022-03-31
modified: 2025-02-23
type: Concept
in scheme: v3
change note: Version 4.1.0

Agender identity
preferred label: Identidad agénero @es
comment: Identity term used to describe people who do not have genders or who identify with genderlessness.
comment: Término de identidad utilizado para describir a personas que no tienen género o que se autoidentifiquen con la falta de género. @es
broader: Gender identity
related: Agender people
has top concept: Gender
issued: 2022-03-31
modified: 2025-02-23
type: Concept
in scheme: v3
change note: Version 4.1.0

BIPOC
alternative label: Black, Indigenous, and people of color
alternative label: Black, Indigenous, and people of colour
alternative label: Personas negras, indígenas y de color @es
comment: Acronym primarily used in the United States to describe Black, Indigenous, and people of color as a group, while also centering the specific experiences of Black and Indigenous people.
comment: Acrónimo utilizado principalmente en los Estados Unidos para describir a personas negras, indígenas y de color como grupo, centrando, a la vez, en las experiencias específicas de las personas negras e indígenas. @es
related: Black LGBTQ+ people
related: LGBTQ+ people of color
related: QTPOC
issued: 2022-04-18
modified: 2025-02-23
type: Concept
in scheme: v3
change note: Version 4.1.0

LGBTQ+ athletes
preferred label: Atletas LGBTQ+ @es
alternative label: LGBTQ+ sports players
alternative label: LGBTQ+ sportspeople
alternative label: LGBTQ+ sportspersons
alternative label: Atletas (LGBTQ) @es
alternative label: Deportistas (LGBTQ) @es
alternative label: Deportistas LGBTQ+ @es
alternative label: Deportistas LGBTQ @es
alternative label: Jugadores deportivos LGBTQ+ @es
comment: Professional or amateur sports players who self-identify as LGBTQ+.
comment: Deportistas profesionales o aficionados que se autoidentifican como LGBTQ+. @es
broader: LGBTQ+ people
narrower: Lesbian athletes
narrower: Gay athletes
narrower: Bisexual athletes
narrower: Transgender athletes
narrower: Queer athletes
narrower: Intersex athletes
narrower: Non-binary athletes
related: Eurogames
related: LGBTQ+ sports clubs
related: Two-Spirit athletes
has top concept: LGBTQ+ people
issued: 2022-05-03
modified: 2026-02-24
type: Concept
in scheme: v3
change note: Version 4.1.0

Lesbian athletes
preferred label: Atletas lesbianas @es
alternative label: Lesbian sports players
alternative label: Lesbian sportspeople
alternative label: Lesbian sportspersons
alternative label: Lesbian sportswomen
alternative label: Jugadoras deportivas lesbianas @es
alternative label: Deportistas lesbianas @es
comment: Professional or amateur/recreational sports players who self-identify as lesbians.
comment: Jugadoras de deportes profesionales o amateurs/recreativas que se autoidentifican como lesbianas. @es
broader: LGBTQ+ athletes
related: Lesbian sports clubs
has top concept: LGBTQ+ people
issued: 2022-05-03
modified: 2026-02-24
type: Concept
in scheme: v3
change note: Version 4.1.0

Gay athletes
preferred label: Atletas gay @es
alternative label: Gay sports players
alternative label: Gay sportsmen
alternative label: Gay sportspeople
alternative label: Gay sportspersons
alternative label: Jugadores deportivos gay @es
alternative label: Deportistas gay|| @es
comment: Professional or amateur/recreational sports players who self-identify as gay men.
comment: Jugadores de deportes profesionales o aficionados/recreativos que se autoidentifican como hombres gay. @es
broader: LGBTQ+ athletes
related: Gay sports clubs
has top concept: LGBTQ+ people
issued: 2022-05-03
modified: 2026-02-24
type: Concept
in scheme: v3
change note: Version 4.1.0

Bisexual athletes
preferred label: Atletas bisexuales @es
alternative label: Bisexual sports players
alternative label: Bisexual sportspeople
alternative label: Bisexual sportspersons
alternative label: Jugadores deportivos bisexuales @es
alternative label: Jugadoras deportivas bisexuales @es
alternative label: Deportistas bisexuales @es
comment: Professional or amateur/recreational sports players who are bisexual.
comment: Deportistas profesionales o aficionados/recreativos que sean bisexuales. @es
broader: LGBTQ+ athletes
has top concept: LGBTQ+ people
issued: 2022-05-03
modified: 2026-02-24
type: Concept
in scheme: v3
change note: Version 4.1.0

Transgender athletes
preferred label: Atletas transgénero @es
alternative label: Transgender sports players
alternative label: Transgender sportspeople
alternative label: Transgender sportspersons
alternative label: Jugadores de deportes transgénero @es
alternative label: Deportistas transgénero @es
comment: Professional or recreational sports players who self-identify as transgender.
comment: Jugadores de deportes profesionales o recreativos que se autoidentifican como transgénero. @es
broader: LGBTQ+ athletes
related: Sports bans
has top concept: LGBTQ+ people
issued: 2022-05-03
modified: 2026-02-24
type: Concept
in scheme: v3
change note: Version 4.1.0

Queer athletes
preferred label: Atletas queer @es
alternative label: Queer sports players
alternative label: Queer sportspeople
alternative label: Queer sportspersons
alternative label: Jugadores deportivos queer @es
alternative label: Deportistas queer || @es
comment: Professional or recreational sports players who self-identify as queer.
comment: Deportistas profesionales o recreativos que se identifican como queer. @es
broader: LGBTQ+ athletes
has top concept: LGBTQ+ people
issued: 2022-05-03
modified: 2026-02-24
type: Concept
in scheme: v3
change note: Version 4.1.0

Intersex athletes
preferred label: Atletas intersex @es
alternative label: Intersex sports players
alternative label: Intersex sportspeople
alternative label: Intersex sportspersons
alternative label: Jugadores deportivos intersex @es
alternative label: Deportistas intersex|| @es
comment: Professional or amateur sports players who are intersex.
comment: Deportistas profesionales o aficionados que sean intersex. @es
broader: LGBTQ+ athletes
has top concept: LGBTQ+ people
issued: 2022-05-03
modified: 2026-02-24
type: Concept
in scheme: v3
change note: Version 4.1.0

Two-Spirit athletes
preferred label: Atletas dos espíritus @es
alternative label: 2S athletes
alternative label: Two Spirited athletes
alternative label: Two-Spirit sports players
alternative label: Two-Spirit sportspeople
alternative label: Two-Spirit sportspersons
alternative label: Two-Spirited athletes
alternative label: Jugadores de deportes dos espíritus @es
alternative label: Deportistas dos espíritus @es
comment: Professional or recreational sports players who self-identify as Two-Spirit.
comment: Jugadores de deportes profesionales o recreativos que se autoidentifican como dos espíritus. @es
broader: Two-Spirit people
related: LGBTQ+ athletes
has top concept: Gender
issued: 2022-05-03
modified: 2026-02-24
type: Concept
in scheme: v3
change note: Version 4.1.0

Pacific Islander American lesbians
preferred label: Lesbianas del Pacífico estadounidenses @es
alternative label: Lesbian Pacific Islander Americans
alternative label: Personas del Pacífico estadounidenses lesbianas @es
comment: Lesbians who identify as both Pacific Islanders (or of Pacific Islander ancestry) and American.
comment: Lesbianas que se identifican a la vez como isleñas del Pacífico (o de ascendencia isleña del Pacífico) y estadounidenses. @es
broader: Pacific Islander American LGBTQ+ people
has top concept: LGBTQ+ people
issued: 2022-05-10
modified: 2025-02-23
type: Concept
in scheme: v3
change note: Version 4.1.0

Pacific Islander American gay men
preferred label: Hombres gay del Pacífico estadounidenses @es
alternative label: Gay Pacific Islander American men
alternative label: Gay Pacific Islander Americans
alternative label: Hombres del Pacífico estadounidenses gay @es
comment: Gay men who identify as both Pacific Islanders (or of Pacific Islander ancestry) and American.
comment: Hombres gay que se identifican a la vez como isleños del Pacífico (o de ascendencia isleña del Pacífico) y estadounidenses. @es
broader: Pacific Islander American LGBTQ+ people
has top concept: LGBTQ+ people
issued: 2022-05-10
modified: 2025-02-23
type: Concept
in scheme: v3
change note: Version 4.1.0

Pacific Islander American bisexual people
preferred label: Personas bisexuales del Pacífico estadounidenses @es
alternative label: Bisexual Pacific Islander American people
alternative label: Bisexual Pacific Islander Americans
alternative label: Personas del Pacífico estadounidenses bisexuales @es
comment: Bisexual people who identify as both Pacific Islanders (or of Pacific Islander ancestry) and American.
comment: Personas bisexuales que se identifican a la vez como isleñas del Pacífico (o de ascendencia isleña del Pacífico) y estadounidenses. @es
broader: Pacific Islander American LGBTQ+ people
has top concept: LGBTQ+ people
issued: 2022-05-10
modified: 2025-02-23
type: Concept
in scheme: v3
change note: Version 4.1.0

Pacific Islander American transgender people
preferred label: Personas transgénero del Pacífico estadounidense @es
alternative label: Transgender Pacific Islander American people
alternative label: Transgender Pacific Islander Americans
alternative label: Personas del Pacífico estadounidense transgénero @es
comment: Transgender people who identify as both Pacific Islanders (or of Pacific Islander ancestry) and American.
comment: Personas transgénero que se identifican a la vez como isleñas del Pacífico (o de ascendencia isleña del Pacífico) y estadounidenses. @es
broader: Pacific Islander American LGBTQ+ people
has top concept: LGBTQ+ people
issued: 2022-05-10
modified: 2025-02-23
type: Concept
in scheme: v3
change note: Version 4.1.0

Pacific Islander American queer people
preferred label: Personas queer del Pacífico estadounidenses @es
alternative label: Queer Pacific Islander American people
alternative label: Queer Pacific Islander Americans
alternative label: Personas del Pacífico estadounidenses queer @es
comment: Queer people who identify as both Pacific Islanders (or of Pacific Islander ancestry) and American.
comment: Personas queer que se identifican a la vez como isleñas del Pacífico (o de ascendencia isleña del Pacífico) y estadounidenses. @es
broader: Pacific Islander American LGBTQ+ people
has top concept: LGBTQ+ people
issued: 2022-05-10
modified: 2025-02-23
type: Concept
in scheme: v3
change note: Version 4.1.0

Pacific Islander American intersex people
preferred label: Personas intersexuales del Pacífico estadounidenses @es
alternative label: Intersex Pacific Islander American people
alternative label: Intersex Pacific Islander Americans
alternative label: Personas intersex del Pacífico estadounidenses @es
comment: Intersex people who identify as both Pacific Islanders (or of Pacific Islander ancestry) and American.
comment: Personas intersexuales que se identifican a la vez como isleñas del Pacífico (o de ascendencia isleña del Pacífico) y estadounidenses. @es
broader: Pacific Islander American LGBTQ+ people
broader: Indigenous intersex people
related: Kānaka Maoli intersex people
has top concept: LGBTQ+ people
issued: 2022-05-10
modified: 2025-02-23
type: Concept
in scheme: v3
change note: Version 4.1.0

Papuan lesbians
preferred label: Lesbianas papúes @es
alternative label: Lesbian Papuans
alternative label: Papúes lesbianas @es
comment: Lesbians who are Papuan, or part of the Indigenous peoples of new Guinea; only use for people who identify as Papuan.
comment: Lesbianas que son papúes o parte de los pueblos indígenas de Nueva Guinea. Utilícese únicamente para personas que se autoidentifiquen como papúes. @es
broader: Papuan LGBTQ+ people
has top concept: LGBTQ+ people
issued: 2022-05-11
modified: 2025-02-23
type: Concept
in scheme: v3
change note: Version 4.1.0

Papuan gay men
preferred label: Hombres gay papúes @es
alternative label: Gay Papuan men
alternative label: Gay Papuans
alternative label: Hombres papúes gay @es
comment: Gay men who are Papuan, or part of the Indigenous peoples of new Guinea; only use for people who identify as Papuan.
comment: Hombres gay que son papúes o parte de los pueblos indígenas de Nueva Guinea. Utilícese únicamente para personas que se autoidentifiquen como papúes. @es
broader: Papuan LGBTQ+ people
has top concept: LGBTQ+ people
issued: 2022-05-11
modified: 2025-02-23
type: Concept
in scheme: v3
change note: Version 4.1.0

Papuan bisexual people
preferred label: Personas bisexuales papúes @es
alternative label: Bisexual Papuan people
alternative label: Bisexual Papuans
alternative label: Personas papúes bisexuales @es
comment: Bisexual people who are Papuan, or part of the Indigenous peoples of new Guinea; only use for people who identify as Papuan.
comment: Personas bisexuales que son papúes o parte de los pueblos indígenas de Nueva Guinea. Utilícese únicamente para personas que se autoidentifiquen como papúes. @es
broader: Papuan LGBTQ+ people
has top concept: LGBTQ+ people
issued: 2022-05-11
modified: 2025-02-23
type: Concept
in scheme: v3
change note: Version 4.1.0

Papuan transgender people
preferred label: Personas transgénero papúes @es
alternative label: Transgender Papuan people
alternative label: Transgender Papuans
alternative label: Personas papúes transgénero @es
comment: Transgender people who are Papuan, or part of the Indigenous peoples of new Guinea; only use for people who identify as Papuan.
comment: Personas transgénero que son papúes o parte de los pueblos indígenas de Nueva Guinea. Utilícese únicamente para personas que se autoidentifiquen como papúes. @es
broader: Papuan LGBTQ+ people
has top concept: LGBTQ+ people
issued: 2022-05-11
modified: 2025-02-23
type: Concept
in scheme: v3
change note: Version 4.1.0

Papuan queer people
preferred label: Personas queer papúes @es
alternative label: Queer Papuan people
alternative label: Queer Papuans
alternative label: Personas papúes queer @es
comment: Queer people who are Papuan, or part of the Indigenous peoples of new Guinea; only use for people who identify as Papuan.
comment: Personas queer que son papúes o parte de los pueblos indígenas de Nueva Guinea. Utilícese únicamente para personas que se autoidentifiquen como papúes. @es
broader: Papuan LGBTQ+ people
has top concept: LGBTQ+ people
issued: 2022-05-11
modified: 2025-02-23
type: Concept
in scheme: v3
change note: Version 4.1.0

Papuan intersex people
preferred label: Personas intersexuales papúes @es
alternative label: Intersex Papuan people
alternative label: Intersex Papuans
alternative label: Personas intersex papúes @es
alternative label: Personas papúes intersexuales @es
comment: Intersex people who are Papuan, or part of the Indigenous peoples of new Guinea; only use for people who identify as Papuan.
comment: Personas intersexuales que son papúes o parte de los pueblos indígenas de Nueva Guinea. Utilícese únicamente para personas que se autoidentifiquen como papúes. @es
broader: Papuan LGBTQ+ people
has top concept: LGBTQ+ people
issued: 2022-05-11
modified: 2025-02-23
type: Concept
in scheme: v3
change note: Version 4.1.0

Romani lesbians
preferred label: Lesbianas romaníes @es
alternative label: Lesbian Roma
alternative label: Lesbian Romanis
alternative label: Lesbian Romany
alternative label: Roma lesbians
alternative label: Romany lesbians
alternative label: Romaníes lesbianas @es
comment: Lesbians who are Romani, or part of the traditionally nomadic Indo-European people.
comment: Lesbianas que son romaníes o parte del pueblo indoeuropeo tradicionalmente nómada. @es
broader: Romani LGBTQ+ people
has top concept: LGBTQ+ people
issued: 2022-05-11
modified: 2026-02-23
type: Concept
in scheme: v3
change note: Version 4.1.0

Romani gay men
preferred label: Hombres gay romaníes @es
alternative label: Gay Roma
alternative label: Gay Romanis
alternative label: Gay Romany
alternative label: Roma gay men
alternative label: Romany gay men
alternative label: Hombres romaníes gay @es
comment: Gay men who are Romani, or part of the traditionally nomadic Indo-European people.
comment: Hombres gay que son romaníes o parte del pueblo indoeuropeo tradicionalmente nómada. @es
broader: Romani LGBTQ+ people
has top concept: LGBTQ+ people
issued: 2022-05-11
modified: 2026-02-23
type: Concept
in scheme: v3
change note: Version 4.1.0

Romani bisexual people
preferred label: Personas bisexuales romaníes @es
alternative label: Bisexual Roma
alternative label: Bisexual Romanis
alternative label: Bisexual Romany
alternative label: Roma bisexual people
alternative label: Romany bisexual people
alternative label: Personas romaníes bisexuales @es
comment: Bisexual people who are Romani, or part of the traditionally nomadic Indo-European people.
comment: Personas bisexuales que son romaníes o parte del pueblo indoeuropeo tradicionalmente nómada. @es
broader: Romani LGBTQ+ people
has top concept: LGBTQ+ people
issued: 2022-05-11
modified: 2026-02-23
type: Concept
in scheme: v3
change note: Version 4.1.0

Romani transgender people
preferred label: Personas transgénero romaníes @es
alternative label: Roma transgender people
alternative label: Romany transgender people
alternative label: Transgender Roma
alternative label: Transgender Romanis
alternative label: Transgender Romany
alternative label: Personas romaníes transgénero @es
comment: Transgender people who are Romani, or part of the traditionally nomadic Indo-European people.
comment: Personas transgénero que son romaníes o parte del pueblo indoeuropeo tradicionalmente nómada. @es
broader: Romani LGBTQ+ people
has top concept: LGBTQ+ people
issued: 2022-05-11
modified: 2026-02-23
type: Concept
in scheme: v3
change note: Version 4.1.0

Romani queer people
preferred label: Personas queer romaníes @es
alternative label: Queer Roma
alternative label: Queer Romanis
alternative label: Queer Romany
alternative label: Roma queer people
alternative label: Romany queer people
alternative label: Personas romaníes queer @es
comment: Queer people who are Romani, or part of the traditionally nomadic Indo-European people.
comment: Personas queer que son romaníes o parte del pueblo indoeuropeo tradicionalmente nómada. @es
broader: Romani LGBTQ+ people
has top concept: LGBTQ+ people
issued: 2022-05-11
modified: 2026-02-23
type: Concept
in scheme: v3
change note: Version 4.1.0

Romani intersex people
preferred label: Personas intersexuales romaníes @es
alternative label: Intersex Roma
alternative label: Intersex Romanis
alternative label: Intersex Romany
alternative label: Roma intersex people
alternative label: Romany intersex people
alternative label: Personas romaníes intersexuales @es
alternative label: Personas intersex romaníes @es
alternative label: Personas romaníes intersex @es
comment: Intersex people who are Romani, or part of the traditionally nomadic Indo-European people.
comment: Personas intersexuales que son romaníes o parte del pueblo indoeuropeo tradicionalmente nómada. @es
broader: Romani LGBTQ+ people
has top concept: LGBTQ+ people
issued: 2022-05-11
modified: 2026-02-23
type: Concept
in scheme: v3
change note: Version 4.1.0

Kānaka Maoli LGBTQ+ people
preferred label: Personas LGBTQ+ kānaka maoli @es
alternative label: Indigenous Hawaiian LGBTQ+ people
alternative label: Indigenous Hawaiians (LGBTQ)
alternative label: Kānaka Maoli (LGBTQ)
alternative label: Kānaka Maoli people (LGBTQ)
alternative label: LGBTQ+ Indigenous Hawaiians
alternative label: LGBTQ+ Kānaka Maoli
alternative label: LGBTQ+ Kānaka ʻŌiwi
alternative label: LGBTQ+ Native Hawaiians
alternative label: Native Hawaiian LGBTQ+ people
alternative label: Native Hawaiians (LGBTQ)
comment: LGBTQ+ people who are part of the Indigenous people of Mokupuni o Hawai‘i, or the Hawaiian Islands; only use to refer to people who identify as Kanaka Maoli.
comment: Personas LGBTQ+ que pertenecen al pueblo indígena mokupuni o hawai‘i, o a las islas hawaianas. Utilícese únicamente para describir a las personas que se identifiquen como kānaka maoli. @es
broader: Indigenous LGBTQ+ people
narrower: Kānaka Maoli lesbians
narrower: Kānaka Maoli gay men
narrower: Kānaka Maoli bisexual people
narrower: Kānaka Maoli transgender people
narrower: Kānaka Maoli queer people
narrower: Kānaka Maoli intersex people
narrower: Kānaka Maoli asexual people
narrower: Kānaka Maoli non-binary people
related: Māhū
has top concept: LGBTQ+ people
issued: 2022-05-11
modified: 2025-02-23
type: Concept
in scheme: v3
change note: Version 4.1.0

Kānaka Maoli lesbians
preferred label: Lesbianas kānaka maoli @es
alternative label: Indigenous Hawaiian lesbians
alternative label: Lesbian Indigenous Hawaiians
alternative label: Lesbian Kānaka Maoli
alternative label: Lesbian Kānaka ʻŌiwi
alternative label: Lesbian Native Hawaiians
alternative label: Native Hawaiian lesbians
comment: Lesbians who are part of the Indigenous people of Mokupuni o Hawai‘i, or the Hawaiian Islands; only use to refer to people who identify as Kanaka Maoli.
comment: Lesbianas que pertenecen al pueblo indígena mokupuni o hawai‘i, o a las islas hawaianas. Utilícese únicamente para describir a las personas que se identifiquen como kānaka maoli. @es
broader: Kānaka Maoli LGBTQ+ people
has top concept: LGBTQ+ people
issued: 2022-05-11
modified: 2025-02-23
type: Concept
in scheme: v3
change note: Version 4.1.0

Kānaka Maoli gay men
preferred label: Hombres gay kānaka maoli @es
alternative label: Gay Indigenous Hawaiians
alternative label: Gay Kānaka Maoli
alternative label: Gay Kānaka ʻŌiwi
alternative label: Gay Native Hawaiians
alternative label: Indigenous Hawaiian gay men
alternative label: Native Hawaiian gay men
comment: Gay men who are part of the Indigenous people of Mokupuni o Hawai‘i, or the Hawaiian Islands; only use to refer to people who identify as Kanaka Maoli.
comment: Hombres gay que pertenecen al pueblo indígena mokupuni o hawai‘i, o a las islas hawaianas. Utilícese únicamente para describir a las personas que se identifiquen como kānaka maoli. @es
broader: Kānaka Maoli LGBTQ+ people
has top concept: LGBTQ+ people
issued: 2022-05-11
modified: 2025-02-23
type: Concept
in scheme: v3
change note: Version 4.1.0

Kānaka Maoli bisexual people
preferred label: Personas bisexuales kānaka maoli @es
alternative label: Bisexual Indigenous Hawaiians
alternative label: Bisexual Kānaka Maoli
alternative label: Bisexual Kānaka ʻŌiwi
alternative label: Bisexual Native Hawaiians
alternative label: Indigenous Hawaiian bisexual people
alternative label: Native Hawaiian bisexual people
comment: Bisexual people who are part of the Indigenous people of Mokupuni o Hawai‘i, or the Hawaiian Islands; only use to refer to people who identify as Kanaka Maoli.
comment: Personas bisexuales que pertenecen al pueblo indígena mokupuni o hawai‘i, o a las islas hawaianas. Utilícese únicamente para describir a las personas que se identifiquen como kānaka maoli. @es
broader: Kānaka Maoli LGBTQ+ people
has top concept: LGBTQ+ people
issued: 2022-05-11
modified: 2025-02-23
type: Concept
in scheme: v3
change note: Version 4.1.0

Kānaka Maoli transgender people
preferred label: Personas transgénero kānaka maoli @es
alternative label: Indigenous Hawaiian transgender people
alternative label: Native Hawaiian transgender people
alternative label: Transgender Indigenous Hawaiians
alternative label: Transgender Kānaka Maoli
alternative label: Transgender Kānaka ʻŌiwi
alternative label: Transgender Native Hawaiians
comment: Transgender people who are part of the Indigenous people of Mokupuni o Hawai‘i, or the Hawaiian Islands; only use to refer to people who identify as Kanaka Maoli and transgender.
comment: Personas transgénero que pertenecen al pueblo indígena mokupuni o hawai‘i, o a las islas hawaianas. Utilícese únicamente para describir a las personas que se identifiquen como kānaka maoli. @es
broader: Kānaka Maoli LGBTQ+ people
related: Māhū
has top concept: LGBTQ+ people
issued: 2022-05-11
modified: 2025-02-23
type: Concept
in scheme: v3
change note: Version 4.1.0

Kānaka Maoli queer people
preferred label: Personas queer kānaka maoli @es
alternative label: Indigenous Hawaiian queer people
alternative label: Native Hawaiian queer people
alternative label: Queer Indigenous Hawaiians
alternative label: Queer Kānaka Maoli
alternative label: Queer Kānaka ʻŌiwi
alternative label: Queer Native Hawaiians
comment: Queer people who are part of the Indigenous people of Mokupuni o Hawai‘i, or the Hawaiian Islands; only use to refer to people who identify as Kanaka Maoli.
comment: Personas queer que pertenecen al pueblo indígena mokupuni o hawai‘i, o a las islas hawaianas. Utilícese únicamente para describir a las personas que se identifiquen como kānaka maoli. @es
broader: Kānaka Maoli LGBTQ+ people
has top concept: LGBTQ+ people
issued: 2022-05-11
modified: 2025-02-23
type: Concept
in scheme: v3
change note: Version 4.1.0

Kānaka Maoli intersex people
preferred label: Personas intersexuales kānaka maoli @es
alternative label: Intersex Kānaka ʻŌiwi
alternative label: Indigenous Hawaiian intersex people
alternative label: Intersex Indigenous Hawaiians
alternative label: Intersex Kānaka Maoli
alternative label: Intersex Native Hawaiians
alternative label: Native Hawaiian intersex people
alternative label: Personas intersex kānaka maoli @es
comment: Intersex people who are part of the Indigenous people of Mokupuni o Hawai‘i, or the Hawaiian Islands; only use to refer to people who identify as Kanaka Maoli.
comment: Personas intersexuales que pertenecen al pueblo indígena mokupuni o hawai‘i, o a las islas hawaianas. Utilícese únicamente para describir a las personas que se identifiquen como kānaka maoli. @es
broader: Kānaka Maoli LGBTQ+ people
broader: Indigenous intersex people
related: Pacific Islander American intersex people
has top concept: LGBTQ+ people
issued: 2022-05-11
modified: 2025-02-23
type: Concept
in scheme: v3
change note: Version 4.1.0

Inuit lesbians
preferred label: Lesbianas inuit @es
alternative label: Lesbian Inuit people
alternative label: Lesbian Inuits
alternative label: Personas inuit lesbianas @es
comment: Lesbians who are Inuit, or part of several Indigenous peoples inhabiting the Inuit homeland in the Arctic and subarctic regions of Greenland, Canada, and Alaska. Only use for people who identify as Inuit.
comment: Lesbianas que son inuit o que son parte de varios pueblos indígenas que habitan los territorios ancestrales inuit en las regiones árticas o subárticas de Groenlandia, Canadá y Alaska. Utilícese únicamente para personas que se identifiquen como inuit. @es
broader: Inuit LGBTQ+ people
has top concept: LGBTQ+ people
issued: 2022-05-11
modified: 2025-02-23
type: Concept
in scheme: v3
change note: Version 4.1.0

Inuit gay men
preferred label: Hombres gay inuit @es
alternative label: Gay Inuit men
alternative label: Gay Inuits
alternative label: Inuit gays
alternative label: Hombres inuit gay @es
alternative label: Inuits gay @es
comment: Gay men who are Inuit, or part of several Indigenous peoples inhabiting the Inuit homeland in the Arctic and subarctic regions of Greenland, Canada, and Alaska. Only use for people who identify as Inuit.
comment: Hombres gay que son inuit o que son parte de varios pueblos indígenas que habitan los territorios ancestrales inuit en las regiones árticas o subárticas de Groenlandia, Canadá y Alaska. Utilícese únicamente para personas que se identifiquen como inuit. @es
broader: Inuit LGBTQ+ people
has top concept: LGBTQ+ people
issued: 2022-05-11
modified: 2025-02-23
type: Concept
in scheme: v3
change note: Version 4.1.0

Inuit bisexual people
preferred label: Personas bisexuales inuit @es
alternative label: Bisexual Inuit people
alternative label: Bisexual Inuits
alternative label: Personas inuit bisexuales @es
comment: Bisexual people who are Inuit, or part of several Indigenous peoples inhabiting the Inuit homeland in the Arctic and subarctic regions of Greenland, Canada, and Alaska. Only use for people who identify as Inuit.
comment: Personas bisexuales que son inuit o que son parte de varios pueblos indígenas que habitan los territorios ancestrales inuit en las regiones árticas o subárticas de Groenlandia, Canadá y Alaska. Utilícese únicamente para personas que se identifiquen como inuit. @es
broader: Inuit LGBTQ+ people
has top concept: LGBTQ+ people
issued: 2022-05-11
modified: 2025-02-23
type: Concept
in scheme: v3
change note: Version 4.1.0

Inuit transgender people
preferred label: Personas transgénero inuit @es
alternative label: Transgender Inuit people
alternative label: Transgender Inuits
alternative label: Personas inuit transgénero @es
comment: Transgender people who are Inuit, or part of several Indigenous peoples inhabiting the Inuit homeland in the Arctic and subarctic regions of Greenland, Canada, and Alaska. Only use for people who identify as Inuit.
comment: Personas transgénero que son inuit o que son parte de varios pueblos indígenas que habitan los territorios ancestrales inuit en las regiones árticas o subárticas de Groenlandia, Canadá y Alaska. Utilícese únicamente para personas que se identifiquen como inuit. @es
broader: Inuit LGBTQ+ people
has top concept: LGBTQ+ people
issued: 2022-05-11
modified: 2025-02-23
type: Concept
in scheme: v3
change note: Version 4.1.0

Inuit queer people
preferred label: Personas queer inuit @es
alternative label: Queer Inuit people
alternative label: Queer Inuits
alternative label: Personas inuit queer @es
comment: Queer people who are Inuit, or part of several Indigenous peoples inhabiting the Inuit homeland in the Arctic and subarctic regions of Greenland, Canada, and Alaska. Only use for people who identify as Inuit.
comment: Personas queer que son inuit o que son parte de varios pueblos indígenas que habitan los territorios ancestrales inuit en las regiones árticas o subárticas de Groenlandia, Canadá y Alaska. Utilícese únicamente para personas que se identifiquen como inuit. @es
broader: Inuit LGBTQ+ people
has top concept: LGBTQ+ people
issued: 2022-05-11
modified: 2025-02-23
type: Concept
in scheme: v3
change note: Version 4.1.0

Inuit intersex people
preferred label: Personas intersexuales inuit @es
alternative label: Intersex Inuit people
alternative label: Intersex Inuits
alternative label: Personas inuit intersexuales @es
alternative label: Personas intersex inuit @es
comment: Intersex people who are Inuit, or part of several Indigenous peoples inhabiting the Inuit homeland in the Arctic and subarctic regions of Greenland, Canada, and Alaska. Only use for people who identify as Inuit.
comment: Personas intersexuales que son inuit o que son parte de varios pueblos indígenas que habitan los territorios ancestrales inuit en las regiones árticas o subárticas de Groenlandia, Canadá y Alaska. Utilícese únicamente para personas que se identifiquen como inuit. @es
broader: Inuit LGBTQ+ people
has top concept: LGBTQ+ people
issued: 2022-05-11
modified: 2025-02-23
type: Concept
in scheme: v3
change note: Version 4.1.0

Indigenous lesbians
preferred label: Lesbianas indígenas @es
alternative label: Lesbian Indigenous people
alternative label: Personas lesbianas indígenas @es
comment: Lesbians who are part of an Indigenous people, or culturally distinct ethnic group whose members are directly descended from the earliest known inhabitants of a particular region and, to some extent, maintain the language and culture of those people. Only use to describe people who identify as Indigenous; use more specific terms whenever possible.
comment: Lesbianas que forman parte de un pueblo indígena o grupo étnico culturalmente distinto cuyos miembros descienden directamente de los primeros habitantes conocidos de una región en particular y, hasta cierto punto, mantienen el idioma y la cultura de ese pueblo. Utilícese únicamente para describir a personas que se autoidentifiquen como indígenas; utilícese términos más específicos siempre que sea posible. @es
broader: Indigenous LGBTQ+ people
has top concept: LGBTQ+ people
issued: 2022-05-11
modified: 2025-02-23
type: Concept
in scheme: v3
change note: Version 4.1.0

Indigenous gay men
preferred label: Hombres gay indígenas @es
alternative label: Gay Indigenous men
alternative label: Indigenous gays
alternative label: Hombres indígenas gay @es
comment: Gay men who are part of an Indigenous people, or culturally distinct ethnic group whose members are directly descended from the earliest known inhabitants of a particular region and, to some extent, maintain the language and culture of those people. Only use to describe people who identify as Indigenous; use more specific terms whenever possible.
comment: Hombres gay que forman parte de un pueblo indígena o de un grupo étnico culturalmente distinto cuyos miembros descienden directamente de los primeros habitantes conocidos de una región en particular y, hasta cierto punto, mantienen el idioma y la cultura de ese pueblo. Utilicé únicamente para describir a personas que se autoidentifiquen como indígenas; Utilice términos más específicos siempre que sea posible. @es
broader: Indigenous LGBTQ+ people
has top concept: LGBTQ+ people
issued: 2022-05-11
modified: 2025-02-23
type: Concept
in scheme: v3
change note: Version 4.1.0

Indigenous bisexual people
preferred label: Personas bisexuales indígenas @es
alternative label: Bisexual Indigenous people
alternative label: Personas indígenas bisexuales @es
comment: Bisexual people who are part of an Indigenous people, or culturally distinct ethnic group whose members are directly descended from the earliest known inhabitants of a particular region and, to some extent, maintain the language and culture of those people. Only use to describe people who identify as Indigenous; use more specific terms whenever possible.
comment: Personas bisexuales que forman parte de un pueblo indígena o grupo étnico culturalmente distinto cuyos miembros descienden directamente de los primeros habitantes conocidos de una región en particular y, hasta cierto punto, mantienen el idioma y la cultura de ese pueblo. Utilícese únicamente para describir a personas que se autoidentifiquen como indígenas; utilícese términos más específicos siempre que sea posible. @es
broader: Indigenous LGBTQ+ people
has top concept: LGBTQ+ people
issued: 2022-05-11
modified: 2025-02-23
type: Concept
in scheme: v3
change note: Version 4.1.0

Indigenous transgender people
preferred label: Personas transgénero indígenas @es
alternative label: Transgender Indigenous people
alternative label: Personas indígenas transgénero @es
comment: Transgender people who are part of an Indigenous people, or culturally distinct ethnic group whose members are directly descended from the earliest known inhabitants of a particular region and, to some extent, maintain the language and culture of those people. Only use to describe people who identify as Indigenous; use more specific terms whenever possible.
comment: Personas transgénero que forman parte de un pueblo indígena o grupo étnico culturalmente distinto cuyos miembros descienden directamente de los primeros habitantes conocidos de una región en particular y, hasta cierto punto, mantienen el idioma y la cultura de esas personas. Utilícese únicamente para describir a personas que se autoidentifiquen como indígenas; utilícese términos más específicos siempre que sea posible. @es
broader: Indigenous LGBTQ+ people
has top concept: LGBTQ+ people
issued: 2022-05-11
modified: 2025-02-23
type: Concept
in scheme: v3
change note: Version 4.1.0

Indigenous queer people
preferred label: Personas queer indígenas @es
alternative label: Queer Indigenous people
alternative label: Personas indígenas queer @es
comment: Queer people who are part of an Indigenous people, or culturally distinct ethnic group whose members are directly descended from the earliest known inhabitants of a particular region and, to some extent, maintain the language and culture of those people. Only use to describe people who identify as Indigenous; use more specific terms whenever possible.
comment: Personas queer que forman parte de un pueblo indígena o de un grupo étnico culturalmente distinto cuyos miembros descienden directamente de los primeros habitantes conocidos de una región en particular y, hasta cierto punto, mantienen el idioma y la cultura de ese pueblo. Utilícese únicamente para describir a personas que se autoidentifiquen como indígenas; utilícese términos más específicos siempre que sea posible. @es
broader: Indigenous LGBTQ+ people
has top concept: LGBTQ+ people
issued: 2022-05-11
modified: 2025-02-23
type: Concept
in scheme: v3
change note: Version 4.1.0

Indigenous intersex people
preferred label: Personas intersexuale indígenas @es
alternative label: Intersex Indigenous people
alternative label: Personas indígenas intersex @es
alternative label: Personas intersex indígenas @es
comment: Intersex people who are part of an Indigenous people, or culturally distinct ethnic group whose members are directly descended from the earliest known inhabitants of a particular region and, to some extent, maintain the language and culture of those people. Only use to describe people who identify as Indigenous; use more specific terms whenever possible.
comment: Personas intersexuales que forman parte de un pueblo indígena o grupo étnico culturalmente distinto cuyos miembros descienden directamente de los primeros habitantes conocidos de una región en particular y, hasta cierto punto, mantienen el idioma y la cultura de ese pueblo. Utilícese únicamente para describir a personas que se autoidentifiquen como indígenas; utilícese términos más específicos siempre que sea posible. @es
broader: Indigenous LGBTQ+ people
narrower: Pacific Islander American intersex people
narrower: Kānaka Maoli intersex people
narrower: Native American intersex people
has top concept: LGBTQ+ people
issued: 2022-05-11
modified: 2025-02-23
type: Concept
in scheme: v3
change note: Version 4.1.0

Aboriginal Australian lesbians
preferred label: Lesbianas aborígenes australianas @es
alternative label: Aboriginal lesbians
alternative label: Lesbian aboriginal Australians
alternative label: Aborígenes australianas lesbianas @es
comment: Lesbians who belong to one or more of the various Indigenous peoples of Australia; do not use to refer to the Indigenous people of the Torres Strait Islands, who are considered ethnically and culturally distinct. Only use to describe people who identify as Aboriginal Australian.
comment: Lesbianas que pertenecen a uno o más de los diversos pueblos indígenas de Australia; no para referirse a los pueblos indígenas de las Islas del Estrecho de Torres, que se consideran étnica y culturalmente distintos. Utilícese únicamente para describir a las personas que se autoidentifiquen como aborígenes australianos. @es
broader: Aboriginal Australian LGBTQ+ people
has top concept: LGBTQ+ people
issued: 2022-05-11
modified: 2025-02-23
type: Concept
in scheme: v3
change note: Version 4.1.0

Aboriginal Australian gay men
preferred label: Hombres gay aborígenes australianos @es
alternative label: Aboriginal gay men
alternative label: Gay Aboriginal Australian men
alternative label: Gay Aboriginal Australians
alternative label: Australianos gay aborígenes @es
alternative label: Hombres aborígenes australianos gay @es
comment: Gay men who belong to one or more of the various Indigenous peoples of Australia; do not use to refer to the Indigenous people of the Torres Strait Islands, who are considered ethnically and culturally distinct. Only use to describe people who identify as Aboriginal Australian.
comment: Hombres gay que pertenecen a uno o más de los diversos pueblos indígenas de Australia; no para referirse a los pueblos indígenas de las Islas del Estrecho de Torres, que se consideran étnica y culturalmente distintos. Utilícese únicamente para describir a las personas que se autoidentifiquen como aborígenes australianos. @es
broader: Aboriginal Australian LGBTQ+ people
has top concept: LGBTQ+ people
issued: 2022-05-11
modified: 2025-02-23
type: Concept
in scheme: v3
change note: Version 4.1.0

Aboriginal Australian bisexual people
preferred label: Personas bisexuales aborígenes australianas @es
alternative label: Aboriginal bisexual people
alternative label: Bisexual Aboriginal Australian people
alternative label: Bisexual Aboriginal Australians
alternative label: Bisexuales aborígenes australianos @es
alternative label: Australianos bisexuales aborígenes @es
alternative label: Bisexuales aborígenes australianas @es
alternative label: Australianas bisexuales aborígenes @es
comment: Bisexual people who belong to one or more of the various Indigenous peoples of Australia; do not use to refer to the Indigenous people of the Torres Strait Islands, who are considered ethnically and culturally distinct. Only use to describe people who identify as Aboriginal Australian.
comment: Personas bisexuales que pertenecen a uno o más de los diversos pueblos indígenas de Australia; no para referirse a los pueblos indígenas de las Islas del Estrecho de Torres, que se consideran étnica y culturalmente distintos. Utilícese únicamente para describir a las personas que se autoidentifiquen como aborígenes australianos. @es
broader: Aboriginal Australian LGBTQ+ people
has top concept: LGBTQ+ people
issued: 2022-05-11
modified: 2025-02-23
type: Concept
in scheme: v3
change note: Version 4.1.0

Aboriginal Australian transgender people
preferred label: Personas transgénero aborígenes australianas @es
alternative label: Aboriginal transgender people
alternative label: Transgender Aboriginal Australian people
alternative label: Transgender Aboriginal Australians
alternative label: Personas transgénero aborígenes @es
alternative label: Personas aborígenes australianas transgénero @es
alternative label: Aborígenes australianos transgénero @es
alternative label: Aborígenes australianas transgénero @es
comment: Transgender people who belong to one or more of the various Indigenous peoples of Australia; do not use to refer to the Indigenous people of the Torres Strait Islands, who are considered ethnically and culturally distinct. Only use to describe people who identify as Aboriginal Australian.
comment: Personas transgenero que pertenecen a uno o más de los diversos pueblos indígenas de Australia; no para referirse a los pueblos indígenas de las Islas del Estrecho de Torres, que se consideran étnica y culturalmente distintos. Utilícese únicamente para describir a las personas que se autoidentifiquen como aborígenes australianos. @es
broader: Aboriginal Australian LGBTQ+ people
has top concept: LGBTQ+ people
issued: 2022-05-11
modified: 2025-02-23
type: Concept
in scheme: v3
change note: Version 4.1.0

Aboriginal Australian queer people
preferred label: Personas queer aborígenes australianas @es
alternative label: Aboriginal queer people
alternative label: Queer Aboriginal Australian people
alternative label: Queer Aboriginal Australians
alternative label: Personas aborígenes australianas queer @es
alternative label: Aborígenes australianos queer @es
alternative label: Aborígenes australianas queer @es
comment: Queer people who belong to one or more of the various Indigenous peoples of Australia; do not use to refer to the Indigenous people of the Torres Strait Islands, who are considered ethnically and culturally distinct. Only use to describe people who identify as Aboriginal Australian.
comment: Personas queer que pertenecen a uno o más de los diversos pueblos indígenas de Australia; no para referirse a los pueblos indígenas de las Islas del Estrecho de Torres, que se consideran étnica y culturalmente distintos. Utilícese únicamente para describir a las personas que se autoidentifiquen como aborígenes australianos. @es
broader: Aboriginal Australian LGBTQ+ people
has top concept: LGBTQ+ people
issued: 2022-05-11
modified: 2025-02-23
type: Concept
in scheme: v3
change note: Version 4.1.0

Aboriginal Australian intersex people
preferred label: Personas intersexuales aborígenes australianas @es
alternative label: Aboriginal intersex people
alternative label: Intersex Aboriginal Australian people
alternative label: Intersex Aboriginal Australians
alternative label: Intersex aborígenes australianos @es
alternative label: Personas intersex aborígenes australianas @es
alternative label: Australianos intersex aborígenes @es
alternative label: Intersex aborígenes australianas @es
alternative label: Australianas intersex aborígenes @es
comment: Intersex people who belong to one or more of the various Indigenous peoples of Australia; do not use to refer to the Indigenous people of the Torres Strait Islands, who are considered ethnically and culturally distinct. Only use to describe people who identify as Aboriginal Australian.
comment: Personas intersexuales que pertenecen a uno o más de los diversos pueblos indígenas de Australia; no para referirse a los pueblos indígenas de las Islas del Estrecho de Torres, que se consideran étnica y culturalmente distintos. Utilícese únicamente para describir a las personas que se autoidentifiquen como aborígenes australianos. @es
broader: Aboriginal Australian LGBTQ+ people
has top concept: LGBTQ+ people
issued: 2022-05-11
modified: 2025-02-23
type: Concept
in scheme: v3
change note: Version 4.1.0

GRID (Gay-Related Immune Deficiency)
preferred label: GRID (Inmunodeficiencia Asociada a la Homosexualidad) @es
alternative label: GRID
alternative label: GRIDS
alternative label: Gay Related Immune Deficiency
alternative label: Gay-Related Immune Deficiency
comment: The original name for AIDS, proposed after public health scientists noticed clusters of Kaposi's sarcoma and Pneumocystis pneumonia among gay men in California and New York City. Should only be used in historical contexts.
comment: Nombre original del SIDA, propuesto después de que científicos de salud pública observaran grupos de sarcoma de Kaposi y neumonía por Pneumocystis entre hombres gay de California y Nueva York. Utilícese únicamente en contextos históricos. @es
broader: HIV/AIDS
broader: LGBTQ+ historical terms
related: Kaposi's sarcoma
has top concept: STDs
issued: 2022-05-11
modified: 2025-02-23
type: Concept
in scheme: v3
change note: Version 4.1.0

HAART (Highly Active Antiretroviral Therapy)
preferred label: TARGA (Terapia Antirretroviral de Gran Actividad) @es
alternative label: Combination Anti-Retroviral Therapy
alternative label: Combination Antiretroviral Therapy
alternative label: HAART
alternative label: Highly Active Anti-Retroviral Therapy
alternative label: Highly Active Antiretroviral Therapy
alternative label: cART
comment: Treatment that involves the use of three or more drugs in combination to treat HIV infection by preventing the virus from making copies of itself in the body; can lessen the damage to the immune system caused by HIV, slow down the development of AIDS, and prevent the transmission of HIV to others.
comment: Tratamiento que implica el uso de tres o más medicamentos en combinación para tratar la infección por VIH evitando que el virus se replique en el cuerpo; puede disminuir el daño al sistema inmunológico causado por el VIH, retardar el desarrollo del SIDA y prevenir la transmisión del VIH a otras personas. @es
broader: Medication
related: HIV/AIDS
has top concept: Medical care
issued: 2022-05-11
modified: 2025-02-23
type: Concept
in scheme: v3
change note: Version 4.1.0

LGBTQ+ home movies
preferred label: Películas caseras LGBTQ+ @es
alternative label: Home movies (LGBTQ)
alternative label: LGBTQ+ personal films
alternative label: Personal films (LGBTQ)
alternative label: Películas caseras LGBTQ @es
alternative label: Películas de casa LGBTQ+ @es
alternative label: Películas de casa (LGBTQ) @es
alternative label: Películas personales LGBTQ+ @es
comment: Short amateur films or videos created primarily to preserve memories; use in reference to home movies created by or featuring LGBTQ+ people.
comment: Cortometrajes o vídeos de aficionados creados principalmente para preservar recuerdos; utilícese en referencia a películas caseras creadas por o protagonizadas por personas LGBTQ+. @es
broader: LGBTQ+ films
narrower: LGBTQ+ vlogs
has top concept: Subcultures
issued: 2022-05-11
modified: 2025-02-23
type: Concept
in scheme: v3
change note: Version 4.1.0

LGBTQ+ vlogs
preferred label: Vlogs LGBTQ+ @es
alternative label: LGBTQ+ video blogs
alternative label: Video blogs (LGBTQ)
alternative label: Vlogs (LGBTQ)
comment: A form of online blogging via short videos about an individual's life; use in reference to vlogs created by LGBTQ+ people or focusing on LGBTQ+ issues.
comment: Una forma de blogueo en línea a través de videos cortos sobre la vida de una persona; utilícese en referencia a vlogs creados por personas LGBTQ+ o que se centren en asuntos LGBTQ+. @es
broader: Blogs
broader: LGBTQ+ home movies
related: LGBTQ+ social media
has top concept: LGBTQ+ social media
issued: 2022-05-11
modified: 2026-02-23
type: Concept
in scheme: v3
change note: Version 4.1.0

Nipple
preferred label: Pezón @es
alternative label: Nipples
alternative label: Pezones @es
alternative label: Tetilla @es
alternative label: Tetillas @es
comment: The small protuberance of a mammary gland.
comment: La pequeña protuberancia de una glándula mamaria. @es
broader: Erogenous body parts
related: Nipple clamps
related: Nipple play
related: Nipple torture
has top concept: Erogenous body parts
issued: 2022-05-11
modified: 2025-02-23
type: Concept
in scheme: v3
change note: Version 4.1.0

Demiromantic people
preferred label: Personas demirrománticas @es
alternative label: Demi-romantic people
alternative label: Personas demi-románticas @es
comment: Individuals who experience romantic attraction to other people only after forming emotional bonds.
comment: Personas que experimentan atracción romántica hacia otras personas únicamente después de formar vínculos emocionales. @es
broader: Romantic minorities
related: Demisexual people
related: Demiromanticism
has top concept: Romantic minorities
issued: 2022-05-11
modified: 2025-02-23
type: Concept
in scheme: v3
change note: Version 4.1.0

Demiromanticism
preferred label: Demirromanticismo @es
alternative label: Demi-romantic
alternative label: Demiromantic
alternative label: Demi-romántico @es
alternative label: Demirrománticos @es
alternative label: Demi-romántica @es
alternative label: Demirrománticas @es
comment: Romantic orientation in which romantic attraction to other people is only experienced after forming emotional bonds.
comment: Orientación romántica en la que la atracción romántica hacia otras personas solo se experimenta después de formar vínculos emocionales. @es
broader: Romantic orientation
related: Demisexuality
related: Demiromantic people
has top concept: Romantic orientation
issued: 2022-05-11
modified: 2025-02-23
type: Concept
in scheme: v3
change note: Version 4.1.0

Greyromantic people
preferred label: Personas grisrománticas @es
alternative label: Gray-romantic people
alternative label: Grayromantic people
alternative label: Grayromantics
alternative label: Grey-romantic people
alternative label: Greyromantics
alternative label: Personas gris-románticas @es
alternative label: Grisrománticos @es
alternative label: Personas gris románticas @es
comment: Individuals who experience rare, infrequent, or low-intensity romantic attraction.
comment: Personas que experimentan una atracción romántica rara, poco frecuente o de baja intensidad. @es
broader: Romantic minorities
narrower: Greyromantic college students
related: Greysexual people
related: Greyromanticism
has top concept: Romantic minorities
issued: 2022-05-11
modified: 2025-02-23
type: Concept
in scheme: v3
change note: Version 4.1.0

Greyromanticism
preferred label: Grisrománticismo @es
alternative label: Gray-romantic
alternative label: Grayromantic
alternative label: Grayromanticism
alternative label: Grey-romantic
alternative label: Greyromantic
comment: An umbrella term for romantic orientations generally characterized by rare, infrequent, or low-intensity romantic attraction.
comment: Término general que engloba las orientaciones románticas generalmente caracterizadas por una atracción romántica rara, infrecuente o de baja intensidad. @es
broader: Romantic orientation
related: Greysexuality
related: Greyromantic people
has top concept: Romantic orientation
issued: 2022-05-11
modified: 2025-02-23
type: Concept
in scheme: v3
change note: Version 4.1.0

LGBTQ+ victims of bullying
preferred label: Víctimas LGBTQ+ de acoso @es
alternative label: Victims of bullying (LGBTQ)
comment: LGBTQ+ people who have experienced bullying due to their gender or sexual identity and may or may not have survived; follow the individual's preference for "victims" or "survivors" whenever possible.
comment: Personas LGBTQ+ que han sufrido acoso debido a su género o identidad sexual y pueden o no haber sobrevivido; siga la preferencia de la persona sobre el uso de "víctimas" o "sobrevivientes" siempre que sea posible. @es
broader: LGBTQ+ people
narrower: Lesbian victims of bullying
narrower: Gay victims of bullying
narrower: Bisexual victims of bullying
narrower: Transgender victims of bullying
narrower: Queer victims of bullying
narrower: Asexual victims of bullying
narrower: Intersex victims of bullying
narrower: LGBTQ+ survivors of bullying
narrower: LGBTQ+ youth victims of bullying
narrower: LGBTQ+ victims of cyberbullying
related: Bullying
related: Two-Spirit victims of bullying
related: Two-Spirit youth victims of bullying
has top concept: LGBTQ+ people
issued: 2022-05-11
modified: 2026-02-24
type: Concept
in scheme: v3
change note: Version 4.1.0

Lesbian victims of bullying
preferred label: Víctimas lesbianas de acoso @es
alternative label: Víctimas lésbicas de acoso @es
comment: Lesbians who have experienced bullying due to their sexual identity and may or may not have survived; follow the individual's preference for "victims" or "survivors" whenever possible.
comment: Lesbianas que han sufrido acoso debido a su identidad sexual y que pueden o no haber sobrevivido; siga la preferencia de la persona sobre el uso de "víctimas" o "sobrevivientes" siempre que sea posible. @es
broader: LGBTQ+ victims of bullying
has top concept: LGBTQ+ people
issued: 2022-05-11
modified: 2025-02-23
type: Concept
in scheme: v3
change note: Version 4.1.0

Gay victims of bullying
preferred label: Víctimas gay de acoso @es
comment: Gay men who have experienced bullying due to their sexual identity and may or may not have survived; follow the individual's preference for "victims" or "survivors" whenever possible.
comment: Hombres gay que han sufrido acoso debido a su identidad sexual y pueden haber sobrevivido o no; siga la preferencia de la persona sobre el uso de "víctimas" o "sobrevivientes" siempre que sea posible. @es
broader: LGBTQ+ victims of bullying
has top concept: LGBTQ+ people
issued: 2022-05-11
modified: 2025-02-23
type: Concept
in scheme: v3
change note: Version 4.1.0

Bisexual victims of bullying
preferred label: Víctimas bisexuales de acoso @es
comment: Bisexual people who have experienced bullying due to their sexual identity and may or may not have survived; follow the individual's preference for "victims" or "survivors" whenever possible.
comment: Personas bisexuales que han sufrido acoso por su identidad sexual y pueden haber sobrevivido o no; siga la preferencia del individuo sobre el uso de "víctimas" o "sobrevivientes" siempre que sea posible. @es
broader: LGBTQ+ victims of bullying
has top concept: LGBTQ+ people
issued: 2022-05-11
modified: 2025-02-23
type: Concept
in scheme: v3
change note: Version 4.1.0

Transgender victims of bullying
preferred label: Víctimas transgénero de acoso @es
comment: Transgender people who have experienced bullying due to their gender identity and may or may not have survived; follow the individual's preference for "victims" or "survivors" whenever possible.
comment: Personas transgénero que han sufrido acoso debido a su identidad de género y pueden o no haber sobrevivido; siga la preferencia de la persona sobre el uso de "víctimas" o "sobrevivientes" siempre que sea posible. @es
broader: LGBTQ+ victims of bullying
has top concept: LGBTQ+ people
issued: 2022-05-11
modified: 2025-02-23
type: Concept
in scheme: v3
change note: Version 4.1.0

Queer victims of bullying
preferred label: Víctimas queer de acoso @es
comment: Queer people who have experienced bullying due to their gender or sexual identity and may or may not have survived; follow the individual's preference for "victims" or "survivors" whenever possible.
comment: Personas queer que han sufrido acoso debido a su género o identidad sexual y pueden o no haber sobrevivido; siga la preferencia de la persona sobre el uso de "víctimas" o "sobrevivientes" siempre que sea posible. @es
broader: LGBTQ+ victims of bullying
has top concept: LGBTQ+ people
issued: 2022-05-11
modified: 2025-02-23
type: Concept
in scheme: v3
change note: Version 4.1.0

Asexual victims of bullying
preferred label: Víctimas asexuales de acoso @es
comment: Asexual people who have experienced bullying due to their sexual identity and may or may not have survived; follow the individual's preference for "victims" or "survivors" whenever possible.
comment: Personas asexuales que han sufrido acoso por su identidad sexual y pueden o no haber sobrevivido; siga la preferencia de la persona sobre el uso de "víctimas" o "supervivientes" siempre que sea posible. @es
broader: LGBTQ+ victims of bullying
broader: LGBTQ+ youth victims of bullying
has top concept: LGBTQ+ people
issued: 2022-05-11
modified: 2025-02-23
type: Concept
in scheme: v3
change note: Version 4.1.0

Intersex victims of bullying
preferred label: Víctimas intersex de acoso @es
comment: Intersex people who have experienced bullying directed toward them because they are intersex and may or may not have survived; follow the individual's preference for "victims" or "survivors" whenever possible.
comment: Personas intersex que han sufrido acoso dirigido hacia ellas porque son intersex y pueden haber sobrevivido o no; siga la preferencia de la persona sobre el uso de "víctimas" o "sobrevivientes" siempre que sea posible. @es
broader: LGBTQ+ victims of bullying
has top concept: LGBTQ+ people
issued: 2022-05-11
modified: 2025-02-23
type: Concept
in scheme: v3
change note: Version 4.1.0

Two-Spirit victims of bullying
preferred label: Víctimas dos espíritus de acoso @es
alternative label: 2S victims of bullying
alternative label: Two Spirit victims of bullying
alternative label: Two Spirited victims of bullying
alternative label: Two-Spirited victims of bullying
comment: Two-Spirit people who have experienced bullying due to their gender or sexual identity and may or may not have survived; follow the individual's preference for "victims" or "survivors" whenever possible.
comment: Personas dos espíritus que han sufrido acoso por su identidad sexual y pueden o no haber sobrevivido; siga la preferencia de la persona sobre el uso de "víctimas" o "supervivientes" siempre que sea posible. @es
broader: Two-Spirit people
narrower: Two-Spirit youth victims of bullying
narrower: Two-Spirit survivors of bullying
related: LGBTQ+ victims of bullying
related: Two-Spirit victims of crime
has top concept: Gender
issued: 2022-05-11
modified: 2025-02-23
type: Concept
in scheme: v3
change note: Version 4.1.0

LGBTQ+ survivors of bullying
preferred label: Sobrevivientes LGBTQ+ de acoso @es
comment: LGBTQ+ people who have experienced and survived bullying due to their gender or sexual identity; follow the individual's preference for "victims" or "survivors" whenever possible.
comment: Personas LGBTQ+ que han sufrido y sobrevivido al acoso debido a su género o identidad sexual; siga la preferencia de la persona sobre el uso de "víctimas" o "sobrevivientes" siempre que sea posible. @es
broader: LGBTQ+ victims of bullying
narrower: Lesbian survivors of bullying
narrower: Gay survivors of bullying
narrower: Bisexual survivors of bullying
narrower: Transgender survivors of bullying
narrower: Queer survivors of bullying
narrower: Asexual survivors of bullying
narrower: Intersex survivors of bullying
narrower: LGBTQ+ youth survivors of bullying
related: Bullying
related: Two-Spirit survivors of bullying
has top concept: LGBTQ+ people
issued: 2022-05-11
modified: 2025-02-23
type: Concept
in scheme: v3
change note: Version 4.1.0

Lesbian survivors of bullying
preferred label: Sobrevivientes lesbianas de acoso @es
alternative label: Lesbianas sobrevivientes de acoso @es
comment: Lesbians who have experienced and survived bullying due to their sexual identity; follow the individual's preference for "victims" or "survivors" whenever possible.
comment: Lesbianas que han sufrido y sobrevivido acoso debido a su identidad sexual; siga la preferencia de la persona sobre el uso de "víctimas" o "sobrevivientes" siempre que sea posible. @es
broader: LGBTQ+ survivors of bullying
has top concept: LGBTQ+ people
issued: 2022-05-11
modified: 2025-02-23
type: Concept
in scheme: v3
change note: Version 4.1.0

Gay survivors of bullying
preferred label: Sobrevivientes gay de acoso @es
comment: Gay men who have experienced and survived bullying due to their sexual identity; follow the individual's preference for "victims" or "survivors" whenever possible.
comment: Hombres gay que han sufrido y sobrevivido al acoso por su identidad sexual; siga la preferencia de la persona sobre el uso de "víctimas" o "sobrevivientes" siempre que sea posible. @es
broader: LGBTQ+ survivors of bullying
has top concept: LGBTQ+ people
issued: 2022-05-11
modified: 2025-02-23
type: Concept
in scheme: v3
change note: Version 4.1.0

Bisexual survivors of bullying
preferred label: Hijos bisexuales @es
comment: Bisexual people who have experienced and survived bullying due to their sexual identity; follow the individual's preference for "victims" or "survivors" whenever possible.
comment: Hijos que se autoidentifican como bisexuales. @es
broader: LGBTQ+ survivors of bullying
has top concept: LGBTQ+ people
issued: 2022-05-11
modified: 2025-02-23
type: Concept
in scheme: v3
change note: Version 4.1.0

Transgender survivors of bullying
preferred label: Sobrevivientes transgénero de acoso @es
comment: Transgender people who have experienced and survived bullying due to their gender identity; follow the individual's preference for "victims" or "survivors" whenever possible.
comment: Personas transgénero que han sufrido y sobrevivido acoso debido a su identidad de género; siga la preferencia de la persona sobre el uso de "víctimas" o "sobrevivientes" siempre que sea posible. @es
broader: LGBTQ+ survivors of bullying
has top concept: LGBTQ+ people
issued: 2022-05-11
modified: 2025-02-23
type: Concept
in scheme: v3
change note: Version 4.1.0

Queer survivors of bullying
preferred label: Sobrevivientes queer de acoso @es
comment: Queer people who have experienced and survived bullying due to their gender or sexual identity; follow the individual's preference for "victims" or "survivors" whenever possible.
comment: Personas queer que han sufrido y sobrevivido al acoso debido a su género o identidad sexual; siga la preferencia de la persona sobre el uso de "víctimas" o "sobrevivientes" siempre que sea posible. @es
broader: LGBTQ+ survivors of bullying
has top concept: LGBTQ+ people
issued: 2022-05-11
modified: 2025-02-23
type: Concept
in scheme: v3
change note: Version 4.1.0

Asexual survivors of bullying
preferred label: Sobrevivientes asexuales de acoso @es
comment: Asexual people who have experienced and survived bullying due to their sexual identity; follow the individual's preference for "victims" or "survivors" whenever possible.
comment: Personas asexuales que han sufrido y sobrevivido al acoso por su identidad sexual; siga la preferencia de la persona sobre el uso de "víctimas" o "supervivientes" siempre que sea posible. @es
broader: LGBTQ+ survivors of bullying
has top concept: LGBTQ+ people
issued: 2022-05-11
modified: 2025-02-23
type: Concept
in scheme: v3
change note: Version 4.1.0

Intersex survivors of bullying
preferred label: Sobrevivientes intersex de acoso @es
comment: Intersex people who have experienced and survived bullying directed toward them because they are intersex; follow the individual's preference for "victims" or "survivors" whenever possible.
comment: Personas intersex que han sufrido y sobrevivido acoso dirigido hacia ellas por ser intersex; siga la preferencia de la persona sobre el uso de "víctimas" o "sobrevivientes" siempre que sea posible. @es
broader: LGBTQ+ survivors of bullying
has top concept: LGBTQ+ people
issued: 2022-05-11
modified: 2025-02-23
type: Concept
in scheme: v3
change note: Version 4.1.0

Two-Spirit survivors of bullying
preferred label: Sobrevivientes dos espíritus de acoso @es
alternative label: 2S survivors of bullying
alternative label: Two Spirit survivors of bullying
alternative label: Two Spirited survivors of bullying
alternative label: Two-Spirited survivors of bullying
comment: Two-Spirit people who have experienced and survived bullying due to their gender or sexual identity; follow the individual's preference for "victims" or "survivors" whenever possible.
comment: Personas dos espíritus que han sufrido y sobrevivido al acoso por su identidad sexual; siga la preferencia de la persona sobre el uso de "víctimas" o "supervivientes" siempre que sea posible. @es
broader: Two-Spirit victims of bullying
narrower: Two-Spirit youth survivors of bullying
related: LGBTQ+ survivors of bullying
has top concept: Gender
issued: 2022-05-11
modified: 2025-02-23
type: Concept
in scheme: v3
change note: Version 4.1.0

Chicano/a/x LGBTQ+ people
preferred label: Personas LGBTQ+ chicanas @es
alternative label: Chicana LGBTQ+ people
alternative label: Chicanas (LGBTQ)
alternative label: Chicano LGBTQ+ people
alternative label: Chicanos (LGBTQ)
alternative label: Chicanx LGBTQ+ people
alternative label: Chicanx people (LGBTQ)
alternative label: Chicanxs (LGBTQ)
alternative label: LGBTQ+ Chicanas
alternative label: LGBTQ+ Chicanos
alternative label: LGBTQ+ Chicanx people
alternative label: LGBTQ+ Chicanxs
alternative label: Personas chicanas LGBTQ+ @es
alternative label: Personas chicanas (LGBTQ) @es
alternative label: Chicanos LGBTQ+ @es
alternative label: Chicanas LGBTQ+ @es
alternative label: Chicanxs LGBTQ+ @es
alternative label: Chicanxs (LGBTQ)|| @es
comment: LGBTQ+ people of Mexican descent born in the United States; only use to describe people who self-identify as Chicano, Chicana, or Chicanx. Do not conflate with Latino/a/x or Hispanic people.
comment: personas LGBTQ+ de ascendencia mexicana nacidas en Estados Unidos; utilícese únicamente para describir a personas que se autoidentifiquen como chicanas. No se debe confundir con latinos/a/x o hispanos. @es
broader: LGBTQ+ people of shared ethnic or national identities
narrower: Chicano/a/x lesbians
narrower: Chicano/a/x gay men
narrower: Chicano/a/x bisexual people
narrower: Chicano/a/x transgender people
narrower: Chicano/a/x queer people
narrower: Chicano/a/x intersex people
narrower: Chicano/a/x non-binary people
narrower: Chicano/a/x asexual people
has top concept: LGBTQ+ people
issued: 2022-05-11
modified: 2025-02-23
type: Concept
in scheme: v3
change note: Version 4.1.0

Chicano/a/x lesbians
preferred label: Lesbianas chicanas @es
alternative label: Chicana lesbians
alternative label: Chicano lesbians
alternative label: Chicanx lesbians
alternative label: LGBTQ+ Chicanas
alternative label: Lesbian Chicanos
alternative label: Lesbian Chicanx people
alternative label: Lesbian Chicanxs
alternative label: Chicanas lesbianas @es
comment: Lesbians of Mexican descent born in the United States; only use to describe people who self-identify as Chicano, Chicana, or Chicanx. Do not conflate with Latino/a/x or Hispanic people.
comment: Lesbianas de ascendencia mexicana nacidas en Estados Unidos; utilícese únicamente para describir a personas que se autoidentifiquen como chicanas. No se debe confundir con latinos/a/x o hispanos. @es
broader: Chicano/a/x LGBTQ+ people
has top concept: LGBTQ+ people
issued: 2022-05-11
modified: 2025-02-23
type: Concept
in scheme: v3
change note: Version 4.1.0

Arab LGBTQ+ people
preferred label: Personas LGBTQ+ árabes @es
alternative label: Arab people (LGBTQ)
alternative label: Arabs (LGBTQ)
alternative label: LGBTQ+ Arab people
alternative label: LGBTQ+ Arabs
alternative label: Personas árabes (LGBTQ) @es
alternative label: Árabes (LGBTQ) @es
alternative label: Árabes LGBTQ+ @es
alternative label: Personas árabes LGBTQ+ @es
comment: LGBTQ+ people who are from Arab countries and/or are descended from Arab peoples. Do not conflate with Muslim people.
comment: Personas LGBTQ+ que son de países árabes, hablan árabe y/o son descendientes de pueblos árabes. No se debe confundir con personas musulmanas. @es
broader: LGBTQ+ people of shared ethnic or national identities
broader: LGBTQ+ people of color
narrower: Arab lesbians
narrower: Arab gay men
narrower: Arab bisexual people
narrower: Arab transgender people
narrower: Arab queer people
narrower: Arab asexual people
narrower: Arab intersex people
narrower: Palestinian LGBTQ+ people
narrower: Arab non-binary people
narrower: Arab American LGBTQ+ people
narrower: Arab aromantic people
has top concept: LGBTQ+ people
issued: 2022-05-11
modified: 2025-02-23
type: Concept
in scheme: v3
change note: Version 4.1.0

Arab lesbians
preferred label: Lesbianas árabes @es
alternative label: Lesbian Arab people
alternative label: Lesbian Arabs
alternative label: Árabes lesbianas @es
comment: Lesbians from Arab countries and/or are descended from Arab peoples. Do not conflate with Muslim people.
comment: Lesbianas que son de países árabes, hablan árabe y/o son descendientes de pueblos árabes. No se debe confundir con personas musulmanas. @es
broader: Arab LGBTQ+ people
has top concept: LGBTQ+ people
issued: 2022-05-11
modified: 2025-02-23
type: Concept
in scheme: v3
change note: Version 4.1.0

Arab gay men
preferred label: Hombres gay árabes @es
alternative label: Gay Arab men
alternative label: Gay Arabs
alternative label: Hombres árabes gay @es
alternative label: Árabes gay @es
comment: Gay men who are from Arab countries and/or are descended from Arab peoples. Do not conflate with Muslim people.
comment: Hombres gay que son de países árabes, hablan árabe y/o son descendientes de pueblos árabes. No se debe confundir con personas musulmanas. @es
broader: Arab LGBTQ+ people
has top concept: LGBTQ+ people
issued: 2022-05-11
modified: 2025-02-23
type: Concept
in scheme: v3
change note: Version 4.1.0

Arab bisexual people
preferred label: Personas bisexuales árabes @es
alternative label: Bisexual Arab people
alternative label: Bisexual Arabs
alternative label: Personas árabes bisexuales @es
alternative label: Árabes bisexuales @es
comment: Bisexual people who are from Arab countries and/or are descended from Arab peoples. Do not conflate with Muslim people.
comment: Personas bisexuales que son de países árabes, hablan árabe y/o son descendientes de pueblos árabes. No se debe confundir con personas musulmanas. @es
broader: Arab LGBTQ+ people
has top concept: LGBTQ+ people
issued: 2022-05-11
modified: 2025-02-23
type: Concept
in scheme: v3
change note: Version 4.1.0

Arab transgender people
preferred label: Personas transgénero árabes @es
alternative label: Transgender Arab people
alternative label: Transgender Arabs
alternative label: Personas árabes transgénero @es
alternative label: Árabes transgénero @es
comment: Transgender people who are from Arab countries and/or are descended from Arab peoples. Do not conflate with Muslim people.
comment: Personas transgénero que son de países árabes, hablan árabe y/o son descendientes de pueblos árabes. No se debe confundir con personas musulmanas. @es
broader: Arab LGBTQ+ people
has top concept: LGBTQ+ people
issued: 2022-05-11
modified: 2025-02-23
type: Concept
in scheme: v3
change note: Version 4.1.0

Arab queer people
preferred label: Personas queer árabes @es
alternative label: Queer Arab people
alternative label: Queer Arabs
alternative label: Personas árabes queer @es
alternative label: Árabes queer @es
comment: Queer people who are from Arab countries and/or are descended from Arab peoples. Do not conflate with Muslim people.
comment: Personas queer que son de países árabes, hablan árabe y/o descienden de pueblos árabes. No se debe confundir con personas musulmanas. @es
broader: Arab LGBTQ+ people
has top concept: LGBTQ+ people
issued: 2022-05-11
modified: 2025-02-23
type: Concept
in scheme: v3
change note: Version 4.1.0

Arab asexual people
preferred label: Personas asexuales árabes @es
alternative label: Asexual Arab people
alternative label: Asexual Arabs
alternative label: Personas árabes asexuales @es
alternative label: Árabes asexuales @es
comment: Asexual people who are from Arab countries and/or are descended from Arab peoples. Do not conflate with Muslim people.
comment: Personas asexuales que son de países árabes, hablan árabe y/o son descendientes de pueblos árabes. No se debe confundir con personas musulmanas. @es
broader: Arab LGBTQ+ people
has top concept: LGBTQ+ people
issued: 2022-05-11
modified: 2025-02-23
type: Concept
in scheme: v3
change note: Version 4.1.0

Arab intersex people
preferred label: Personas intersexuales árabes @es
alternative label: Intersex Arab people
alternative label: Intersex Arabs
alternative label: Personas árabes intersex @es
alternative label: Árabes intersex @es
alternative label: Personas intersex árabes @es
comment: Intersex people who are from Arab countries and/or are descended from Arab peoples. Do not conflate with Muslim people.
comment: Personas intersexuales que son de países árabes, hablan árabe y/o son descendientes de pueblos árabes. No se debe confundir con personas musulmanas. @es
broader: Arab LGBTQ+ people
has top concept: LGBTQ+ people
issued: 2022-05-11
modified: 2025-02-23
type: Concept
in scheme: v3
change note: Version 4.1.0

Chicano/a/x gay men
preferred label: Hombres gay chicanos @es
alternative label: Chicano gay men
alternative label: Chicanx gay men
alternative label: Gay Chicanos
alternative label: Gay Chicanx men
alternative label: Gay Chicanxs
alternative label: Chicanos gay @es
alternative label: Gays chicanos @es
comment: Gay men of Mexican descent born in the United States; only use to describe people who self-identify as Chicano, Chicana, or Chicanx. Do not conflate with Latino/a/x or Hispanic people.
comment: Hombres gay de ascendencia mexicana nacidos en Estados Unidos; utilícese únicamente para describir a personas que se autoidentifiquen como chicanas. No se debe confundir con latinos/a/x o hispanos. @es
broader: Chicano/a/x LGBTQ+ people
related: Banjees
has top concept: LGBTQ+ people
issued: 2022-05-11
modified: 2025-02-23
type: Concept
in scheme: v3
change note: Version 4.1.0

Chicano/a/x bisexual people
preferred label: Personas bisexuales chicanas @es
alternative label: Bisexual Chicanas
alternative label: Bisexual Chicanos
alternative label: Bisexual Chicanx people
alternative label: Bisexual Chicanxs
alternative label: Chicana bisexual people
alternative label: Chicano bisexual people
alternative label: Chicanx bisexual people
alternative label: Chicanas bisexuales @es
alternative label: Chicanos bisexuales @es
alternative label: Chicanxs bisexuales @es
alternative label: Personas chicanas bisexuales|| @es
comment: Bisexual people of Mexican descent born in the United States; only use to describe people who self-identify as Chicano, Chicana, or Chicanx. Do not conflate with Latino/a/x or Hispanic people.
comment: Personas bisexuales de ascendencia mexicana nacidas en Estados Unidos; utilícese únicamente para describir a personas que se autoidentifiquen como chicanas. No se debe confundir con latinos/a/x o hispanos. @es
broader: Chicano/a/x LGBTQ+ people
has top concept: LGBTQ+ people
issued: 2022-05-11
modified: 2025-02-23
type: Concept
in scheme: v3
change note: Version 4.1.0

Chicano/a/x transgender people
preferred label: Personas transgénero chicanas @es
alternative label: Chicana transgender people
alternative label: Chicano transgender people
alternative label: Chicanx transgender people
alternative label: Transgender Chicanas
alternative label: Transgender Chicanos
alternative label: Transgender Chicanx people
alternative label: Transgender Chicanxs
alternative label: Personas chicanas transgénero @es
alternative label: Chicanos transgénero @es
alternative label: Chicanas transgénero @es
alternative label: Chicanxs transgénero|| @es
comment: Transgender people of Mexican descent born in the United States; only use to describe people who self-identify as Chicano, Chicana, or Chicanx. Do not conflate with Latino/a/x or Hispanic people.
comment: Personas transgénero de ascendencia mexicana nacidas en Estados Unidos; utilícese únicamente para describir a personas que se autoidentifiquen como chicanas. No se debe confundir con latinos/a/x o hispanos. @es
broader: Chicano/a/x LGBTQ+ people
has top concept: LGBTQ+ people
issued: 2022-05-11
modified: 2025-02-23
type: Concept
in scheme: v3
change note: Version 4.1.0

Chicano/a/x queer people
preferred label: Personas queer chicanas @es
alternative label: Chicana queer people
alternative label: Chicano queer people
alternative label: Chicanx queer people
alternative label: Queer Chicanas
alternative label: Queer Chicanos
alternative label: Queer Chicanx people
alternative label: Queer Chicanxs
alternative label: Personas chicanas queer @es
alternative label: Chicanos queer @es
alternative label: Chicanas queer @es
alternative label: Chicanxs queer|| @es
comment: Queer people of Mexican descent born in the United States; only use to describe people who self-identify as Chicano, Chicana, or Chicanx. Do not conflate with Latino/a/x or Hispanic people.
comment: Personas queer de ascendencia mexicana nacidas en Estados Unidos; utilícese únicamente para describir a personas que se autoidentifiquen como chicanas. No se debe confundir con latinos/a/x o hispanos. @es
broader: Chicano/a/x LGBTQ+ people
has top concept: LGBTQ+ people
issued: 2022-05-11
modified: 2025-02-23
type: Concept
in scheme: v3
change note: Version 4.1.0

Chicano/a/x intersex people
preferred label: Personas intersexuales chicanas @es
alternative label: Chicana intersex people
alternative label: Chicano intersex people
alternative label: Chicanx intersex people
alternative label: Intersex Chicanas
alternative label: Intersex Chicanos
alternative label: Intersex Chicanx people
alternative label: Intersex Chicanxs
alternative label: Personas intersex chicanas @es
alternative label: Chicanas intersex @es
alternative label: Chicanos intersex @es
alternative label: Chicanxs intersex|| @es
comment: Intersex people of Mexican descent born in the United States; only use to describe people who self-identify as Chicano, Chicana, or Chicanx. Do not conflate with Latino/a/x or Hispanic people.
comment: Personas intersexuales de ascendencia mexicana nacidas en Estados Unidos; utilícese únicamente para describir a personas que se autoidentifiquen como chicanas. No se debe confundir con latinos/a/x o hispanos. @es
broader: Chicano/a/x LGBTQ+ people
has top concept: LGBTQ+ people
issued: 2022-05-11
modified: 2025-02-23
type: Concept
in scheme: v3
change note: Version 4.1.0

Hispanic LGBTQ+ people
preferred label: Personas LGBTQ+ hispanas @es
alternative label: Hispanic people (LGBTQ)
alternative label: LGBTQ+ Hispanic people
alternative label: LGBTQ+ Hispanics
alternative label: Personas hispanas (LGBTQ) @es
alternative label: Personas hispanas LGBTQ+ @es
alternative label: Hispanos LGBTQ+ @es
comment: LGBTQ+ people who are from or descended from Spain or other regions formerly colonized by Spain that are primarily Spanish-speaking. Only use for individuals who self-identify as Hispanic; do not conflate with Latino/a/x or Chicano/a/x.
comment: Personas LGBTQ+ que hablan español, son de países de habla hispana y/o descienden de culturas de habla hispana; utilícese únicamente para personas que se autoidentifiquen como hispanas. No debe combinarse con Latino/a/x o Chicano/a/x. @es
broader: LGBTQ+ people of shared ethnic or national identities
narrower: Hispanic lesbians
narrower: Hispanic gay men
narrower: Hispanic bisexual people
narrower: Hispanic transgender people
narrower: Hispanic queer people
narrower: Hispanic intersex people
narrower: Hispanic non-binary people
narrower: Hispanic asexual people
narrower: Hispanic American LGBTQ+ people
has top concept: LGBTQ+ people
issued: 2022-05-16
modified: 2025-02-23
type: Concept
in scheme: v3
change note: Version 4.1.0

Hispanic lesbians
preferred label: Lesbianas hispanas @es
alternative label: Lesbian Hispanics
alternative label: Hispanas lesbianas @es
comment: Lesbians who are from or descended from Spain or other regions formerly colonized by Spain that are primarily Spanish-speaking. Only use for individuals who self-identify as Hispanic; do not conflate with Latino/a/x or Chicano/a/x.
comment: Lesbianas que hablan español, son de países de habla hispana y/o descienden de culturas de habla hispana; utilícese únicamente para personas que se autoidentifiquen como hispanas. No debe combinarse con Latino/a/x o Chicano/a/x. @es
broader: Hispanic LGBTQ+ people
has top concept: LGBTQ+ people
issued: 2022-05-16
modified: 2025-02-23
type: Concept
in scheme: v3
change note: Version 4.1.0

Hispanic gay men
preferred label: Hombres gay hispanos @es
alternative label: Gay Hispanic men
alternative label: Gay Hispanics
alternative label: Hombres hispanos gay @es
alternative label: Hispanos gay @es
comment: Gay men who are from or descended from Spain or other regions formerly colonized by Spain that are primarily Spanish-speaking. Only use for individuals who self-identify as Hispanic; do not conflate with Latino/a/x or Chicano/a/x.
comment: Hombres gay que hablan español, son de países de habla hispana y/o descienden de culturas de habla hispana; utilícese únicamente para personas que se autoidentifiquen como hispanas. No debe combinarse con Latino/a/x o Chicano/a/x. @es
broader: Hispanic LGBTQ+ people
has top concept: LGBTQ+ people
issued: 2022-05-16
modified: 2025-02-23
type: Concept
in scheme: v3
change note: Version 4.1.0

Hispanic bisexual people
preferred label: Personas bisexuales hispanas @es
alternative label: Bisexual Hispanic people
alternative label: Bisexual Hispanics
alternative label: Bisexuales hispanos @es
alternative label: Personas hispanas bisexuales @es
comment: Bisexual people who are from or descended from Spain or other regions formerly colonized by Spain that are primarily Spanish-speaking. Only use for individuals who self-identify as Hispanic; do not conflate with Latino/a/x or Chicano/a/x.
comment: Personas bisexuales que hablan español, son de países de habla hispana y/o descienden de culturas de habla hispana; utilícese únicamente para personas que se autoidentifiquen como hispanas. No debe combinarse con Latino/a/x o Chicano/a/x. @es
broader: Hispanic LGBTQ+ people
has top concept: LGBTQ+ people
issued: 2022-05-16
modified: 2025-02-23
type: Concept
in scheme: v3
change note: Version 4.1.0

Hispanic transgender people
preferred label: Personas transgénero hispanas @es
alternative label: Transgender Hispanic people
alternative label: Transgender Hispanics
alternative label: Personas hispanas transgénero @es
alternative label: Hispanos transgénero @es
comment: Trans people who are from or descended from Spain or other regions formerly colonized by Spain that are primarily Spanish-speaking. Only use for individuals who self-identify as Hispanic; do not conflate with Latino/a/x or Chicano/a/x.
comment: Personas transgénero que hablan español, son de países de habla hispana y/o descienden de culturas de habla hispana; utilícese únicamente para personas que se autoidentifiquen como hispanas. No debe combinarse con Latino/a/x o Chicano/a/x. @es
broader: Hispanic LGBTQ+ people
has top concept: LGBTQ+ people
issued: 2022-05-16
modified: 2025-02-23
type: Concept
in scheme: v3
change note: Version 4.1.0

Hispanic queer people
preferred label: Personas queer hispanas @es
alternative label: Queer Hispanic people
alternative label: Queer Hispanics
alternative label: Hispanos queer @es
comment: Queer people who are from or descended from Spain or other regions formerly colonized by Spain that are primarily Spanish-speaking. Only use for individuals who self-identify as Hispanic; do not conflate with Latino/a/x or Chicano/a/x.
comment: Personas queer que hablan español, son de países de habla hispana y/o descienden de culturas de habla hispana; utilícese únicamente para personas que se autoidentifiquen como hispanas. No debe combinarse con Latino/a/x o Chicano/a/x. @es
broader: Hispanic LGBTQ+ people
has top concept: LGBTQ+ people
issued: 2022-05-16
modified: 2025-02-23
type: Concept
in scheme: v3
change note: Version 4.1.0

Hispanic intersex people
preferred label: Personas intersexuales hispanas @es
alternative label: Intersex Hispanic people
alternative label: Intersex Hispanics
alternative label: Intersex hispanas @es
alternative label: Personas hispanas intersex @es
alternative label: Personas intersex hispanas @es
comment: Intersex people who are from or descended from Spain or other regions formerly colonized by Spain that are primarily Spanish-speaking. Only use for individuals who self-identify as Hispanic; do not conflate with Latino/a/x or Chicano/a/x.
comment: Personas intersexuales que hablan español, son de países de habla hispana y/o descienden de culturas de habla hispana; utilícese únicamente para personas que se autoidentifiquen como hispanas. No debe combinarse con Latino/a/x o Chicano/a/x. @es
broader: Hispanic LGBTQ+ people
has top concept: LGBTQ+ people
issued: 2022-05-16
modified: 2025-02-23
type: Concept
in scheme: v3
change note: Version 4.1.0

LGBTQ+ people in the workplace
preferred label: Personas LGBTQ+ en el lugar de trabajo @es
alternative label: People in the workplace (LGBTQ)
comment: The presence of LGBTQ+ people in the workplace, including acceptance of and issues faced by LGBTQ+ workers.
comment: La presencia de personas LGBTQ+ en el lugar de trabajo, incluida la aceptación de los trabajadores LGBTQ+ y los problemas a los que se enfrentan. @es
broader: LGBTQ+ employment
narrower: Lesbians in the workplace
narrower: Gay men in the workplace
narrower: Bisexual people in the workplace
narrower: Transgender people in the workplace
narrower: Queer people in the workplace
narrower: Intersex people in the workplace
narrower: Asexual people in the workplace
related: LGBTQ+-owned businesses
related: LGBTQ+-focused businesses
related: Two-Spirit people in the workplace
has top concept: LGBTQ+ employment
issued: 2022-06-15
modified: 2025-02-23
type: Concept
in scheme: v3
change note: Version 4.1.0

Lesbians in the workplace
preferred label: Lesbianas en el lugar de trabajo @es
comment: The presence of lesbians in the workplace, including acceptance of and issues faced by lesbian workers.
comment: La presencia de lesbianas en el lugar de trabajo, incluida la aceptación de las trabajadoras lesbianas y los problemas a los que se enfrentan. @es
broader: LGBTQ+ people in the workplace
related: Lesbian-owned businesses
related: Lesbian-focused businesses
has top concept: LGBTQ+ employment
issued: 2022-06-15
modified: 2025-02-23
type: Concept
in scheme: v3
change note: Version 4.1.0

Gay men in the workplace
preferred label: Hombres gay en el ejército @es
alternative label: Hombres gay en las fuerzas armadas @es
comment: The presence of gay men in the workplace, including acceptance of and issues faced by gay workers.
comment: Hombres gay que sirven en las fuerzas armadas estatales y nacionales. @es
broader: LGBTQ+ people in the workplace
related: Gay-owned businesses
related: Gay-focused businesses
has top concept: LGBTQ+ employment
issued: 2022-06-15
modified: 2025-02-23
type: Concept
in scheme: v3
change note: Version 4.1.0

Bisexual people in the workplace
preferred label: Personas bisexuales en fandom @es
alternative label: Bisexuales en fandom @es
comment: The presence of bisexual people in the workplace, including acceptance of and issues faced by bisexual workers.
comment: La participación e inclusión de personas bisexuales en las comunidades de fans. @es
broader: LGBTQ+ people in the workplace
related: Bisexual-owned businesses
related: Bisexual-focused businesses
has top concept: LGBTQ+ employment
issued: 2022-06-15
modified: 2025-02-23
type: Concept
in scheme: v3
change note: Version 4.1.0

Transgender people in the workplace
preferred label: Personas transgénero en el lugar de trabajo @es
comment: The presence of transgender people in the workplace, including acceptance of and issues faced by transgender workers.
comment: La presencia de personas transgénero en el lugar de trabajo, incluida la aceptación de los trabajadores transgénero y los problemas a los que se enfrentan. @es
broader: LGBTQ+ people in the workplace
related: Transgender people
related: Transgender-owned businesses
related: Transgender-focused businesses
has top concept: LGBTQ+ employment
issued: 2022-06-15
modified: 2025-02-23
type: Concept
in scheme: v3
change note: Version 4.1.0

Queer people in the workplace
preferred label: Personas queer en el lugar de trabajo @es
comment: The presence of queer people in the workplace, including acceptance of and issues faced by queer workers.
comment: La presencia de personas queer en el lugar de trabajo, incluida la aceptación de los trabajadores queer y los problemas a los que se enfrentan. @es
broader: LGBTQ+ people in the workplace
related: Queer-owned businesses
related: Queer-focused businesses
has top concept: LGBTQ+ employment
issued: 2022-06-15
modified: 2025-02-23
type: Concept
in scheme: v3
change note: Version 4.1.0

Two-Spirit people in the workplace
preferred label: Personas dos espíritus en el lugar de trabajo @es
comment: The presence of Two-Spirit people in the workplace, including acceptance of and issues faced by Two-Spirit workers.
comment: La presencia de personas dos espíritus en el lugar de trabajo, incluida la aceptación de los trabajadores dos espíritus y los problemas a los que se enfrentan. @es
broader: Two-Spirit people
related: LGBTQ+ people in the workplace
has top concept: Gender
issued: 2022-06-15
modified: 2025-02-23
type: Concept
in scheme: v3
change note: Version 4.1.0

Intersex people in the workplace
preferred label: Personas intersex en el lugar trabajo @es
comment: The presence of intersex people in the workplace, including acceptance of and issues faced by intersex workers.
comment: La presencia de personas intersex en el lugar de trabajo, incluida la aceptación de los trabajadores intersex y los problemas a los que se enfrentan. @es
broader: LGBTQ+ people in the workplace
has top concept: LGBTQ+ employment
issued: 2022-06-15
modified: 2025-02-23
type: Concept
in scheme: v3
change note: Version 4.1.0

Asexual people in the workplace
preferred label: Personas asexuales en el lugar de trabajo @es
comment: The presence of asexual people in the workplace, including acceptance of and issues faced by asexual workers.
comment: La presencia de personas asexuales en el lugar de trabajo, incluida la aceptación de los trabajadores asexuales y los problemas a los que se enfrentan. @es
broader: LGBTQ+ people in the workplace
has top concept: LGBTQ+ employment
issued: 2022-06-15
modified: 2025-02-23
type: Concept
in scheme: v3
change note: Version 4.1.0

Racism
preferred label: Racismo @es
comment: The belief that groups of human beings possess different inherent behavioral traits that correspond to inherited attributes and can be divided based on the superiority of one race over another. This term also encompasses prejudice, discrimination, and antagonism (whether personal or systematic) directed against other people because of their race and its perceived inferiority.
comment: La creencia de que grupos de seres humanos poseen diferentes rasgos de comportamiento inherentes que corresponden a atributos heredados y que pueden dividirse en función de la superioridad de una raza sobre otra. Este término también abarca prejuicios, discriminación y antagonismo (ya sea personal o sistemático) dirigido contra otras personas debido a su raza y su percibida inferioridad. @es
narrower: Racism in fandom
narrower: Anti-Blackness
related: Critical race theory
related: Transmisogynoir
related: Misogynoir
related: Anti-racism
related: Black feminism
related: White feminism
related: Womanism
related: Gentrification
related: Redlining
issued: 2022-06-15
modified: 2025-02-23
type: Concept
in scheme: v3
change note: Version 4.1.0

Feminist theory
preferred label: Teoría feminista @es
alternative label: Feminist philosophy
alternative label: Theory of feminism
alternative label: Filosofía feminista @es
alternative label: Teoría del feminismo @es
comment: The extension of feminism into theoretical, fictional, or philosophical discourse, often seeking to understand the nature of gender inequity.
comment: La extensión del feminismo al discurso teórico, ficticio o filosófico, que a menudo trata de comprender la naturaleza de la desigualdad de género. @es
broader: Theories
narrower: Female gaze
narrower: Male gaze
narrower: Rape culture
narrower: Feminist film criticism
related: Feminism
related: Gender studies
related: Queer studies
has top concept: Theories
issued: 2022-06-15
modified: 2025-02-23
type: Concept
in scheme: v3
change note: Version 4.1.0

Female gaze
preferred label: Mirada femenina @es
comment: A term used to describe the depiction of women in media and the arts as subjects with agency and whose perspective a text may be presented from. Often used in contrast to the male gaze.
comment: Término utilizado para describir la representación de las mujeres en los medios y las artes como sujetos con agencia y desde cuya perspectiva se puede presentar un texto. A menudo, se utiliza en contraste a la mirada masculina. @es
broader: Feminist theory
related: Queer gaze
has top concept: Theories
issued: 2022-06-15
modified: 2025-02-23
type: Concept
in scheme: v3
change note: Version 4.1.0

Male gaze
preferred label: Mirada masculina @es
comment: A term used to describe the sexualized and objectified depiction of women in media and the arts from the perspective of and for the pleasure of the heterosexual man/male viewer. Originally used solely to describe the heterosexual, cisgender gaze but has since been expanded.
comment: Término utilizado para describir la representación sexualizada y cosificada de las mujeres en los medios y las artes desde la perspectiva y para el placer hombre heterosexual/espectador masculino. Originalmente se utilizaba únicamente para describir la mirada heterosexual y cisgénero, pero desde entonces se ha ampliado. @es
broader: Feminist theory
related: Queer gaze
has top concept: Theories
issued: 2022-06-15
modified: 2025-02-23
type: Concept
in scheme: v3
change note: Version 4.1.0

Queer gaze
preferred label: Mirada queer @es
comment: A term used to describe the ways LGBTQ+ people create and engage with media and art, in contrast to the male gaze, female gaze, or straight gaze.
comment: Un término utilizado para describir las formas en que las personas LGBTQ+ crean e interactúan con los medios y el arte, en contraste a la mirada masculina, la mirada femenina o la mirada hetero. @es
broader: Queer theory
related: Queer (Verb)
related: Female gaze
related: Male gaze
has top concept: Theories
issued: 2022-06-15
modified: 2025-02-23
type: Concept
in scheme: v3
change note: Version 4.1.0

Feminine of center
alternative label: FOC
alternative label: Fem of center
alternative label: Femme of center
comment: Term used to describe individuals whose gender expression is more feminine than androgynous. Generally used as a self-descriptor within LGBTQ+ communities.
broader: Femininities
related: Femmes
related: Transfeminine people
related: Trans women
related: Demigirls
related: Masculine of center
has top concept: Gender
issued: 2022-06-15
modified: 2025-02-23
type: Concept
in scheme: v3
change note: Version 4.1.0

South Asian LGBTQ+ people
preferred label: Personas LGBTQ+ sudasiáticas @es
alternative label: LGBTQ+ South Asian people
alternative label: LGBTQ+ South Asians
alternative label: South Asian people (LGBTQ)
alternative label: South Asians (LGBTQ)
alternative label: Personas sudasiáticas LGBTQ+ @es
comment: LGBTQ+ people who belong to or are descended from the ethnolinguistic groups of South Asia.
comment: Personas LGBTQ+ que pertenecen a o descienden de los grupos etnolingüísticos del sur de Asia. @es
broader: LGBTQ+ people of shared ethnic or national identities
broader: LGBTQ+ people of color
narrower: South Asian lesbians
narrower: South Asian gay men
narrower: South Asian bisexual people
narrower: South Asian queer people
narrower: South Asian intersex people
narrower: South Asian transgender people
narrower: South Asian asexual people
narrower: Indian LGBTQ+ people
narrower: South Asian non-binary people
has top concept: LGBTQ+ people
issued: 2022-06-15
modified: 2025-02-23
type: Concept
in scheme: v3
change note: Version 4.1.0

South Asian lesbians
preferred label: Lesbianas sudasiáticas @es
alternative label: Lesbian South Asian people
alternative label: Lesbian South Asians
comment: Lesbians who belong to or are descended from the ethnolinguistic groups of South Asia.
comment: Lesbianas que pertenecen a o descienden de los grupos etnolingüísticos del sur de Asia. @es
broader: South Asian LGBTQ+ people
has top concept: LGBTQ+ people
issued: 2022-06-15
modified: 2025-02-23
type: Concept
in scheme: v3
change note: Version 4.1.0

South Asian gay men
preferred label: Hombres gay sudasiáticos @es
alternative label: Gay South Asian men
alternative label: Gay South Asians
alternative label: Hombres sudasiáticos gay @es
comment: Gay men who belong to or are descended from the ethnolinguistic groups of South Asia.
comment: Hombres gay que a pertenecen o descienden de los grupos etnolingüísticos del sur de Asia. @es
broader: South Asian LGBTQ+ people
has top concept: LGBTQ+ people
issued: 2022-06-15
modified: 2025-02-23
type: Concept
in scheme: v3
change note: Version 4.1.0

South Asian bisexual people
preferred label: Personas bisexuales sudasiáticas @es
alternative label: Bisexual South Asian men
alternative label: Bisexual South Asians
alternative label: Personas sudasiáticas bisexuales @es
comment: Bisexual people who belong to or are descended from the ethnolinguistic groups of South Asia.
comment: Personas bisexuales que a pertenecen o descienden de los grupos etnolingüísticos del sur de Asia. @es
broader: South Asian LGBTQ+ people
has top concept: LGBTQ+ people
issued: 2022-06-15
modified: 2025-02-23
type: Concept
in scheme: v3
change note: Version 4.1.0

South Asian queer people
preferred label: Personas queer sudasiáticas @es
alternative label: Queer South Asian people
alternative label: Queer South Asians
alternative label: Sudasiáticos queer @es
alternative label: Personas sudasiáticas queer @es
comment: Queer people who belong to or are descended from the ethnolinguistic groups of South Asia.
comment: Personas queer que pertenecen a o descienden de los grupos etnolingüísticos del sur de Asia. @es
broader: South Asian LGBTQ+ people
has top concept: LGBTQ+ people
issued: 2022-06-15
modified: 2025-02-23
type: Concept
in scheme: v3
change note: Version 4.1.0

South Asian intersex people
preferred label: Personas intersexuales sudasiáticas @es
alternative label: Intersex South Asian people
alternative label: Intersex South Asians
alternative label: Personas intersex sudasiáticas @es
comment: Intersex people who belong to or are descended from the ethnolinguistic groups of South Asia.
comment: Personas intersexuales que pertenecen a o descienden de los grupos etnolingüísticos del sur de Asia. @es
broader: South Asian LGBTQ+ people
has top concept: LGBTQ+ people
issued: 2022-06-15
modified: 2025-02-23
type: Concept
in scheme: v3
change note: Version 4.1.0

South Asian transgender people
preferred label: Personas transgénero sudasiáticas @es
alternative label: Transgender South Asian people
alternative label: Transgender South Asians
alternative label: Sudasiáticos transgénero @es
alternative label: Personas sudasiáticas transgénero @es
comment: Transgender people who belong to or are descended from the ethnolinguistic groups of South Asia.
comment: Personas transgénero que pertenecen a o descienden de los grupos etnolingüísticos del sur de Asia. @es
broader: South Asian LGBTQ+ people
has top concept: LGBTQ+ people
issued: 2022-06-15
modified: 2025-02-23
type: Concept
in scheme: v3
change note: Version 4.1.0

South Asian asexual people
preferred label: Personas asexuales sudasiáticas @es
alternative label: Asexual South Asian people
alternative label: Asexual South Asians
alternative label: Personas sudasiáticas asexuales @es
comment: Asexual people who belong to or are descended from the ethnolinguistic groups of South Asia.
comment: Personas asexuales que pertenecen a o descienden de los grupos etnolingüísticos del sur de Asia. @es
broader: South Asian LGBTQ+ people
has top concept: LGBTQ+ people
issued: 2022-06-15
modified: 2025-02-23
type: Concept
in scheme: v3
change note: Version 4.1.0

Indian LGBTQ+ people
preferred label: Personas LGBTQ+ indias @es
alternative label: Indian people (LGBTQ)
alternative label: Indians (LGBTQ)
alternative label: LGBTQ+ Indians
alternative label: Personas LGBTQ+ de la India @es
alternative label: Personas indias LGBTQ+ @es
comment: LGBTQ+ people who were born in India or are of Indian descent. Do not conflate with the Indigenous peoples of the United States.
comment: Personas LGBTQ+ que nacieron en la India o son de ascendencia india. No se debe confundir con los pueblos indígenas de los Estados Unidos. @es
broader: South Asian LGBTQ+ people
narrower: Indian lesbians
narrower: Indian gay men
narrower: Indian bisexual people
narrower: Indian queer people
narrower: Indian intersex people
narrower: Indian transgender people
narrower: Indian asexual people
has top concept: LGBTQ+ people
issued: 2022-06-15
modified: 2025-02-23
type: Concept
in scheme: v3
change note: Version 4.1.0

Indian lesbians
preferred label: Lesbianas indias @es
alternative label: Lesbian Indians
alternative label: Lesbianas de India @es
alternative label: Indias lesbianas @es
comment: Lesbians who were born in India or are of Indian descent. Do not conflate with the Indigenous peoples of the United States.
comment: Lesbianas que nacieron en la India o son de ascendencia india. No se debe confundir con los pueblos indígenas de los Estados Unidos. @es
broader: Indian LGBTQ+ people
has top concept: LGBTQ+ people
issued: 2022-06-15
modified: 2025-02-23
type: Concept
in scheme: v3
change note: Version 4.1.0

Indian gay men
preferred label: Hombres gay indios @es
alternative label: Gay Indian men
alternative label: Gay Indians
alternative label: Hombres gay de India @es
alternative label: Indios gay @es
comment: Gay men who were born in India or are of Indian descent. Do not conflate with the Indigenous peoples of the United States.
comment: Hombres gay que nacieron en la India o son de ascendencia india. No se debe confundir con los pueblos indígenas de los Estados Unidos. @es
broader: Indian LGBTQ+ people
has top concept: LGBTQ+ people
issued: 2022-06-15
modified: 2025-02-23
type: Concept
in scheme: v3
change note: Version 4.1.0

Indian bisexual people
preferred label: Personas bisexuales indias @es
alternative label: Bisexual Indian people
alternative label: Bisexual Indians
alternative label: Personas bisexuales de India @es
alternative label: Bisexuales indios @es
comment: Bisexual people who were born in India or are of Indian descent. Do not conflate with the Indigenous peoples of the United States.
comment: Personas bisexuales que nacieron en la India o son de ascendencia india. No se debe confundir con los pueblos indígenas de los Estados Unidos. @es
broader: Indian LGBTQ+ people
has top concept: LGBTQ+ people
issued: 2022-06-15
modified: 2025-02-23
type: Concept
in scheme: v3
change note: Version 4.1.0

Indian queer people
preferred label: Personas queer indias @es
alternative label: Queer Indian people
alternative label: Queer Indians
alternative label: Personas queer de India @es
alternative label: Personas indias queer @es
comment: Queer people who were born in India or are of Indian descent. Do not conflate with the Indigenous peoples of the United States.
comment: Personas queer que nacieron en la India o son de ascendencia india. No se debe confundir con los pueblos indígenas de los Estados Unidos. @es
broader: Indian LGBTQ+ people
has top concept: LGBTQ+ people
issued: 2022-06-15
modified: 2025-02-23
type: Concept
in scheme: v3
change note: Version 4.1.0

Indian intersex people
preferred label: Personas intersexuales indias @es
alternative label: Intersex Indian people
alternative label: Intersex Indians
alternative label: Personas intersex de India @es
alternative label: Indios intersex @es
alternative label: Personas intersex indias @es
comment: Intersex people who were born in India or are of Indian descent. Do not conflate with the Indigenous peoples of the United States.
comment: Personas intersexuales que nacieron en la India o son de ascendencia india. No se debe confundir con los pueblos indígenas de los Estados Unidos. @es
broader: Indian LGBTQ+ people
has top concept: LGBTQ+ people
issued: 2022-06-15
modified: 2025-02-23
type: Concept
in scheme: v3
change note: Version 4.1.0

Indian transgender people
preferred label: Personas transgénero indias @es
alternative label: Transgender Indian people
alternative label: Transgender Indians
alternative label: Personas transgénero de India @es
alternative label: Personas indias transgénero @es
comment: Transgender people who were born in India or are of Indian descent. Do not conflate with the Indigenous peoples of the United States.
comment: Personas transgénero que nacieron en la India o son de ascendencia india. No se debe confundir con los pueblos indígenas de los Estados Unidos. @es
broader: Indian LGBTQ+ people
has top concept: LGBTQ+ people
issued: 2022-06-15
modified: 2025-02-23
type: Concept
in scheme: v3
change note: Version 4.1.0

Indian asexual people
preferred label: Personas asexuales indias @es
alternative label: Asexual Indian people
alternative label: Asexual Indians
alternative label: Personas asexuales de India @es
alternative label: Asexuales indios @es
comment: Asexual people who were born in India or are of Indian descent. Do not conflate with the Indigenous peoples of the United States.
comment: Personas asexuales que nacieron en la India o son de ascendencia india. No se debe confundir con los pueblos indígenas de los Estados Unidos. @es
broader: Indian LGBTQ+ people
has top concept: LGBTQ+ people
issued: 2022-06-15
modified: 2025-02-23
type: Concept
in scheme: v3
change note: Version 4.1.0

Assamese LGBTQ+ people
preferred label: Personas LGBTQ+ asamesas @es
alternative label: Asomiya (LGBTQ)
alternative label: Assamese people (LGBTQ)
alternative label: LGBTQ+ Asomiya
alternative label: LGBTQ+ Assamese people
alternative label: Personas asamesas (LGBTQ) @es
alternative label: Asameses LGBTQ+ @es
alternative label: Personas asamesas LGBTQ+ @es
alternative label: Asamesas LGBTQ+ @es
comment: LGBTQ+ people who are a part of the socio-ethnic Assamese peoples, speak the Assamese language, or reside in the Indian state of Assam. Only use for people who identify as Assamese.
comment: Personas LGBTQ+ que forman parte de los pueblos socioétnicos asameses, hablan la lengua asamesa o residen en el estado indio de Assam. @es
broader: LGBTQ+ people of shared ethnic or national identities
broader: LGBTQ+ people of color
narrower: Assamese lesbians
narrower: Assamese gay men
narrower: Assamese bisexual people
narrower: Assamese queer people
narrower: Assamese intersex people
narrower: Assamese transgender people
narrower: Assamese asexual people
narrower: Assamese non-binary people
has top concept: LGBTQ+ people
issued: 2022-06-15
modified: 2025-02-23
type: Concept
in scheme: v3
change note: Version 4.1.0

Masculine of center
preferred label: Masculino de centro @es
alternative label: MOC
alternative label: Masc of center
comment: Term used to describe individuals whose gender expression is more masculine than androgynous. Generally used as a self-descriptor within LGBTQ+ communities.
comment: Término utilizado para describir a personas cuya expresión de género es más masculina que andrógina. Generalmente se utiliza como término para la autodescripción dentro de las comunidades LGBTQ+. @es
broader: Masculinities
related: Bois
related: Butches
related: Soft butches
related: Tomboys
related: Transmasculine people
related: Trans men
related: Demiboys
related: Feminine of center
has top concept: Gender
issued: 2022-06-27
modified: 2025-02-23
type: Concept
in scheme: v3
change note: Version 4.1.0

LGBTQ+ incest survivors
preferred label: Sobrevivientes LGBTQ+ de incesto @es
alternative label: Incest survivors (LGBTQ)
alternative label: LGBTQ+ survivors of incest
alternative label: Survivors of incest (LGBTQ)
comment: LGBTQ+ people who have experienced and survived incest; follow the individual's preference for "victims" or "survivors" whenever possible.
comment: Personas LGBTQ+ que han sufrido y sobrevivido al incesto; siga la preferencia de la persona sobre el uso de "víctimas" o "sobrevivientes" siempre que sea posible. @es
broader: LGBTQ+ incest victims
has top concept: LGBTQ+ people
issued: 2022-06-27
modified: 2025-02-23
type: Concept
in scheme: v3
change note: Version 4.1.0

Assamese lesbians
preferred label: Lesbianas asamesas @es
alternative label: Lesbian Asomiya
alternative label: Asamesas lesbianas @es
comment: Lesbians who are a part of the socio-ethnic Assamese peoples, speak the Assamese language, or reside in the Indian state of Assam.
comment: Lesbianas que forman parte de los pueblos socioétnicos asameses, hablan la lengua asamesa o residen en el estado indio de Assam. @es
broader: Assamese LGBTQ+ people
has top concept: LGBTQ+ people
issued: 2022-06-27
modified: 2025-02-23
type: Concept
in scheme: v3
change note: Version 4.1.0

Assamese gay men
preferred label: Hombres gay asameses @es
alternative label: Assamese gays
alternative label: Gay Asomiya
alternative label: Gay Assamese men
alternative label: Hombres asameses gay @es
alternative label: Asameses gay @es
comment: Gay men who are a part of the socio-ethnic Assamese peoples, speak the Assamese language, or reside in the Indian state of Assam.
comment: Hombres gay que forman parte de los pueblos socioétnicos asameses, hablan la lengua asamesa o residen en el estado indio de Assam. @es
broader: Assamese LGBTQ+ people
has top concept: LGBTQ+ people
issued: 2022-06-27
modified: 2025-02-23
type: Concept
in scheme: v3
change note: Version 4.1.0

Assamese bisexual people
preferred label: Personas bisexuales asamesas @es
alternative label: Bisexual Asomiya
alternative label: Bisexual Assamese people
alternative label: Personas asamesas bisexuales @es
alternative label: Asameses bisexuales @es
alternative label: Asamesas bisexuales @es
comment: Bisexual people who are a part of the socio-ethnic Assamese peoples, speak the Assamese language, or reside in the Indian state of Assam.
comment: Personas bisexuales que forman parte de los pueblos socioétnicos asameses, hablan la lengua asamesa o residen en el estado indio de Assam. @es
broader: Assamese LGBTQ+ people
has top concept: LGBTQ+ people
issued: 2022-06-27
modified: 2025-02-23
type: Concept
in scheme: v3
change note: Version 4.1.0

Assamese queer people
preferred label: Personas queer asamesas @es
alternative label: Queer Asomiya
alternative label: Queer Assamese people
alternative label: Personas asamesas queer @es
alternative label: Asamesas queer @es
alternative label: Asameses queer @es
comment: Queer people who are a part of the socio-ethnic Assamese peoples, speak the Assamese language, or reside in the Indian state of Assam.
comment: Personas queer que forman parte de los pueblos socioétnicos asameses, hablan la lengua asamesa o residen en el estado indio de Assam. @es
broader: Assamese LGBTQ+ people
has top concept: LGBTQ+ people
issued: 2022-06-27
modified: 2025-02-23
type: Concept
in scheme: v3
change note: Version 4.1.0

Assamese intersex people
preferred label: Personas intersexuales asamesas @es
alternative label: Intersex Asomiya
alternative label: Intersex Assamese people
alternative label: Personas asamesas intersex @es
alternative label: Asameses intersex @es
alternative label: Personas intersex asamesas @es
alternative label: Asamesas intersex @es
comment: Intersex people who are a part of the socio-ethnic Assamese peoples, speak the Assamese language, or reside in the Indian state of Assam.
comment: Personas intersexuales que forman parte de los pueblos socioétnicos asameses, hablan la lengua asamesa o residen en el estado indio de Assam. @es
broader: Assamese LGBTQ+ people
has top concept: LGBTQ+ people
issued: 2022-06-27
modified: 2025-02-23
type: Concept
in scheme: v3
change note: Version 4.1.0

Assamese transgender people
preferred label: Personas transgénero asamesas @es
alternative label: Transgender Asomiya
alternative label: Transgender assamese people
alternative label: Personas asamesas transgénero @es
alternative label: Asamesas transgénero @es
alternative label: Asameses transgénero @es
comment: Transgender people who are a part of the socio-ethnic Assamese peoples, speak the Assamese language, or reside in the Indian state of Assam.
comment: Personas transgénero que forman parte de los pueblos socioétnicos asameses, hablan la lengua asamesa o residen en el estado indio de Assam. @es
broader: Assamese LGBTQ+ people
has top concept: LGBTQ+ people
issued: 2022-06-27
modified: 2025-02-23
type: Concept
in scheme: v3
change note: Version 4.1.0

Assamese asexual people
preferred label: Personas asexuales asamesas @es
alternative label: Asexual Asomiya
alternative label: Asexual Assamese people
alternative label: Personas asamesas asexuales @es
alternative label: Asameses asexuales @es
alternative label: Asamesas asexuales @es
comment: Asexual people who are a part of the socio-ethnic Assamese peoples, speak the Assamese language, or reside in the Indian state of Assam.
comment: Personas asexuales que forman parte de los pueblos socioétnicos asameses, hablan la lengua asamesa o residen en el estado indio de Assam. @es
broader: Assamese LGBTQ+ people
has top concept: LGBTQ+ people
issued: 2022-06-27
modified: 2025-02-23
type: Concept
in scheme: v3
change note: Version 4.1.0

Awadhi LGBTQ+ people
preferred label: Personas LGBTQ+ awadi @es
alternative label: Awadhi people (LGBTQ)
alternative label: Awadhis (LGBTQ)
alternative label: LGBTQ Awadhis
alternative label: LGBTQ+ Awadhi people
alternative label: Personas awadi (LGBTQ) @es
alternative label: Awadi (LGBTQ) @es
alternative label: LGBTQ+ awadi @es
alternative label: Personas awadi LGBTQ+ @es
comment: LGBTQ+ people who speak the Awadhi dialect and reside in or are descended from those who resided in the Awadh region of Uttar Pradesh.
comment: Personas LGBTQ+ que hablan el dialecto awadi, residen o descienden de quienes residieron en la región awadi de Uttar Pradesh, en el norte de India. @es
broader: LGBTQ+ people of shared ethnic or national identities
broader: LGBTQ+ people of color
narrower: Awadhi lesbians
narrower: Awadhi gay men
narrower: Awadhi bisexual people
narrower: Awadhi queer people
narrower: Awadhi transgender people
narrower: Awadhi intersex people
narrower: Awadhi asexual people
narrower: Awadhi non-binary people
has top concept: LGBTQ+ people
issued: 2022-06-27
modified: 2025-02-23
type: Concept
in scheme: v3
change note: Version 4.1.0

Awadhi lesbians
preferred label: Lesbianas awadi @es
alternative label: Lesbian Awadhis
alternative label: Awadi lesbianas @es
comment: Lesbians who speak the Awadhi dialect and reside in or are descended from those who resided in the Awadh region of Uttar Pradesh.
comment: Lesbianas que hablan el dialecto awadi, residen o descienden de quienes residieron en la región awadi de Uttar Pradesh, en el norte de India. @es
broader: Awadhi LGBTQ+ people
has top concept: LGBTQ+ people
issued: 2022-06-27
modified: 2025-02-23
type: Concept
in scheme: v3
change note: Version 4.1.0

Awadhi gay men
preferred label: Hombres gay awadi @es
alternative label: Gay Awadhi men
alternative label: Gay Awadhis
alternative label: Hombres awadi gay @es
comment: Gay men who speak the Awadhi dialect and reside in or are descended from those who resided in the Awadh region of Uttar Pradesh.
comment: Hombres gay que hablan el dialecto awadi, residen o descienden de quienes residieron en Uttar Pradesh, en el norte de India. @es
broader: Awadhi LGBTQ+ people
has top concept: LGBTQ+ people
issued: 2022-06-27
modified: 2025-02-23
type: Concept
in scheme: v3
change note: Version 4.1.0

Awadhi bisexual people
preferred label: Personas bisexuales awadi @es
alternative label: Bisexual Awadhi people
alternative label: Bisexual Awadhis
alternative label: Personas awadi bisexual @es
alternative label: Bisexuales awadi @es
comment: Bisexual people who speak the Awadhi dialect and reside in or are descended from those who resided in the Awadh region of Uttar Pradesh.
comment: Personas bisexuales que hablan el dialecto awadi, residen o o descienden de quienes residieron en la región awadi de Uttar Pradesh, en el norte de India. @es
broader: Awadhi LGBTQ+ people
has top concept: LGBTQ+ people
issued: 2022-06-27
modified: 2025-02-23
type: Concept
in scheme: v3
change note: Version 4.1.0

Awadhi queer people
preferred label: Personas queer awadi @es
alternative label: Queer Awadhi people
alternative label: Queer Awadhis
alternative label: Personas awadi queer @es
comment: Queer people who speak the Awadhi dialect and reside in or are descended from those who resided in the Awadh region of Uttar Pradesh.
comment: Personas queer que hablan el dialecto awadi, residen o descienden de quienes residieron en la región awadi de Uttar Pradesh, en el norte de India. @es
broader: Awadhi LGBTQ+ people
has top concept: LGBTQ+ people
issued: 2022-06-27
modified: 2025-02-23
type: Concept
in scheme: v3
change note: Version 4.1.0

Awadhi transgender people
preferred label: Personas transgénero awadi @es
alternative label: Transgender Awadhi people
alternative label: Transgender Awadhis
alternative label: Personas awadi transgénero @es
comment: Transgender people who speak the Awadhi dialect and reside in or are descended from those who resided in the Awadh region of Uttar Pradesh.
comment: Personas transgénero que hablan el dialecto awadi, residen o descienden de quienes residieron en la región awadi de Uttar Pradesh, en el norte de India. @es
broader: Awadhi LGBTQ+ people
has top concept: LGBTQ+ people
issued: 2022-06-27
modified: 2025-02-23
type: Concept
in scheme: v3
change note: Version 4.1.0

Awadhi intersex people
preferred label: Personas intersexuales awadi @es
alternative label: Intersex Awadhi people
alternative label: Intersex Awadhis
alternative label: Personas awadi intersex @es
alternative label: Intersex awadi @es
alternative label: Personas intersex awadi @es
comment: Intersex people who speak the Awadhi dialect and reside in or are descended from those who resided in the Awadh region of Uttar Pradesh.
comment: Personas intersexuales que hablan el dialecto awadi, residen o descienden de quienes residieron en región awadi de Uttar Pradesh, en el norte de India. @es
broader: Awadhi LGBTQ+ people
has top concept: LGBTQ+ people
issued: 2022-06-27
modified: 2025-02-23
type: Concept
in scheme: v3
change note: Version 4.1.0

Awadhi asexual people
preferred label: Personas asexuales awadi @es
alternative label: Asexual Awadhi people
alternative label: Asexual Awadhis
alternative label: Personas awadi asexual @es
alternative label: Asexuales awadi @es
comment: Asexual people who speak the Awadhi dialect and reside in or are descended from those who resided in the Awadh region of Uttar Pradesh.
comment: Personas asexuales que hablan el dialecto awadi, residen o descienden de quienes residieron en la región awadi de Uttar Pradesh, en el norte de India. @es
broader: Awadhi LGBTQ+ people
has top concept: LGBTQ+ people
issued: 2022-06-27
modified: 2025-02-23
type: Concept
in scheme: v3
change note: Version 4.1.0

Bhojpuri LGBTQ+ people
preferred label: Personas LGBTQ+ bhojpuri @es
alternative label: Bhojpuri people (LGBTQ)
alternative label: Bhojpuriyas (LGBTQ)
alternative label: LGBTQ+ Bhojpuri people
alternative label: LGBTQ+ Bhojpuriyas
alternative label: Personas bhojpuri (LGBTQ) @es
alternative label: Personas bhojpuriyas LGBTQ+ @es
alternative label: Bhojpuriyas LGBTQ+ @es
comment: LGBTQ+ people who speak the Bhojpuri language and live in or are descended from those who inhabited the Bhojpuri-Purvanchal region of India and Nepal.
comment: Personas LGBTQ+ que hablan el idioma bhojpuri y viven, pertenecen o son descendientes de quienes habitaron la región de Bhojpuri-Purvanchal de India y Nepal. @es
broader: LGBTQ+ people of shared ethnic or national identities
broader: LGBTQ+ people of color
narrower: Bhojpuri lesbians
narrower: Bhojpuri gay men
narrower: Bhojpuri bisexual people
narrower: Bhojpuri queer people
narrower: Bhojpuri transgender people
narrower: Bhojpuri intersex people
narrower: Bhojpuri asexual people
narrower: Bhojpuri non-binary people
has top concept: LGBTQ+ people
issued: 2022-06-27
modified: 2025-02-23
type: Concept
in scheme: v3
change note: Version 4.1.0

Bhojpuri lesbians
preferred label: Lesbianas bhojpuri @es
alternative label: Lesbian Bhojpuriyas
alternative label: Bhojpuri lesbianas @es
comment: Lesbians who speak the Bhojpuri language and live in or are descended from those who inhabited the Bhojpuri-Purvanchal region of India and Nepal.
comment: Lesbianas que hablan el idioma bhojpuri y viven, pertenecen o son descendientes de quienes habitaron la región de Bhojpuri-Purvanchal de India y Nepal. @es
broader: Bhojpuri LGBTQ+ people
has top concept: LGBTQ+ people
issued: 2022-06-27
modified: 2025-02-23
type: Concept
in scheme: v3
change note: Version 4.1.0

Bhojpuri gay men
preferred label: Hombres gay bhojpuri @es
alternative label: Gay Bhojpuri people
alternative label: Gay Bhojpuriyas
alternative label: Hombres gay bhojpuriyas @es
alternative label: Bhojpuriyas gay @es
alternative label: Bhojpuri gay @es
comment: Gay men who speak the Bhojpuri language and live in or are descended from those who inhabited the Bhojpuri-Purvanchal region of India and Nepal.
comment: Hombres gay que hablan el idioma bhojpuri y viven, pertenecen o son descendientes de quienes habitaron la región de Bhojpuri-Purvanchal de India y Nepal. @es
broader: Bhojpuri LGBTQ+ people
has top concept: LGBTQ+ people
issued: 2022-06-27
modified: 2025-02-23
type: Concept
in scheme: v3
change note: Version 4.1.0

Bhojpuri bisexual people
preferred label: Personas bisexuales bhojpuri @es
alternative label: Bisexual Bhojpuri people
alternative label: Bisexual Bhojpuriyas
alternative label: Bisexuales bhojpuriyas @es
alternative label: Bhojpuriyas bisexuales @es
alternative label: Bisexuales bhojpuri @es
alternative label: Bhojpuri bisexuales @es
comment: Bisexual people who speak the Bhojpuri language and live in or are descended from those who inhabited the Bhojpuri-Purvanchal region of India and Nepal.
comment: Personas bisexuales que hablan el idioma bhojpuri y viven, pertenecen o son descendientes de quienes habitaron la región de Bhojpuri-Purvanchal de India y Nepal. @es
broader: Bhojpuri LGBTQ+ people
has top concept: LGBTQ+ people
issued: 2022-06-27
modified: 2025-02-23
type: Concept
in scheme: v3
change note: Version 4.1.0

Bhojpuri queer people
preferred label: Personas queer bhojpuri @es
alternative label: Queer Bhojpuri people
alternative label: Queer Bhojpuriyas
alternative label: Personas bhojpuri queer @es
alternative label: Bhojpuriyas queer @es
comment: Queer people who speak the Bhojpuri language and live in or are descended from those who inhabited the Bhojpuri-Purvanchal region of India and Nepal.
comment: Personas queer que hablan el idioma bhojpuri y viven, pertenecen o son descendientes de quienes habitaron la región de Bhojpuri-Purvanchal de India y Nepal. @es
broader: Bhojpuri LGBTQ+ people
has top concept: LGBTQ+ people
issued: 2022-06-27
modified: 2025-02-23
type: Concept
in scheme: v3
change note: Version 4.1.0

Bhojpuri transgender people
preferred label: Personas transgénero bhojpuri @es
alternative label: Transgender Bhojpuri people
alternative label: Transgender Bhojpuriyas
alternative label: Personas bhojpuri transgénero @es
alternative label: Bhojpuriyas transgénero @es
comment: Transgender people who speak the Bhojpuri language and live in or are descended from those who inhabited the Bhojpuri-Purvanchal region of India and Nepal.
comment: Personas transgénero que hablan el idioma bhojpuri y viven, pertenecen o son descendientes de quienes habitaron la región de Bhojpuri-Purvanchal de India y Nepal. @es
broader: Bhojpuri LGBTQ+ people
has top concept: LGBTQ+ people
issued: 2022-06-27
modified: 2025-02-23
type: Concept
in scheme: v3
change note: Version 4.1.0

Bhojpuri intersex people
preferred label: Personas intersexuales bhojpuri @es
alternative label: Intersex Bhojpuri people
alternative label: Intersex Bhojpuriyas
alternative label: Personas intersex bhojpuri @es
alternative label: Bhojpuriyas intersex @es
comment: Intersex people who speak the Bhojpuri language and live in or are descended from those who inhabited the Bhojpuri-Purvanchal region of India and Nepal.
comment: Personas intersexuales que hablan el idioma bhojpuri y viven, pertenecen o son descendientes de quienes habitaron la región de Bhojpuri-Purvanchal de India y Nepal. @es
broader: Bhojpuri LGBTQ+ people
has top concept: LGBTQ+ people
issued: 2022-06-27
modified: 2025-02-23
type: Concept
in scheme: v3
change note: Version 4.1.0

Bhojpuri asexual people
preferred label: Personas asexuales bhojpuri @es
alternative label: Asexual Bhojpuri people
alternative label: Asexual Bhojpuriyas
alternative label: Asexuales bhojpuri @es
alternative label: Bhojpuri asexuales @es
alternative label: Asexuales bhojpuriyas @es
alternative label: Bhojpuriyas asexuales @es
comment: Asexual people who speak the Bhojpuri language and live in or are descended from those who inhabited the Bhojpuri-Purvanchal region of India and Nepal.
comment: Personas asexuales que hablan el idioma bhojpuri y viven, pertenecen o son descendientes de quienes habitaron la región de Bhojpuri-Purvanchal de India y Nepal. @es
broader: Bhojpuri LGBTQ+ people
has top concept: LGBTQ+ people
issued: 2022-06-27
modified: 2025-02-23
type: Concept
in scheme: v3
change note: Version 4.1.0

Bengali LGBTQ+ people
preferred label: Personas LGBTQ+ bengalíes @es
alternative label: Bengali people (LGBTQ)
alternative label: Bengalis (LGBTQ)
alternative label: LGBTQ+ Bengali people
alternative label: LGBTQ+ Bengalis
alternative label: Personas bengalíes (LGBTQ) @es
alternative label: Bengalíes (LGBTQ) @es
alternative label: Personas bengalíes LGBTQ+ @es
alternative label: Bengalíes LGBTQ+ @es
comment: LGBTQ+ people who speak the Bengali language or are of Bengali descent.
comment: Personas LGBTQ+ que hablan el idioma bengalí o son de ascendencia bengalí. Correferenciar con personas LGBTQ+ de Bangladesh cuando una persona es tanto de etnia bengalí como de nacionalidad bangladesí. @es
broader: LGBTQ+ people of shared ethnic or national identities
broader: LGBTQ+ people of color
narrower: Bengali lesbians
narrower: Bengali gay men
narrower: Bengali bisexual people
narrower: Bengali queer people
narrower: Bengali transgender people
narrower: Bengali intersex people
narrower: Bengali asexual people
narrower: Bengali non-binary people
has top concept: LGBTQ+ people
issued: 2022-06-27
modified: 2025-02-23
type: Concept
in scheme: v3
change note: Version 4.1.0

Bengali lesbians
preferred label: Lesbianas bengalíes @es
alternative label: Lesbian Bengalis
alternative label: Bengalíes lesbianas @es
comment: Lesbians who speak the Bengali language or are of Bengali descent.
comment: Lesbianas que hablan el idioma bengalí o son de ascendencia bengalí. Correferenciar con lesbianas bangladesíes cuando una persona es tanto de etnia bengalí como de nacionalidad bangladesí. @es
broader: Bengali LGBTQ+ people
has top concept: LGBTQ+ people
issued: 2022-06-27
modified: 2025-02-23
type: Concept
in scheme: v3
change note: Version 4.1.0

Bengali gay men
preferred label: Hombres gay bengalíes @es
alternative label: Gay Bengali people
alternative label: Gay Bengalis
alternative label: Bengalíes gay @es
comment: Gay men who speak the Bengali language or are of Bengali descent.
comment: Hombres gay que hablan el idioma bengalí o son de ascendencia bengalí. Correferenciar con hombres gay de Bangladesh cuando una persona es tanto de etnia bengalí como de nacionalidad bangladesí. @es
broader: Bengali LGBTQ+ people
has top concept: LGBTQ+ people
issued: 2022-06-27
modified: 2025-02-23
type: Concept
in scheme: v3
change note: Version 4.1.0

Bengali bisexual people
preferred label: Personas bisexuales bengalíes @es
alternative label: Bisexual Bengali people
alternative label: Bisexual Bengalis
alternative label: Personas bengalíes bisexuales @es
alternative label: Bengalíes bisexuales @es
comment: Bisexual people who speak the Bengali language or are of Bengali descent.
comment: Personas bisexuales que hablan el idioma bengalí y son de ascendencia bengalí. Correferenciar con personas bisexuales de Bangladesh cuando una persona es tanto de etnia bengalí como de nacionalidad bangladesí. @es
broader: Bengali LGBTQ+ people
has top concept: LGBTQ+ people
issued: 2022-06-27
modified: 2025-02-23
type: Concept
in scheme: v3
change note: Version 4.1.0

Bengali queer people
preferred label: Personas queer bengalíes @es
alternative label: Queer Bengali people
alternative label: Queer Bengalis
alternative label: Personas bengalíes queer @es
alternative label: Bengalíes queer @es
comment: Queer people who speak the Bengali language or are of Bengali descent.
comment: Personas queer que hablan el idioma bengalí y son de ascendencia bengalí. Correferenciar con personas queer de Bangladesh cuando una persona es tanto de etnia bengalí como de nacionalidad bangladesí. @es
broader: Bengali LGBTQ+ people
has top concept: LGBTQ+ people
issued: 2022-06-27
modified: 2025-02-23
type: Concept
in scheme: v3
change note: Version 4.1.0

Bengali transgender people
preferred label: Personas transgénero bengalíes @es
alternative label: Transgender Bengali people
alternative label: Transgender Bengalis
alternative label: Personas bengalíes transgénero @es
alternative label: Bengalíes transgénero @es
comment: Transgender people who speak the Bengali language or are of Bengali descent.
comment: Personas transgénero que hablan el idioma bengalí y son de ascendencia bengalí. Correferenciar con personas transgénero de Bangladesh cuando una persona es tanto de etnia bengalí como de nacionalidad bangladesí. @es
broader: Bengali LGBTQ+ people
has top concept: LGBTQ+ people
issued: 2022-06-27
modified: 2025-02-23
type: Concept
in scheme: v3
change note: Version 4.1.0

Bengali intersex people
preferred label: Personas intersexuales bengalíes @es
alternative label: Intersex Bengali people
alternative label: Intersex Bengalis
alternative label: Personas bengalíes intersex @es
alternative label: Bengalíes intersex @es
alternative label: Personas intersex bengalíes @es
comment: Intersex people who speak the Bengali language or are of Bengali descent.
comment: Personas intersexuales que hablan el idioma bengalí y son de ascendencia bengalí. Correferenciar con personas intersex de Bangladesh cuando una persona es tanto de etnia bengalí como de nacionalidad bangladesí. @es
broader: Bengali LGBTQ+ people
has top concept: LGBTQ+ people
issued: 2022-06-27
modified: 2025-02-23
type: Concept
in scheme: v3
change note: Version 4.1.0

Bengali asexual people
preferred label: Personas asexuales bengalíes @es
alternative label: Asexual Bengali people
alternative label: Asexual Bengalis
alternative label: Personas bengalíes asexuales @es
alternative label: Bengalíes asexuales @es
comment: Asexual people who speak the Bengali language or are of Bengali descent.
comment: Personas asexuales que hablan el idioma bengalí y son de ascendencia bengalí. Correferenciar con personas asexuales de Bangladesh cuando una persona es tanto de etnia bengalí como de nacionalidad bangladesí. @es
broader: Bengali LGBTQ+ people
has top concept: LGBTQ+ people
issued: 2022-06-27
modified: 2025-02-23
type: Concept
in scheme: v3
change note: Version 4.1.0

Bhil LGBTQ+ people
preferred label: Personas LGBTQ+ bhil @es
alternative label: Bheel LGBTQ+ people
alternative label: Bheel people (LGBTQ)
alternative label: Bhil people (LGBTQ)
alternative label: LGBTQ+ Bhil people
alternative label: LGBTQ+ Bhils
alternative label: Personas bhils LGBTQ+ @es
alternative label: Personas bhils (LGBTQ) @es
alternative label: Bhils LGBTQ+ @es
comment: LGBTQ+ people who speak the Bhil language and belong to or are descended from the Bhil tribal group.
comment: Personas LGBTQ+ que hablan el idioma bhil y pertenecen o son descendientes del grupo tribal bhil. @es
broader: LGBTQ+ people of shared ethnic or national identities
broader: LGBTQ+ people of color
narrower: Bhil lesbians
narrower: Bhil gay men
narrower: Bhil queer people
narrower: Bhil transgender people
narrower: Bhil intersex people
narrower: Bhil asexual people
narrower: Bhil non-binary people
narrower: Bhil bisexual people
has top concept: LGBTQ+ people
issued: 2022-06-27
modified: 2025-02-23
type: Concept
in scheme: v3
change note: Version 4.1.0

Bhil lesbians
preferred label: Lesbianas bhil @es
alternative label: Bheel lesbians
alternative label: Lesbian Bhils
alternative label: Bhils lesbianas @es
comment: Lesbians who speak the Bhil language and belong to or are descended from the Bhil tribal group.
comment: Lesbianas que hablan el idioma bhil y pertenecen o son descendientes del grupo tribal Bhil. @es
broader: Bhil LGBTQ+ people
has top concept: LGBTQ+ people
issued: 2022-06-27
modified: 2025-02-23
type: Concept
in scheme: v3
change note: Version 4.1.0

Bhil gay men
preferred label: Hombres gay bhil @es
alternative label: Bheel gay men
alternative label: Gay Bhil people
alternative label: Gay Bhils
alternative label: Bhils gay @es
comment: Gay men who speak the Bhil language and belong to or are descended from the Bhil tribal group.
comment: Hombres gay que hablan el idioma bhil y pertenecen o son descendientes del grupo tribal bhil. @es
broader: Bhil LGBTQ+ people
has top concept: LGBTQ+ people
issued: 2022-06-27
modified: 2025-02-23
type: Concept
in scheme: v3
change note: Version 4.1.0

Bhil bisexual people
preferred label: Personas bisexuales bhil @es
alternative label: Bheel bisexual people
alternative label: Bisexual Bhil people
alternative label: Bisexual Bhils
alternative label: Personas bhils bisexuales @es
alternative label: Bhils bisexuales @es
comment: Bisexual people who speak the Bhil language and belong to or are descended from the Bhil tribal group.
comment: Personas bisexuales que hablan el idioma bhil y pertenecen o son descendientes del grupo tribal bhil. @es
broader: Bhil LGBTQ+ people
has top concept: LGBTQ+ people
issued: 2022-06-27
modified: 2025-02-23
type: Concept
in scheme: v3
change note: Version 4.1.0

Bhil queer people
preferred label: Personas queer bhil @es
preferred label: Bheel queer people
preferred label: Queer Bhil people
preferred label: Queer Bhils
alternative label: Bhils queer @es
comment: Queer people who speak the Bhil language and belong to or are descended from the Bhil tribal group.
comment: Personas queer que hablan el idioma bhil y pertenecen o son descendientes del grupo tribal bhil. @es
broader: Bhil LGBTQ+ people
has top concept: LGBTQ+ people
issued: 2022-06-27
modified: 2025-02-23
type: Concept
in scheme: v3
change note: Version 4.1.0

Bhil transgender people
preferred label: Personas transgénero bhil @es
alternative label: Bheel transgender people
alternative label: Transgender Bhil people
alternative label: Transgender Bhils
alternative label: Personas bhils transgénero @es
alternative label: Bhils transgénero @es
comment: Transgender people who speak the Bhil language and belong to or are descended from the Bhil tribal group.
comment: Personas transgénero que hablan el idioma bhil y pertenecen o son descendientes del grupo tribal bhil. @es
broader: Bhil LGBTQ+ people
has top concept: LGBTQ+ people
issued: 2022-06-27
modified: 2025-02-23
type: Concept
in scheme: v3
change note: Version 4.1.0

Bhil intersex people
preferred label: Personas intersexuales bhil @es
alternative label: Bheel intersex people
alternative label: Intersex Bhil people
alternative label: Intersex Bhils
alternative label: Personas bhils intersex @es
alternative label: Intersexuales bhils @es
alternative label: Personas intersex bhils @es
comment: Intersex people who speak the Bhil language and belong to or are descended from the Bhil tribal group.
comment: Personas intersexuales que hablan el idioma bhil y pertenecen o son descendientes del grupo tribal bhil. @es
broader: Bhil LGBTQ+ people
has top concept: LGBTQ+ people
issued: 2022-06-27
modified: 2025-02-23
type: Concept
in scheme: v3
change note: Version 4.1.0

Bhil asexual people
preferred label: Personas asexuales bhil @es
alternative label: Asexual Bhil people
alternative label: Asexual Bhils
alternative label: Bheel asexual people
alternative label: Personas bhil asexuales @es
alternative label: Bhils asexuales @es
comment: Asexual people who speak the Bhil language and belong to or are descended from the Bhil tribal group.
comment: Personas asexuales que hablan el idioma bhil y pertenecen o son descendientes del grupo tribal bhil. @es
broader: Bhil LGBTQ+ people
has top concept: LGBTQ+ people
issued: 2022-06-27
modified: 2025-02-23
type: Concept
in scheme: v3
change note: Version 4.1.0

Chakma LGBTQ+ people
preferred label: Personas LGBTQ+ chakma @es
alternative label: Chakma people (LGBTQ)
alternative label: LGBTQ+ Chakma people
alternative label: Personas chakma LGBTQ+ @es
alternative label: Personas chakma (LGBTQ)|| @es
comment: LGBTQ+ people who belong to or are descended from the Chakma tribal group.
comment: Personas LGBTQ+ que pertenecen o son descendientes del grupo tribal chakma. @es
broader: LGBTQ+ people of shared ethnic or national identities
broader: LGBTQ+ people of color
narrower: Chakma lesbians
narrower: Chakma gay men
narrower: Chakma bisexual people
narrower: Chakma queer people
narrower: Chakma intersex people
narrower: Chakma transgender people
narrower: Chakma asexual people
narrower: Chakma non-binary people
has top concept: LGBTQ+ people
issued: 2022-06-27
modified: 2025-02-23
type: Concept
in scheme: v3
change note: Version 4.1.0

Chakma lesbians
preferred label: Lesbianas chakma @es
alternative label: Chakmas lesbianas @es
comment: Lesbians who belong to or are descended from the Chakma tribal group.
comment: Lesbianas que que pertenecen o son descendientes del grupo tribal chakma. @es
broader: Chakma LGBTQ+ people
has top concept: LGBTQ+ people
issued: 2022-06-27
modified: 2025-02-23
type: Concept
in scheme: v3
change note: Version 4.1.0

Chakma gay men
preferred label: Hombres gay chakma @es
alternative label: Gay Chakma people
alternative label: Chakmas gay @es
comment: Gay men who belong to or are descended from the Chakma tribal group.
comment: Hombres gay que pertenecen o son descendientes del grupo tribal chakma. @es
broader: Chakma LGBTQ+ people
has top concept: LGBTQ+ people
issued: 2022-06-27
modified: 2025-02-23
type: Concept
in scheme: v3
change note: Version 4.1.0

Chakma bisexual people
preferred label: Personas bisexuales chakma @es
alternative label: Bisexual Chakma people
alternative label: Personas chakma bisexuales @es
comment: Bisexual people who belong to or are descended from the Chakma tribal group.
comment: Personas bisexuales que pertenecen o son descendientes del grupo tribal chakma. @es
broader: Chakma LGBTQ+ people
has top concept: LGBTQ+ people
issued: 2022-06-27
modified: 2025-02-23
type: Concept
in scheme: v3
change note: Version 4.1.0

Chakma queer people
preferred label: Personas queer chakma @es
alternative label: Queer Chakma people
alternative label: Personas chakma queer @es
comment: Queer people who belong to or are descended from the Chakma tribal group.
comment: Personas queer que pertenecen o son descendientes del grupo tribal chakma. @es
broader: Chakma LGBTQ+ people
has top concept: LGBTQ+ people
issued: 2022-06-27
modified: 2025-02-23
type: Concept
in scheme: v3
change note: Version 4.1.0

Chakma intersex people
preferred label: Personas intersexuales chakma @es
alternative label: Intersex Chakma people
alternative label: Personas intersex chakma @es
comment: Intersex people who belong to or are descended from the Chakma tribal group.
comment: Personas intersexuales que pertenecen o son descendientes del grupo tribal chakma. @es
broader: Chakma LGBTQ+ people
has top concept: LGBTQ+ people
issued: 2022-06-27
modified: 2025-02-23
type: Concept
in scheme: v3
change note: Version 4.1.0

Chakma transgender people
preferred label: Personas transgénero chakma @es
alternative label: Transgender Chakma people
alternative label: Personas chakma transgénero @es
comment: Transgender people who belong to or are descended from the Chakma tribal group.
comment: Personas transgénero que pertenecen o son descendientes del grupo tribal chakma. @es
broader: Chakma LGBTQ+ people
has top concept: LGBTQ+ people
issued: 2022-06-27
modified: 2025-02-23
type: Concept
in scheme: v3
change note: Version 4.1.0

Chakma asexual people
preferred label: Personas asexuales chakma @es
alternative label: Asexual Chakma people
alternative label: Personas chakma asexuales @es
comment: Asexual people who belong to or are descended from the Chakma tribal group.
comment: Personas asexuales que pertenecen o son descendientes del grupo tribal chakma. @es
broader: Chakma LGBTQ+ people
has top concept: LGBTQ+ people
issued: 2022-06-27
modified: 2025-02-23
type: Concept
in scheme: v3
change note: Version 4.1.0

Kho LGBTQ+ people
preferred label: Personas LGBTQ+ kho @es
alternative label: Chitrali LGBTQ+ people
alternative label: Chitrali people (LGBTQ)
alternative label: Kho people (LGBTQ)
alternative label: LGBTQ+ Kho people
comment: LGBTQ+ people who belong to or are descended from the people indigenous to the Chitral and Ghizer districts of modern-day Pakistan.
comment: Personas LGBTQ+ que pertenecen a o son descendientes de las personas nativas de los distritos de Chitral y Ghizer del actual Pakistán. @es
broader: LGBTQ+ people of shared ethnic or national identities
broader: LGBTQ+ people of color
narrower: Kho lesbians
narrower: Kho gay men
narrower: Kho bisexual people
narrower: Kho transgender people
narrower: Kho queer people
narrower: Kho intersex people
narrower: Kho asexual people
narrower: Kho non-binary people
has top concept: LGBTQ+ people
issued: 2022-06-27
modified: 2025-02-23
type: Concept
in scheme: v3
change note: Version 4.1.0

Kho lesbians
preferred label: Lesbianas kho @es
alternative label: Chitrali lesbians
comment: Lesbians who belong to or are descended from the people indigenous to the Chitral and Ghizer districts of modern-day Pakistan.
comment: Lesbianas que pertenecen a o son descendientes de las personas nativas de los distritos de Chitral y Ghizer del actual Pakistán. @es
broader: Kho LGBTQ+ people
has top concept: LGBTQ+ people
issued: 2022-06-27
modified: 2025-02-23
type: Concept
in scheme: v3
change note: Version 4.1.0

Kho gay men
preferred label: Hombres gay kho @es
alternative label: Chitrali gay men
alternative label: Gay Chitrali men
alternative label: Gay Kho men
comment: Gay men who belong to or are descended from the people indigenous to the Chitral and Ghizer districts of modern-day Pakistan.
comment: Hombres gay que pertenecen a o son descendientes de las personas nativas de los distritos de Chitral y Ghizer del actual Pakistán. @es
broader: Kho LGBTQ+ people
has top concept: LGBTQ+ people
issued: 2022-06-27
modified: 2025-02-23
type: Concept
in scheme: v3
change note: Version 4.1.0

Kho bisexual people
preferred label: Personas bisexuales kho @es
alternative label: Bisexual Chitrali people
alternative label: Bisexual Kho people
alternative label: Chitrali bisexual people
comment: Bisexual individuals who belong to or are descended from the people indigenous to the Chitral and Ghizer districts of modern-day Pakistan.
comment: Personas bisexuales que pertenecen a o son descendientes de las personas nativas de los distritos de Chitral y Ghizer del actual Pakistán. @es
broader: Kho LGBTQ+ people
has top concept: LGBTQ+ people
issued: 2022-06-27
modified: 2025-02-23
type: Concept
in scheme: v3
change note: Version 4.1.0

Kho transgender people
preferred label: Personas transgénero kho @es
alternative label: Chitrali transgender people
alternative label: Transgender Chitrali people
alternative label: Transgender Kho people
comment: Transgender individuals who belong to or are descended from the people indigenous to the Chitral and Ghizer districts of modern-day Pakistan.
comment: Personas transgénero que pertenecen a o son descendientes de las personas nativas de los distritos de Chitral y Ghizer del actual Pakistán. @es
broader: Kho LGBTQ+ people
has top concept: LGBTQ+ people
issued: 2022-06-27
modified: 2025-02-23
type: Concept
in scheme: v3
change note: Version 4.1.0

Kho queer people
preferred label: Personas queer kho @es
alternative label: Chitrali queer people
alternative label: Queer Chitrali people
alternative label: Queer Kho people
comment: Queer individuals who belong to or are descended from the people indigenous to the Chitral and Ghizer districts of modern-day Pakistan.
comment: Personas queer que pertenecen a o son descendientes de las personas nativas de los distritos de Chitral y Ghizer del actual Pakistán. @es
broader: Kho LGBTQ+ people
has top concept: LGBTQ+ people
issued: 2022-06-27
modified: 2025-02-23
type: Concept
in scheme: v3
change note: Version 4.1.0

Kho intersex people
preferred label: Personas intersexuales kho @es
alternative label: Chitrali intersex people
alternative label: Intersex Chitrali people
alternative label: Intersex Kho people
alternative label: Personas intersex kho @es
comment: Intersex individuals who belong to or are descended from the people indigenous to the Chitral and Ghizer districts of modern-day Pakistan.
comment: Personas intersexuales que pertenecen a o son descendientes de las personas nativas de los distritos de Chitral y Ghizer del actual Pakistán. @es
broader: Kho LGBTQ+ people
has top concept: LGBTQ+ people
issued: 2022-06-27
modified: 2025-02-23
type: Concept
in scheme: v3
change note: Version 4.1.0

Kho asexual people
preferred label: Personas asexuales kho @es
alternative label: Asexual Chitrali people
alternative label: Asexual Kho people
alternative label: Chitrali asexual people
comment: Asexual individuals who belong to or are descended from the people indigenous to the Chitral and Ghizer districts of modern-day Pakistan.
comment: Personas asexuales que pertenecen a o son descendientes de las personas nativas de los distritos de Chitral y Ghizer del actual Pakistán. @es
broader: Kho LGBTQ+ people
has top concept: LGBTQ+ people
issued: 2022-06-27
modified: 2025-02-23
type: Concept
in scheme: v3
change note: Version 4.1.0

Maldivian LGBTQ+ people
preferred label: Personas LGBTQ+ maldivas @es
alternative label: Dhivehin LGBTQ+ people
alternative label: Dhivehin people (LGBTQ)
alternative label: LGBTQ+ Maldivians
alternative label: Maldivian people (LGBTQ)
alternative label: Personas maldivas LGBTQ+ @es
comment: LGBTQ+ people who belong to or are descended from the people native to the Maldives (including the island of Minicoy) and speak the Maldivian language.
comment: Personas LGBTQ+ que pertenecen a o son descendientes de las personas nativas de las Maldivas (incluyendo la isla Minicoy) y que hablan el idioma maldivo. @es
broader: LGBTQ+ people of shared ethnic or national identities
broader: LGBTQ+ people of color
narrower: Maldivian lesbians
narrower: Maldivian gay men
narrower: Maldivian bisexual people
narrower: Maldivian queer people
narrower: Maldivian transgender people
narrower: Maldivian intersex people
narrower: Maldivian asexual people
narrower: Maldivian non-binary people
has top concept: LGBTQ+ people
issued: 2022-06-27
modified: 2025-02-23
type: Concept
in scheme: v3
change note: Version 4.1.0

Maldivian lesbians
preferred label: Lesbianas maldivas @es
alternative label: Dhivehin lesbians
alternative label: Lesbian Maldivians
alternative label: Personas maldivas lesbianas @es
comment: Lesbians who belong to or are descended from the people native to the Maldives (including the island of Minicoy) and speak the Maldivian language.
comment: Lesbianas que pertenecen a o son descendientes de las personas nativas de las Maldivas (incluyendo la isla Minicoy) y que hablan el idioma maldivo. @es
broader: Maldivian LGBTQ+ people
has top concept: LGBTQ+ people
issued: 2022-06-27
modified: 2025-02-23
type: Concept
in scheme: v3
change note: Version 4.1.0

Maldivian gay men
preferred label: Hombres gay maldivos @es
alternative label: Dhivehin gay men
alternative label: Gay Dhivehin people
alternative label: Gay Maldivian men
alternative label: Gay Maldivians
alternative label: Hombres maldivos gay @es
comment: Gay men who belong to or are descended from the people native to the Maldives (including the island of Minicoy) and speak the Maldivian language.
comment: Hombres gay que pertenecen a o son descendientes de las personas nativas de las Maldivas (incluyendo la isla Minicoy) y que hablan el idioma maldivo. @es
broader: Maldivian LGBTQ+ people
has top concept: LGBTQ+ people
issued: 2022-06-27
modified: 2025-02-23
type: Concept
in scheme: v3
change note: Version 4.1.0

Maldivian bisexual people
preferred label: Personas bisexuales maldivas @es
alternative label: Bisexual Dhivehin people
alternative label: Bisexual Maldivian people
alternative label: Bisexual Maldivians
alternative label: Dhivehin bisexual people
alternative label: Personas maldivas bisexuales @es
comment: Bisexual individuals who belong to or are descended from the people native to the Maldives (including the island of Minicoy) and speak the Maldivian language.
comment: Personas bisexuales que pertenecen a o son descendientes de las personas nativas de las Maldivas (incluyendo la isla Minicoy) y que hablan el idioma maldivo. @es
broader: Maldivian LGBTQ+ people
has top concept: LGBTQ+ people
issued: 2022-06-27
modified: 2025-02-23
type: Concept
in scheme: v3
change note: Version 4.1.0

Maldivian queer people
preferred label: Personas queer maldivas @es
alternative label: Dhivehin queer people
alternative label: Queer Dhivehin people
alternative label: Queer Maldivian people
alternative label: Queer Maldivians
alternative label: Personas maldivas queer @es
comment: Queer individuals who belong to or are descended from the people native to the Maldives (including the island of Minicoy) and speak the Maldivian language.
comment: Personas queer que pertenecen a o son descendientes de las personas nativas de las Maldivas (incluyendo la isla Minicoy) y que hablan el idioma maldivo. @es
broader: Maldivian LGBTQ+ people
has top concept: LGBTQ+ people
issued: 2022-06-27
modified: 2025-02-23
type: Concept
in scheme: v3
change note: Version 4.1.0

Maldivian transgender people
preferred label: Personas transgénero maldivas @es
alternative label: Dhivehin transgender people
alternative label: Transgender Dhivehin people
alternative label: Transgender Maldivian people
alternative label: Transgender Maldivians
alternative label: Personas maldivas transgénero @es
comment: Transgender individuals who belong to or are descended from the people native to the Maldives (including the island of Minicoy) and speak the Maldivian language.
comment: Personas transgénero que pertenecen a o son descendientes de las personas nativas de las Maldivas (incluyendo la isla Minicoy) y que hablan el idioma maldivo. @es
broader: Maldivian LGBTQ+ people
has top concept: LGBTQ+ people
issued: 2022-06-27
modified: 2025-02-23
type: Concept
in scheme: v3
change note: Version 4.1.0

Maldivian intersex people
preferred label: Personas intersexuales maldivas @es
alternative label: Dhivehin intersex people
alternative label: Intersex Dhivehin people
alternative label: Intersex Maldivians
alternative label: Personas intersex maldivas @es
comment: Intersex individuals who belong to or are descended from the people native to the Maldives (including the island of Minicoy) and speak the Maldivian language.
comment: Personas intersexuales que pertenecen a o son descendientes de las personas nativas de las Maldivas (incluyendo la isla Minicoy) y que hablan el idioma maldivo. @es
broader: Maldivian LGBTQ+ people
has top concept: LGBTQ+ people
issued: 2022-06-27
modified: 2025-02-23
type: Concept
in scheme: v3
change note: Version 4.1.0

Maldivian asexual people
preferred label: Personas asexuales maldivas @es
alternative label: Asexual Dhivehin people
alternative label: Asexual Maldivian people
alternative label: Asexual Maldivians
alternative label: Dhivehin asexual people
alternative label: Personas maldivas asexuales @es
comment: Asexual individuals who belong to or are descended from the people native to the Maldives (including the island of Minicoy) and speak the Maldivian language.
comment: Personas asexuales que pertenecen a o son descendientes de las personas nativas de las Maldivas (incluyendo la isla Minicoy) y que hablan el idioma maldivo. @es
broader: Maldivian LGBTQ+ people
has top concept: LGBTQ+ people
issued: 2022-06-27
modified: 2025-02-23
type: Concept
in scheme: v3
change note: Version 4.1.0

Dogra LGBTQ+ people
preferred label: Personas LGBTQ+ dogra @es
alternative label: Dogra people (LGBTQ)
alternative label: Dogras (LGBTQ)
alternative label: LGBTQ+ Dogra people
alternative label: LGBTQ+ Dogras
comment: LGBTQ+ people who are of the Dogra people of India and Pakistan and speak the Dogri language.
comment: Personas LGBTQ+ que son de las personas dogra de India y Pakistán, y hablan el idioma dogrí. @es
broader: LGBTQ+ people of shared ethnic or national identities
broader: LGBTQ+ people of color
narrower: Dogra lesbians
narrower: Dogra gay men
narrower: Dogra bisexual people
narrower: Dogra queer people
narrower: Dogra transgender people
narrower: Dogra intersex people
narrower: Dogra asexual people
narrower: Dogra non-binary people
has top concept: LGBTQ+ people
issued: 2022-06-27
modified: 2025-02-23
type: Concept
in scheme: v3
change note: Version 4.1.0

Dogra lesbians
preferred label: Lesbianas dogra @es
alternative label: Lesbian Dogras
comment: Lesbians who are of the Dogra people of India and Pakistan and speak the Dogri language.
comment: Lesbianas que pertenecen al pueblo dogra de India y Pakistán, y hablan el idioma dogrí. @es
broader: Dogra LGBTQ+ people
has top concept: LGBTQ+ people
issued: 2022-06-27
modified: 2025-02-23
type: Concept
in scheme: v3
change note: Version 4.1.0

Dogra gay men
preferred label: Hombres gay dogra @es
alternative label: Gay Dogra men
alternative label: Gay Dogras
comment: Gay men who are of the Dogra people of India and Pakistan and speak the Dogri language.
comment: Hombres gay que pertenecen al pueblo dogra de India y Pakistán, y hablan el idioma dogrí. @es
broader: Dogra LGBTQ+ people
has top concept: LGBTQ+ people
issued: 2022-06-27
modified: 2025-02-23
type: Concept
in scheme: v3
change note: Version 4.1.0

Dogra bisexual people
preferred label: Personas bisexuales dogra @es
alternative label: Bisexual Dogra people
alternative label: Bisexual Dogras
comment: Bisexual people who are of the Dogra people of India and Pakistan and speak the Dogri language.
comment: Personas bisexuales que pertenecen al pueblo dogra de India y Pakistán, y hablan el idioma dogrí. @es
broader: Dogra LGBTQ+ people
has top concept: LGBTQ+ people
issued: 2022-06-27
modified: 2025-02-23
type: Concept
in scheme: v3
change note: Version 4.1.0

Dogra queer people
preferred label: Personas queer dogra @es
alternative label: Queer Dogra people
alternative label: Queer Dogras
comment: Queer people who are of the Dogra people of India and Pakistan and speak the Dogri language.
comment: Personas queer que son de las personas dogra de India y Pakistán, y hablan el idioma dogrí. @es
broader: Dogra LGBTQ+ people
has top concept: LGBTQ+ people
issued: 2022-06-27
modified: 2025-02-23
type: Concept
in scheme: v3
change note: Version 4.1.0

Dogra transgender people
preferred label: Personas transgénero dogra @es
alternative label: Transgender Dogra people
alternative label: Transgender Dogras
comment: Transgender people who are of the Dogra people of India and Pakistan and speak the Dogri language.
comment: Personas transgénero que son de las personas dogra de India y Pakistán, y hablan el idioma dogrí. @es
broader: Dogra LGBTQ+ people
has top concept: LGBTQ+ people
issued: 2022-06-27
modified: 2025-02-23
type: Concept
in scheme: v3
change note: Version 4.1.0

Dogra intersex people
preferred label: Personas intersexuales dogra @es
alternative label: Intersex Dogra people
alternative label: Intersex Dogras
alternative label: Personas intersex dogra @es
comment: Intersex people who are of the Dogra people of India and Pakistan and speak the Dogri language.
comment: Personas intersexuales que pertenecen al pueblo dogra de India y Pakistán, y hablan el idioma dogrí. @es
broader: Dogra LGBTQ+ people
has top concept: LGBTQ+ people
issued: 2022-06-27
modified: 2025-02-23
type: Concept
in scheme: v3
change note: Version 4.1.0

Dogra asexual people
preferred label: Personas asexuales dogra @es
alternative label: Asexual Dogra people
alternative label: Asexual Dogras
comment: Asexual people who are of the Dogra people of India and Pakistan and speak the Dogri language.
comment: Personas asexuales que pertenecen al pueblo dogra de India y Pakistán, y hablan el idioma dogrí. @es
broader: Dogra LGBTQ+ people
has top concept: LGBTQ+ people
issued: 2022-06-27
modified: 2025-02-23
type: Concept
in scheme: v3
change note: Version 4.1.0

Garhwali LGBTQ+ people
preferred label: Personas LGBTQ+ garhwali @es
alternative label: Garhwali people (LGBTQ)
alternative label: Garhwalis (LGBTQ)
alternative label: LGBTQ+ Garhwali people
alternative label: LGBTQ+ Garhwalis
comment: LGBTQ+ people who belong to or are descended from those native to Garhwal in Uttarakhand and who speak Garhwali.
comment: Personas LGBTQ+ que pertenecen a o son descendientes de las personas nativas de Garhwal en Uttarakhand y que hablan garhwali. @es
broader: LGBTQ+ people of shared ethnic or national identities
broader: LGBTQ+ people of color
narrower: Garhwali lesbians
narrower: Garhwali gay men
narrower: Garhwali bisexual people
narrower: Garhwali queer people
narrower: Garhwali transgender people
narrower: Garhwali intersex people
narrower: Garhwali asexual people
narrower: Garhwali non-binary people
has top concept: LGBTQ+ people
issued: 2022-06-27
modified: 2025-02-23
type: Concept
in scheme: v3
change note: Version 4.1.0

Garhwali lesbians
preferred label: Lesbianas garhwali @es
alternative label: Lesbian Garhwalis
comment: Lesbians who belong to or are descended from the people native to Garhwal in Uttarakhand and who speak Garhwali.
comment: Lesbianas que pertenecen a o son descendientes de las personas nativas de Garhwal en Uttarakhand y que hablan garhwali. @es
broader: Garhwali LGBTQ+ people
has top concept: LGBTQ+ people
issued: 2022-06-27
modified: 2025-02-23
type: Concept
in scheme: v3
change note: Version 4.1.0

Garhwali gay men
preferred label: Hombres gay garhwali @es
alternative label: Gay Garhwali men
alternative label: Gay Garhwalis
comment: Gay men who belong to or are descended from the people native to Garhwal in Uttarakhand and who speak Garhwali.
comment: Hombres gay que pertenecen a o son descendientes de las personas nativas de Garhwal en Uttarakhand y que hablan garhwali. @es
broader: Garhwali LGBTQ+ people
has top concept: LGBTQ+ people
issued: 2022-06-27
modified: 2025-02-23
type: Concept
in scheme: v3
change note: Version 4.1.0

Garhwali bisexual people
preferred label: Personas bisexuales garhwali @es
alternative label: Bisexual Garhwali people
alternative label: Bisexual Garhwalis
alternative label: Bisexuales garhwali @es
comment: Bisexual people who belong to or are descended from the people native to Garhwal in Uttarakhand and who speak Garhwali.
comment: Personas bisexuales que pertenecen a o son descendientes de las personas nativas de Garhwal en Uttarakhand y que hablan garhwali. @es
broader: Garhwali LGBTQ+ people
has top concept: LGBTQ+ people
issued: 2022-06-27
modified: 2025-02-23
type: Concept
in scheme: v3
change note: Version 4.1.0

Garhwali queer people
preferred label: Personas queer garhwali @es
alternative label: Queer Garhwali people
alternative label: Queer Garhwalis
comment: Queer people who belong to or are descended from the people native to Garhwal in Uttarakhand and who speak Garhwali.
comment: Personas queer que pertenecen a o son descendientes de las personas nativas de Garhwal en Uttarakhand y que hablan garhwali. @es
broader: Garhwali LGBTQ+ people
has top concept: LGBTQ+ people
issued: 2022-06-27
modified: 2025-02-23
type: Concept
in scheme: v3
change note: Version 4.1.0

Garhwali transgender people
preferred label: Personas transgénero garhwali @es
alternative label: Transgender Garhwali people
alternative label: Transgender Garhwalis
comment: Transgender people who belong to or are descended from the people native to Garhwal in Uttarakhand and who speak Garhwali.
comment: Personas transgénero que pertenecen a o son descendientes de las personas nativas de Garhwal en Uttarakhand y que hablan garhwali. @es
broader: Garhwali LGBTQ+ people
has top concept: LGBTQ+ people
issued: 2022-06-27
modified: 2025-02-23
type: Concept
in scheme: v3
change note: Version 4.1.0

Garhwali intersex people
preferred label: Personas intersexuales garhwali @es
alternative label: Intersex Garhwali people
alternative label: Intersex Garhwalis
alternative label: Personas intersex garhwali @es
comment: Intersex people who belong to or are descended from those native to Garhwal in Uttarakhand and who speak Garhwali.
comment: Personas intersexuales que pertenecen a o son descendientes de las personas nativas de Garhwal en Uttarakhand y que hablan garhwali. @es
broader: Garhwali LGBTQ+ people
has top concept: LGBTQ+ people
issued: 2022-06-27
modified: 2025-02-23
type: Concept
in scheme: v3
change note: Version 4.1.0

Garhwali asexual people
preferred label: Personas asexuales garhwali @es
alternative label: Asexual Garhwali people
alternative label: Asexual Garhwalis
alternative label: Asexuales garhwali @es
alternative label: Personas garhwali asexuales @es
comment: Asexual people who belong to or are descended from those native to Garhwal in Uttarakhand and who speak Garhwali.
comment: Personas asexuales que pertenecen o son descendientes de las personas nativas de Garhwal en Uttarakhand y hablan garhwali. @es
broader: Garhwali LGBTQ+ people
has top concept: LGBTQ+ people
issued: 2022-06-27
modified: 2025-02-23
type: Concept
in scheme: v3
change note: Version 4.1.0

Actorfic
alternative label: Actor fanfic
alternative label: Actor fic
comment: Fanfiction that focuses on, incorporates, or details the relationships of real-life actors, often of the same sex or gender.
comment: Fanfiction que se centra, incorpora o detalla las relaciones de actores de la vida real, a menudo del mismo sexo o género. @es
broader: Real person fiction
related: LGBTQ+ actors
related: LGBTQ+ films
related: Homoeroticism
has top concept: Subcultures
issued: 2022-07-04
modified: 2025-02-23
type: Concept
in scheme: v3
change note: Version 4.1.0

Alternate universe settings (Fanfiction)
preferred label: Escenarios de un universo alternativo (fanfiction) @es
alternative label: AU (Fanfiction)
alternative label: UA (Fanficción) @es
alternative label: Fanfic @es
comment: Settings alternative to the canonical universe of a text in which fanfiction might take place.
comment: Escenarios alternativos al universo canónico de un texto en el que podría desarrollarse un fanfiction. @es
broader: Fanfiction tropes and genres
narrower: Omegaverse
related: Transfic
has top concept: Subcultures
issued: 2022-07-04
modified: 2025-02-23
type: Concept
in scheme: v3
change note: Version 4.1.0

Anime and manga fandom
preferred label: Fandom de anime y manga @es
alternative label: Anime and manga fan community
alternative label: Anime fandom
alternative label: Manga and anime fandom
alternative label: Manga fandom
alternative label: Comunidad fan del anime y manga @es
alternative label: Fandom de anime @es
alternative label: Fandom de manga @es
alternative label: Comunidades fan de anime y manga @es
comment: The fan community that focuses on, incorporates, or details the relationships of characters derived from anime or manga.
comment: La comunidad de fans que se centra sobre, incorpora o detalla las relaciones de personajes derivados del anime o manga. @es
broader: Fandom
narrower: Bara fandom
narrower: Bishounen
narrower: Boys' Love (Genre)
narrower: Hentai fandom
narrower: Yuri fandom
narrower: Girls’ Love (Genre)
related: LGBTQ+ cartoons
related: LGBTQ+ manga
has top concept: Subcultures
issued: 2022-07-04
modified: 2025-02-23
type: Concept
in scheme: v3
change note: Version 4.1.0

Aromantic people in fandom
preferred label: Personas arrománticas en fandom @es
alternative label: Aromantics in fandom
alternative label: Arrománticos en fandom @es
alternative label: Arrománticas en fandom @es
comment: The participation and inclusion of aromantic people in fan communities.
comment: La participación e inclusion de personas arrománticas en comunidades de fans. @es
broader: LGBTQ+ people in fandom
related: Aromantic people
related: Aromantic authors
related: Aromantic fiction
has top concept: LGBTQ+ people
issued: 2022-07-04
modified: 2025-02-23
type: Concept
in scheme: v3
change note: Version 4.1.0

Asexual people in fandom
preferred label: Personas asexuales en fandom @es
alternative label: Asexuals in fandom
alternative label: Asexuales en fandom @es
comment: The participation and inclusion of asexual people in fan communities.
comment: La participación e inclusión de las personas asexuales en las comunidades de aficionados. @es
broader: LGBTQ+ people in fandom
related: Asexual people
related: Asexual authors
related: Asexual fiction
has top concept: LGBTQ+ people
issued: 2022-07-04
modified: 2025-02-23
type: Concept
in scheme: v3
change note: Version 4.1.0

Bandslash
alternative label: Band slash
comment: Fanfiction that focuses on, incorporates, or details the romantic or sexual relationships between same-gender or same-sex musicians who exist in the real world, usually men.
comment: Fanfiction que se centra, incorpora o detalla las relaciones románticas o sexuales entre músicos del mismo género o del mismo sexo que existen en el mundo real, normalmente hombres. @es
broader: Real person fiction
related: LGBTQ+ musicians
related: Homoeroticism
has top concept: Subcultures
issued: 2022-07-04
modified: 2025-02-23
type: Concept
in scheme: v3
change note: Version 4.1.0

Bara
comment: A genre of Japanese art created primarily by gay men for other gay men that emphasizes masculinity, muscles, body fat, and hair (similar to Bears and Gym subculture in the United States).
comment: Género de arte japonés creado principalmente por hombres gay para otros hombres gay que enfatiza la masculinidad, los músculos, la grasa corporal y el vello (similar a la subcultura de los osos y los gimnasios en los Estados Unidos). @es
broader: Bara fandom
related: Bears (Gay culture)
related: Macho men
related: Gym subculture
has top concept: Subcultures
issued: 2022-07-04
modified: 2025-02-23
type: Concept
in scheme: v3
change note: Version 4.1.0

Bara fandom
preferred label: Fandom bara @es
comment: The fan community that focuses on, incorporates, or details the relationships of characters from bara manga and anime.
comment: La comunidad de fans que se centra sobre, incorpora o detalla las relaciones de personajes del manga y del anime bara. @es
broader: Anime and manga fandom
narrower: Bara
related: Bears (Gay culture)
related: Macho men
related: Gym subculture
related: Gay men in fandom
has top concept: Subcultures
issued: 2022-07-04
modified: 2025-02-23
type: Concept
in scheme: v3
change note: Version 4.1.0

Bisexual people in fandom
preferred label: Parejas bisexuales @es
alternative label: Bisexuals in fandom
comment: The participation and inclusion of bisexual people in fan communities.
comment: Personas bisexuales que son las parejas románticas, sexuales o de juego de otra persona o personas. @es
broader: LGBTQ+ people in fandom
related: Bisexual fiction
related: Bisexual people
related: Bisexual authors
related: Asexual fiction
related: Megasexual fiction
related: Greyromantic fiction
has top concept: LGBTQ+ people
issued: 2022-07-04
modified: 2025-02-23
type: Concept
in scheme: v3
change note: Version 4.1.0

Bishounen
comment: Japanese word that means "beautiful boy" and is used to describe a particular aesthetic of androgynous male beauty. While in Japanese "bishounen" refers specifically to youths under the age of twenty and "biseinen" is used to describe beautiful adult men, English-speaking anime and manga fan communities often use "bishounen" in reference to any good-looking male character, regardless of age.
comment: Palabra japonesa que significa “niño hermoso” y que se utiliza para describir una estética particular de belleza masculina andrógina. Mientras que en japonés "bishounen" se refiere específicamente a jóvenes menores de veinte años y "biseinen" se usa para describir hombres adultos hermosos, las comunidades de fanáticos del anime y manga de habla inglesa a menudo usan "bishounen" en referencia a cualquier personaje masculino atractivo, independientemente de la edad. @es
broader: Anime and manga fandom
related: Youth
related: Boys' Love (Genre)
related: Seme (Yaoi)
related: Uke (Yaoi)
has top concept: Subcultures
issued: 2022-07-04
modified: 2025-02-23
type: Concept
in scheme: v3
change note: Version 4.1.0

Boys' Love (Genre)
preferred label: Boy's love @es
alternative label: BL
alternative label: Boys Love
alternative label: Boys love @es
alternative label: Amor de chicos @es
comment: The manga and anime genre of fictional male-male romance created for a primarily female audience; sometimes used interchangeably with "Yaoi" in English (but not in Japanese).
comment: El género de manga y anime de romance ficticio entre hombres creado para una audiencia principalmente femenina; a veces se utiliza indistintamente con "Yaoi" en inglés (pero no en japonés). @es
broader: Anime and manga fandom
narrower: Yaoi fandom
narrower: Danmei
related: Gay youth literature
has top concept: Subcultures
issued: 2022-07-04
modified: 2025-02-23
type: Concept
in scheme: v3
change note: Version 4.1.0

Bury your gays
alternative label: Dead lesbian syndrome
comment: The trope in fiction that requires that LGBTQ+ characters die or meet some other type of unhappy ending. The trope is also known as "dead lesbian syndrome" due to the tendency for lesbian characters and bisexual female characters to be the targets. Transgender characters have also often been subjected to this trope.
comment: El tropo de ficción que requiere que los personajes LGBTQ+ mueran o tengan otro tipo de final infeliz. El tropo también se conoce como el "síndrome de lesbiana muerta" debido a la tendencia de que personajes lésbicos y personajes femeninos bisexuales sean el foco del tropo. Las personajes transgénero a menudo también han sido sometidas a este tropo. @es
broader: Fanfiction tropes and genres
related: LGBTQ+ fiction
has top concept: Subcultures
issued: 2022-07-04
modified: 2025-02-23
type: Concept
in scheme: v3
change note: Version 4.1.0

Fanart
alternative label: Fan art
alternative label: Arte de fans @es
comment: Art created by fans that relates to media properties or other subjects of fandom.
comment: Arte creado por fanáticos que se relaciona con propiedades de los medios u otros temas del fandom. @es
broader: Fanworks
narrower: Slash art
related: Fanfiction
related: Slash fanworks
has top concept: Subcultures
issued: 2022-07-04
modified: 2025-02-23
type: Concept
in scheme: v3
change note: Version 4.1.0

Fandom
comment: Communities of people who are fans of a particular work or media property. Participation in fandom can include writing and reading fanfiction, creating and viewing fanart, attending conventions, cosplaying, and/or roleplaying.
comment: Comunidades de personas que son fanáticas de una obra o propiedad mediática en particular. La participación en el fandom puede incluir escribir y leer fanfiction, crear y ver fanart, asistir a convenciones, hacer cosplay y/o juegos de rol. @es
broader: Subcultures
narrower: Anime and manga fandom
narrower: Fandom conventions
narrower: Fandom terminology
narrower: Fanworks
narrower: Furry fandom
narrower: Gender in fandom
narrower: LGBTQ+ people in fandom
narrower: People of color in fandom
narrower: Racism in fandom
narrower: Shipping in fandom
narrower: Slash fandom
has top concept: Subcultures
issued: 2022-07-04
modified: 2025-02-23
type: Concept
in scheme: v3
change note: Version 4.1.0

Fandom conventions
preferred label: Convenciones de fandom @es
alternative label: Fan cons
alternative label: Fan conventions
alternative label: Fandom cons
alternative label: Cons de fans @es
alternative label: Convenciones fandom @es
comment: Conventions dedicated to a particular fandom or fandom as a broad category.
comment: Convenciones dedicadas a un fandom en particular o al fandom como categoría amplia. @es
broader: Fandom
narrower: Furry conventions
narrower: Slash conventions
related: Europride
related: LGBTQ+ meeting places
has top concept: Subcultures
issued: 2022-07-04
modified: 2025-02-23
type: Concept
in scheme: v3
change note: Version 4.1.0

Fandom terminology
preferred label: Terminología de fandom @es
alternative label: Fan terminology
alternative label: Fan terms
alternative label: Fandom terms
alternative label: Terminología fan @es
alternative label: Términos fan @es
alternative label: Términos de fandom @es
comment: Jargon or slang commonly used in fan communities, such as "slash" and "shipping."
comment: Jerga o argot comúnmente utilizado en las comunidades de fans, tales como "slash" y "shippeo" @es
broader: Fandom
narrower: Slash terminology
related: LGBTQ+ slang
has top concept: Subcultures
issued: 2022-07-04
modified: 2025-02-23
type: Concept
in scheme: v3
change note: Version 4.1.0

Fanfiction
preferred label: Fanficcion @es
alternative label: Fan fic
alternative label: Fan fiction
alternative label: Fanfic
comment: Written works of fiction created by fans that use the characters, settings, and/or plots of other media properties in a transformative way.
comment: Obras escritas de ficción creadas por fanáticos que utilizan los personajes, escenarios y/o tramas de otras propiedades mediáticas de manera transformadora. @es
broader: Fanworks
narrower: Fanfiction tropes and genres
narrower: LGBTQ+ fanfiction
narrower: Slash fiction
narrower: Transfic
related: LGBTQ+ fiction
related: Fanart
has top concept: Subcultures
issued: 2022-07-04
modified: 2025-02-23
type: Concept
in scheme: v3
change note: Version 4.1.0

Fanfiction tropes and genres
preferred label: Tropos y géneros del fanficcion @es
alternative label: Fanfic tropes and genres
alternative label: Tropos y géneros de fanfic @es
comment: Tropes and genres commonly used in fanfiction. Examples include "there was only one bed" and "enemies to lovers" romance plots.
comment: Tropos y géneros comúnmente utilizados en el fanfiction. Los ejemplos incluyen tramas románticas de "solo había una cama" y de "enemigos a amantes". @es
broader: Fanfiction
narrower: Alternate universe settings (Fanfiction)
narrower: Bury your gays
narrower: Kink in fandom
related: Gender swapping
related: One true pairing
has top concept: Subcultures
issued: 2022-07-04
modified: 2025-02-23
type: Concept
in scheme: v3
change note: Version 4.1.0

Fanworks
alternative label: Fan works
comment: Works, such as fanfiction or fanart, created by fans using characters, settings, and/or plots of other media properties.
comment: Obras, como fanfiction o fanart, creadas por fanáticos utilizando personajes, escenarios y/o tramas de otras propiedades mediáticas. @es
broader: Fandom
narrower: Content warnings
narrower: Fanart
narrower: Fanfiction
narrower: Slash fanworks
has top concept: Subcultures
issued: 2022-07-04
modified: 2025-02-23
type: Concept
in scheme: v3
change note: Version 4.1.0

Femslash
alternative label: Altfic
alternative label: F/F slash
alternative label: Femmeslash
alternative label: Girlslash
alternative label: Ladyslash
comment: A genre of fanworks in which two or more women are placed in a sexual or romantic situation with one another. Works of femslash are commonly erotic or pornographic. In recognition of the fact that the term "slash" has recently been broadened to include LGBTQ+ relationships other than those between two men, slash terms (e.g., Slash art, Slash roleplay, Slash vidding) should be used to describe specific types of femslash.
comment: Género de fanworks en el que dos o más mujeres se encuentran en una situación sexual o romántica. Las obras de femslash suelen ser eróticas o pornográficas. En reconocimiento del hecho de que el término "slash" se ha ampliado recientemente para incluir relaciones LGBTQ+ más allá de las relaciones entre dos hombres, los términos "slash" (por ejemplo, "slash art", "slash roleplay", "slash vidding") deben utilizarse para describir tipos específicos de femslash. @es
broader: Slash (Genre)
narrower: Lesbian fiction
narrower: Lesbian erotic literature
related: Gender swapping
related: Yuri
related: Yuri fandom
has top concept: Subcultures
issued: 2022-07-04
modified: 2025-02-23
type: Concept
in scheme: v3
change note: Version 4.1.0

Fujoshi
comment: Japanese word that literally translates to "rotten girl" and is used to describe young women who enjoy media or fanworks focused on romantic or sexual relationships between men. Some fans self-identify as fujoshis, typically as a form of playful self-deprecation, but it can also be considered derogatory.
comment: Palabra japonesa que se traduce literalmente como "niña podrida" y se utiliza para describir a mujeres jóvenes que disfrutan de los medios o de las obras de fans centradas en las relaciones románticas o sexuales entre hombres. Algunos fanáticos se autoidentifican como fujoshis, generalmente como una forma de autodesprecio juguetón, pero también puede considerarse despectivo. @es
broader: Yaoi fandom
has top concept: Subcultures
issued: 2022-07-04
modified: 2025-02-23
type: Concept
in scheme: v3
change note: Version 4.1.0

Furries
preferred label: Furros @es
comment: Individuals who are interested in anthropomorphized animals, as well as fiction and artwork featuring anthropomorphized animals. Many furries identify with anthropomorphized animal versions of themselves, which are called fursonas.
comment: Personas interesadas en animales antropomorfizados, así como en ficción y obras de arte que presenten animales antropomorfizados. Muchos furros se autoidentifican con versiones animales antropomorfizadas de sí mismos, que se llaman "fursonas". @es
broader: Furry fandom
narrower: Fursonas
narrower: Fursuits
narrower: Yiff
related: Role behavior
related: Roleplay
related: Animal roleplay
related: Furry culture
has top concept: Subcultures
issued: 2022-07-04
modified: 2025-02-23
type: Concept
in scheme: v3
change note: Version 4.1.0

Furry conventions
preferred label: Convenciones de furros @es
alternative label: Furry cons
comment: Conventions for furries that focus on furry fanworks.
comment: Convenciones para furros que se centran en obras de fans furro. @es
broader: Fandom conventions
broader: Furry fandom
related: Europride
related: LGBTQ+ meeting places
has top concept: Subcultures
issued: 2022-07-04
modified: 2025-02-23
type: Concept
in scheme: v3
change note: Version 4.1.0

Furry fandom
preferred label: Fandom de furros @es
alternative label: Furry community
alternative label: Furry fan community
alternative label: Comunidad furra @es
alternative label: Comunidades fan de furros @es
comment: The fan community that focuses on, incorporates, or details anthropomorphized animals.
comment: La comunidad de fans que se centra, incorpora o detalla animales antropomorfizados. @es
broader: Fandom
narrower: Furries
narrower: Furry conventions
has top concept: Subcultures
issued: 2022-07-04
modified: 2025-02-23
type: Concept
in scheme: v3
change note: Version 4.1.0

Fursonas
comment: Anthropomorphized animal versions of people. Fursonas, which are created by members of the furry fandom, are not necessarily animals with fur; they can also be reptiles, birds, or fictional animals, for example.
comment: Versiones animales antropomorfizadas de personas. Las fursonas, que son creadas por miembros del fandom de furros, no son necesariamente animales con pelaje; también pueden ser reptiles, pájaros o animales ficticios, por ejemplo. @es
broader: Furries
related: Role behavior
has top concept: Subcultures
issued: 2022-07-04
modified: 2025-02-23
type: Concept
in scheme: v3
change note: Version 4.1.0

Fursuits
preferred label: Traje de furro @es
alternative label: Traje de furry @es
alternative label: Fursuit @es
comment: Costumes worn by furries that represent their fursonas (i.e., anthropomorphized animal versions of themselves).
comment: Disfraces utilizados por furros que representan sus fursonas (es decir, versiones animales antropomorfizadas de ellos mismos) @es
broader: Furries
related: Clothing
related: Role behavior
related: Roleplay
related: Costumes
has top concept: Subcultures
issued: 2022-07-04
modified: 2025-02-23
type: Concept
in scheme: v3
change note: Version 4.1.0

Gay men in fandom
preferred label: Hombres gay @es
alternative label: Gays @es
comment: The participation and inclusion of gay men in fan communities.
comment: Hombres que se autoidentifican como gay y pertenecen a comunidades gay. Se utiliza predominantemente para describir a hombres que se sienten exclusiva o principalmente atraídos romántica y/o sexualmente a otros hombres. Si bien "gay" se utiliza a menudo como identificador para personas de todos los géneros, este término se refiere específicamente a los hombres gay. @es
broader: LGBTQ+ people in fandom
broader: Men in fandom
related: Gay fiction
related: Gay men
related: Gay authors
related: Bara fandom
has top concept: LGBTQ+ people
issued: 2022-07-04
modified: 2025-02-23
type: Concept
in scheme: v3
change note: Version 4.1.0

Gender in fandom
preferred label: Género en el fandom @es
comment: Issues and discussions about gender in fan spaces and works.
comment: Cuestiones y discusiones sobre el género en espacios y obras de fans. @es
broader: Fandom
narrower: Homophobia in fandom
narrower: Intersex people in fandom
narrower: Men in fandom
narrower: Misogyny in fandom
narrower: Non-binary people in fandom
narrower: Transgender people in fandom
narrower: Transphobia in fandom
narrower: Two-Spirit people in fandom
narrower: Women in fandom
related: Gender swapping
has top concept: Subcultures
issued: 2022-07-04
modified: 2025-02-23
type: Concept
in scheme: v3
change note: Version 4.1.0

Hentai
comment: A genre of anime and manga characterized by explicit sexual content; can also include hentai video games.
comment: Un género de anime y manga caracterizado por contenido sexual explícito; también puede incluir videojuegos hentai. @es
broader: Pornography
broader: Hentai fandom
related: LGBTQ+ cartoons
related: LGBTQ+ erotic literature
related: LGBTQ+ manga
related: Yaoi
has top concept: Sex industry
issued: 2022-07-04
modified: 2025-02-23
type: Concept
in scheme: v3
change note: Version 4.1.0

Hentai fandom
preferred label: Fandom de hentai @es
comment: The fan community that focuses on, incorporates, or details the relationships of characters in hentai, or sexually explicit anime and manga.
comment: La comunidad de fans que se centra en, incorpora o detalla las relaciones de personajes de hentai o anime y manga sexualmente explícitos. @es
broader: Anime and manga fandom
narrower: Hentai
has top concept: Subcultures
issued: 2022-07-04
modified: 2025-02-23
type: Concept
in scheme: v3
change note: Version 4.1.0

Homophobia in fandom
preferred label: Homofobia en el fandom @es
comment: Issues and discussions about the presence of homophobia in fan spaces and works.
comment: Cuestiones y discusiones sobre la presencia de la homofobia en espacios y obras de fans. @es
broader: Homophobia
broader: Gender in fandom
related: LGBTQ+ people in fandom
related: Racism in fandom
has top concept: LGBTQ+ phobia
issued: 2022-07-04
modified: 2025-02-23
type: Concept
in scheme: v3
change note: Version 4.1.0

Intersex people in fandom
preferred label: Personas intersex en fandom @es
comment: The participation and inclusion of intersex people in fan communities.
comment: La participación e inclusión de personas intersex en las comunidades de fans. @es
broader: Gender in fandom
broader: LGBTQ+ people in fandom
narrower: Intersex fiction
has top concept: Subcultures
issued: 2022-07-04
modified: 2025-02-23
type: Concept
in scheme: v3
change note: Version 4.1.0

Kink in fandom
preferred label: Kink en el fandom @es
alternative label: Kink in fan communities
alternative label: Kink en comunidades de fans @es
comment: Representations of non-conventional or marginalized sexual practices in fanfiction.
comment: Representación de prácticas sexuales no convencionales o marginadas en el fanfiction. @es
broader: Fanfiction tropes and genres
related: LGBTQ+ people in fandom
related: Omegaverse
has top concept: Subcultures
issued: 2022-07-04
modified: 2025-02-23
type: Concept
in scheme: v3
change note: Version 4.1.0

Kirk/Spock
alternative label: K/S
alternative label: Spirk
comment: The homoerotic fan pairing of Kirk and Spock from Star Trek: The Original Series. The Kirk/Spock fandom originated much of the terminology and practices associated with fandom today--for example, the word "slash" comes from the forward slash in Kirk/Spock.
comment: El emparejamiento homoerótico por fans de Kirk y Spock de "Star Trek: The Original Series". El fandom de Kirk/Spock originó gran parte de la terminología y las prácticas asociadas con el fandom actual; por ejemplo, la palabra "slash" proviene de la barra diagonal en Kirk/Spock. @es
broader: Ship names in fandom
related: LGBTQ+ science fiction
related: Homoeroticism
related: One true pairing
has top concept: Subcultures
issued: 2022-07-04
modified: 2025-02-23
type: Concept
in scheme: v3
change note: Version 4.1.0

Lesbians in fandom
preferred label: Lesbianas en fandom @es
alternative label: Lesbians in fan communities
alternative label: Lesbianas en comunidades fan @es
comment: The participation and inclusion of lesbians in fan communities.
comment: La participación e inclusión de lesbianas en las comunidades de fans. @es
broader: LGBTQ+ people in fandom
related: Lesbians
related: Lesbian fiction
related: Lesbian authors
has top concept: LGBTQ+ people
issued: 2022-07-04
modified: 2025-02-23
type: Concept
in scheme: v3
change note: Version 4.1.0

LGBTQ+ fanfiction
preferred label: Fanfiction LGBTQ+ @es
alternative label: Fan fic (LGBTQ)
alternative label: Fan fics (LGBTQ)
alternative label: Fan fiction (LGBTQ)
alternative label: Fanfiction (LGBTQ)
alternative label: LGBTQ+ fan fics
alternative label: LGBTQ+ fan fiction
alternative label: LGBTQ+ fanfics
comment: Fanfiction that primarily focuses on LGBTQ+ people, communities, and relationships, often using characters who are not stated to be LGBTQ+ in canon.
comment: Fanfiction que se centra principalmente en personas, comunidades y relaciones LGBTQ+, y que a menudo utiliza personajes que no están declarados como LGBTQ+ en el canon. @es
broader: Fanfiction
related: LGBTQ+ fiction
related: LGBTQ+ youth literature
related: LGBTQ+ authors
has top concept: Subcultures
issued: 2022-07-04
modified: 2025-02-23
type: Concept
in scheme: v3
change note: Version 4.1.0

LGBTQ+ headcanons
preferred label: Headcanons LGBTQ+ @es
alternative label: Headcanons (LGBTQ)
comment: Fans' personal interpretations of media properties and texts, particularly relating to the personalities and behaviors of characters. Use to describe headcanons that certain characters or relationships are LGBTQ+, as well as headcanons about other LGBTQ+ people and issues in the universe of the text.
comment: Interpretaciones personales de los fanáticos de las propiedades y textos de los medios, particularmente en relación con las personalidades y comportamientos de los personajes. Utilícese para describir cánones principales de que ciertos personajes o relaciones son LGBTQ+, así como cánones principales sobre otras personas y problemas LGBTQ+ en el universo del texto. @es
broader: Queer (Verb)
related: LGBTQ+ fiction
related: Shipping in fandom
has top concept: Queer (Verb)
issued: 2022-07-04
modified: 2025-02-23
type: Concept
in scheme: v3
change note: Version 4.1.0

LGBTQ+ people in fandom
preferred label: Personas LGBTQ+ en fandom @es
alternative label: LGBTQ+ people in fan communities
alternative label: People in fandom (LGBTQ)
comment: The participation and inclusion of LGBTQ+ people in fan communities.
comment: La participación e inclusión de personas LGBTQ+ en las comunidades de fans. @es
broader: LGBTQ+ people
broader: Fandom
narrower: Aromantic people in fandom
narrower: Asexual people in fandom
narrower: Bisexual people in fandom
narrower: Gay men in fandom
narrower: Intersex people in fandom
narrower: Lesbians in fandom
narrower: Non-binary people in fandom
narrower: Queer people in fandom
narrower: Transgender people in fandom
related: Homophobia in fandom
related: Kink in fandom
related: Transphobia in fandom
related: Two-Spirit people in fandom
has top concept: LGBTQ+ people
issued: 2022-07-04
modified: 2025-02-23
type: Concept
in scheme: v3
change note: Version 4.1.0

Men in fandom
preferred label: Hombres en fandom @es
comment: The participation and inclusion of men in fan communities.
comment: La participación e inclusión de los hombres en las comunidades de fans. @es
broader: Gender in fandom
narrower: Gay men in fandom
related: Males
has top concept: Subcultures
issued: 2022-07-04
modified: 2025-02-23
type: Concept
in scheme: v3
change note: Version 4.1.0

Misogyny in fandom
preferred label: Misoginia en fandom @es
alternative label: Sexism in fandom
alternative label: Sexismo en fandom @es
comment: Issues and discussions about the presence of misogyny in fan spaces and works.
comment: Cuestiones y discusiones sobre la presencia de la misoginia en espacios y obras de fans. @es
broader: Misogyny
broader: Gender in fandom
related: Sexism
related: Racism in fandom
has top concept: Misogyny
issued: 2022-07-04
modified: 2025-02-23
type: Concept
in scheme: v3
change note: Version 4.1.0

Mpreg
alternative label: M-preg
comment: The fandom trope in which cisgender men can become pregnant. This term should not be used to describe pregnant trans men.
comment: El tropo del fandom en el que los hombres cisgénero pueden quedar embarazados. Este término no debe utilizarse para describir a hombres trans embarazados. @es
broader: Omegaverse
related: Gender swapping
related: LGBTQ+ erotic literature
has top concept: Subcultures
issued: 2022-07-04
modified: 2025-02-23
type: Concept
in scheme: v3
change note: Version 4.1.0

Non-binary people in fandom
preferred label: Personas no binarias en fandom @es
alternative label: Nonbinary people in fandom
comment: The participation and inclusion of non-binary people in fan communities.
comment: La participación e inclusión de personas no binarias en las comunidades de fans. @es
broader: Gender in fandom
broader: LGBTQ+ people in fandom
related: Non-binary people
has top concept: Subcultures
issued: 2022-07-04
modified: 2025-02-23
type: Concept
in scheme: v3
change note: Version 4.1.0

Omegaverse
preferred label: Omegaverso @es
alternative label: A/B/O
alternative label: ABO
alternative label: Alpha/Beta/Omega
alternative label: Omergaverse @es
comment: The alternate universe fanworks trope in which society is divided into three categories of people: alphas, betas, and omegas. Fanworks in the omegaverse often depict characters with genitalia and breeding behaviors (such as heat cycles) similar to wolves. Use to describe fanworks in the omegaverse that focus on LGBTQ+ people and issues.
comment: El tropo de obras de fans del universo alternativo en el que la sociedad se divide en tres categorías de personas: alfas, betas y omegas. Las obras de fans en el omegaverso a menudo representan personajes con genitales y comportamientos reproductivos (como ciclos de celo) similares a los de los lobos. Utilícese para describir obras de fans en el omegaverso que se centran en personas y cuestiones LGBTQ+. @es
broader: Alternate universe settings (Fanfiction)
narrower: Mpreg
related: Kink in fandom
has top concept: Subcultures
issued: 2022-07-04
modified: 2025-02-23
type: Concept
in scheme: v3
change note: Version 4.1.0

One true pairing
alternative label: OTP
comment: Slang term referring to a fan's primary "ship" or preferred relationship within a fandom.
comment: Término de la jerga que se refiere al "ship" principal de un fan o a la relación preferida dentro de un fandom. Siglas en inglés para "una pareja única" o "una pareja veradera." @es
broader: Pairings in fandom
related: Fanfiction tropes and genres
related: Kirk/Spock
has top concept: Subcultures
issued: 2022-07-04
modified: 2025-02-23
type: Concept
in scheme: v3
change note: Version 4.1.0

Original slash fiction
preferred label: Ficción slash orginal @es
comment: Original works of creative fiction that focus on same-sex or same-gender relationships and incorporate tropes from fanfiction; includes femslash fiction.
comment: Obras originales de ficción creativa que se centran en relaciones entre personas del mismo sexo o del mismo género e incorporan tropos de fanfiction; incluye la ficción femslash. @es
broader: Slash fiction
related: LGBTQ+ fiction
related: LGBTQ+ erotic literature
related: Yaoi
has top concept: Subcultures
issued: 2022-07-04
modified: 2025-02-23
type: Concept
in scheme: v3
change note: Version 4.1.0

Pairings in fandom
preferred label: Emparejamiento en fandom @es
alternative label: Fandom pairings
comment: The relationships (primarily romantic or sexual) between characters in fanworks, including relationships that are not present within the canon text.
comment: Las relaciones (principalmente románticas o sexuales) entre personajes de obras de fans, incluidas las relaciones que no están presentes en el texto canónico. @es
broader: Shipping in fandom
narrower: One true pairing
related: Relationship satisfaction
has top concept: Subcultures
issued: 2022-07-04
modified: 2025-02-23
type: Concept
in scheme: v3
change note: Version 4.1.0

People of color in fandom
preferred label: Personas de color en fandom @es
alternative label: BIPOC in fandom
comment: The participation and inclusion of people of color in fan communities.
comment: La participación e inclusión de personas de color en las comunidades de fans. @es
broader: Fandom
related: LGBTQ+ people of color
has top concept: Subcultures
issued: 2022-07-04
modified: 2025-02-23
type: Concept
in scheme: v3
change note: Version 4.1.0

Queerbaiting
alternative label: Queer baiting
alternative label: Cebo queer @es
comment: Marketing tactic in which creators of a piece of media purposefully hint at but do not explicitly depict or follow through with queer relationships or queer representation. Queerbaiting is distinct from queer coding in that queer coding is not typically used as a marketing tactic.
comment: Táctica de marketing en la que los creadores de una pieza mediática insinúan intencionadamente, pero no representan ni dan seguimiento a relaciones o representaciones queer. El queerbaiting se diferencia de la codificación queer en que la codificación queer no suele utilizarse como táctica de marketing. @es
related: LGBTQ+ marketing
related: Queer coding
issued: 2022-07-04
modified: 2025-02-23
type: Concept
in scheme: v3
change note: Version 4.1.0

Queer coding
preferred label: Codificación queer @es
alternative label: Queercoding
comment: Purposeful subtextual coding of a character or relationship in a piece of media as queer. Queer coding is distinct from the practice of queerbaiting in that the queer codes are intentionally present rather than falsely implied and are not typically used as a marketing tactic.
comment: Codificación subtextual intencionada de un personaje o de una relación en una pieza mediática como queer. La codificación queer se diferencia de la práctica del queerbaiting en que los códigos queer están presentes intencionalmente en lugar de implícitos falsamente y no suelen utilizarse como táctica de marketing. @es
related: Handkerchief codes
related: LGBTQ+ literature
related: Reading (Gender)
related: Reading (LGBTQ+ culture)
related: Queerbaiting
issued: 2022-07-04
modified: 2025-02-23
type: Concept
in scheme: v3
change note: Version 4.1.0

Queer people in fandom
preferred label: Personas queer en fandom @es
comment: The participation and inclusion of queer people in fan communities.
comment: La participación e inclusión de personas queer en las comunidades de fans. @es
broader: LGBTQ+ people in fandom
related: Queer fiction
related: Queer people
related: Queer authors
has top concept: LGBTQ+ people
issued: 2022-07-04
modified: 2025-02-23
type: Concept
in scheme: v3
change note: Version 4.1.0

Racism in fandom
preferred label: Racismo en fandom @es
comment: Issues and discussions about the presence of racism in fan spaces and works.
comment: Cuestiones y discusiones sobre la presencia del racismo en espacios y obras de fans. @es
broader: Racism
broader: Fandom
related: Homophobia in fandom
related: Misogyny in fandom
related: Transphobia in fandom
has top concept: Racism
issued: 2022-07-04
modified: 2025-02-23
type: Concept
in scheme: v3
change note: Version 4.1.0

Rape/non-con (Content warning)
preferred label: Violación/No consentimento (Advertencia de contenido) @es
alternative label: Non-consensual (Content warning)
alternative label: Rape (Content warning)
alternative label: No consensual (advertencia de contenido) @es
alternative label: Violación (advertencia de contenido) @es
comment: A content warning applied to fanworks to signal the presence of rape, non-consensual sexual encounters, or dubiously consensual sexual encounters.
comment: Una advertencia de contenido aplicada a obras de fans para señalar la presencia de la violación, encuentros sexuales no consensuales o encuentros sexuales dudosamente consensuados. @es
broader: Content warnings
related: Consent
related: LGBTQ+ victims of rape
related: LGBTQ+ victims of sexual abuse
related: Sexual violence
related: LGBTQ+ survivors of rape
related: LGBTQ+ survivors of sexual abuse
has top concept: Subcultures
issued: 2022-07-04
modified: 2025-02-23
type: Concept
in scheme: v3
change note: Version 4.1.0

Real person fiction
preferred label: Ficción de personas reales @es
alternative label: RPF
alternative label: RPS
alternative label: Real people fiction
alternative label: Real person slash
alternative label: Real person stories
comment: Fanfiction about real people, such as actors or musicians; often but not always used to describe fanfiction focusing on (real or imagined) same-sex or same-gender relationships between celebrities.
comment: Fanfiction sobre personas reales, como actores o músicos; a menudo, pero no siempre, se utiliza para describir fanfiction que se centra en relaciones (reales o imaginarias) entre celebridades del mismo sexo o del mismo género. @es
broader: Slash fiction
narrower: Actorfic
narrower: Bandslash
has top concept: Subcultures
issued: 2022-07-04
modified: 2025-02-23
type: Concept
in scheme: v3
change note: Version 4.1.0

Seme (Yaoi)
comment: Term used in yaoi or yaoi fan communities to describe the giving or dominant partner in a fictional male-male relationship.
comment: Término utilizado en las comunidades yaoi o de fans del yaoi para describir a la pareja dadivosa o dominante en una relación ficticia entre dos personas masculinas. @es
broader: Yaoi
related: Tops (Sex)
related: Bishounen
related: Boys' Love (Genre)
has top concept: Subcultures
issued: 2022-07-04
modified: 2025-02-23
type: Concept
in scheme: v3
change note: Version 4.1.0

Ship names in fandom
preferred label: Nombres de ship en el fandom @es
alternative label: Pairing names in fandom
alternative label: Ship names en el fandom @es
comment: Names used to describe common pairings in fandom. Ship names are often portmanteaus of the names of two (or more) characters in the ship (e.g., Spirk for Spock and Kirk).
comment: Nombres utilizados para describir emparejamientos comunes en el fandom. Los nombres de los "ships" suelen ser combinaciones de los nombres de dos (o más) personajes del "ship" (por ejemplo, "Spirk" para Spock y Kirk). @es
broader: Shipping in fandom
narrower: Kirk/Spock
has top concept: Subcultures
issued: 2022-07-04
modified: 2025-02-23
type: Concept
in scheme: v3
change note: Version 4.1.0

Shipping in fandom
preferred label: Shippeo en el fandom @es
alternative label: Shipping en el fandom @es
comment: Term used to describe fans' desire to see certain characters in sexual or romantic relationships, as well as the practice of pairing those characters in fanworks. The terms "shipping" and "ship" come from "relationship."
comment: Término utilizado para describir el deseo de los fans de ver a ciertos personajes en relaciones sexuales o románticas, así como la práctica de emparejar a esos personajes en obras de fans. Los términos "shipping" y "ship" provienen de "relationship" en inglés. @es
broader: Fandom
narrower: Pairings in fandom
narrower: Ship names in fandom
related: LGBTQ+ headcanons
has top concept: Subcultures
issued: 2022-07-04
modified: 2025-02-23
type: Concept
in scheme: v3
change note: Version 4.1.0

Slash (Genre)
preferred label: Slash (género) @es
alternative label: Slash @es
comment: A genre of fanworks in which two or more characters of the same sex or gender are placed in sexual or romantic situations with one another. Slash fanworks are commonly erotic or pornographic. While the term "slash" has historically been used for male/male couples only, it has been recently been broadened to include LGBTQ+ relationships other than those between two men.
comment: Un género de obras de fans en el que dos o más personajes del mismo sexo o género son colocados en situaciones sexuales o románticas entre sí. Las obras de fans Slash son comúnmente eróticas o pornográficas. Si bien el término "slash" se ha utilizado históricamente solo para relaciones entre hombres, recientemente se ha ampliado para incluir relaciones LGBTQ+ distintas de aquellas entre dos hombres. @es
broader: Slash fandom
narrower: Femslash
has top concept: Subcultures
issued: 2022-07-04
modified: 2025-02-23
type: Concept
in scheme: v3
change note: Version 4.1.0

Slash art
preferred label: Arte slash @es
comment: Artwork depicting same-sex or same-gender couples that is usually erotic or pornographic in nature. Historically used for male-male couples only, but is now used more broadly; includes femslash art.
comment: Obras de arte que representan parejas del mismo sexo o del mismo género y que suelen ser de naturaleza erótica o pornográfica. Históricamente se utilizaba únicamente para parejas de hombres, pero ahora se utiliza de forma más amplia; incluye arte femslash. @es
broader: Fanart
broader: Slash fanworks
related: LGBTQ+ arts
has top concept: Subcultures
issued: 2022-07-04
modified: 2025-02-23
type: Concept
in scheme: v3
change note: Version 4.1.0

Slash conventions
preferred label: Convenciones slash @es
alternative label: Slash cons
alternative label: Cons slash @es
comment: Conventions focused on slash, or fanworks depicting same-sex or same-gender couples that are typically erotic or pornographic in nature. Historically used for male-male couples only, but is now used more broadly; includes femslash conventions.
comment: Convenciones centradas en slash, o fanworks que representan parejas del mismo sexo o del mismo género que son típicamente de naturaleza erótica o pornográfica. Históricamente se utilizaba únicamente para parejas de hombres, pero ahora se utiliza de forma más amplia; incluye convenciones del femslash. @es
broader: Fandom conventions
broader: Slash fandom
related: Europride
related: LGBTQ+ meeting places
has top concept: Subcultures
issued: 2022-07-04
modified: 2025-02-23
type: Concept
in scheme: v3
change note: Version 4.1.0

Slash fandom
preferred label: Fandom slash @es
alternative label: Slash fan community
alternative label: Comunidad fan slash @es
alternative label: Comunidad de fans slash @es
comment: The fan community that focuses on, incorporates, or details relationships between two characters of the same sex or gender (usually fictional, with "Real person fiction" as an exception). Historically used for male-male couples only, but is now used more broadly; includes femslash fandom.
comment: La comunidad de fans que se centra sobre, incorpora o detalla las relaciones entre dos personajes del mismo sexo o género (normalmente ficticios, con la excepción de "ficción de personas reales"). Históricamente se utilizaba únicamente para parejas de hombres, pero ahora se utiliza de forma más amplia; incluye fandom de femslash. @es
broader: Fandom
narrower: Slash (Genre)
narrower: Slash conventions
narrower: Slash fanworks
narrower: Slash fiction
narrower: Slash terminology
related: Yuri fandom
has top concept: Subcultures
issued: 2022-07-04
modified: 2025-02-23
type: Concept
in scheme: v3
change note: Version 4.1.0

Slash fanworks
preferred label: Fanworks slash @es
alternative label: Slash fan works
alternative label: Fan works slash @es
comment: Works created by fans that focus on romantic or sexual relationships between characters of the same sex or gender. Typically erotic or pornographic in nature. Historically used for male-male couples only, but is now used more broadly; includes femslash fanworks.
comment: Obras creadas por fans que se centran en relaciones románticas o sexuales entre personajes del mismo sexo o género. Normalmente de naturaleza erótica o pornográfica. Históricamente se utilizaba únicamente para parejas de hombres, pero ahora se utiliza de forma más amplia; incluye obras de fans de femslash. @es
broader: Fanworks
broader: Slash fandom
narrower: Slash art
narrower: Slash fiction
narrower: Slash manips
narrower: Slash roleplay
narrower: Slash vidding
related: Fanart
related: Yaoi
has top concept: Subcultures
issued: 2022-07-04
modified: 2025-02-23
type: Concept
in scheme: v3
change note: Version 4.1.0

Slash fiction
preferred label: Ficción slash @es
alternative label: Slash fan fics
alternative label: Slash fan fiction
alternative label: Slash fanfiction
alternative label: Slash fic
alternative label: Fan ficción slash @es
alternative label: Fan fic slash @es
alternative label: Fanfiction slash @es
alternative label: Fanfic slash @es
comment: Fanfiction focusing on sexual or romantic relationships between characters of the same sex or gender that is typically erotic or pornographic in nature. Historically used for male-male couples only, but is now used more broadly; includes femslash fiction.
comment: Fanficción que se centra en relaciones sexuales o románticas entre personajes del mismo sexo o género y que suele ser de naturaleza erótica o pornográfica. Históricamente se utilizaba únicamente para parejas de hombres, pero ahora se utiliza de forma más amplia; incluye ficción femslash. @es
broader: Fanfiction
broader: Slash fandom
broader: Slash fanworks
narrower: Original slash fiction
narrower: Real person fiction
related: LGBTQ+ erotic literature
has top concept: Subcultures
issued: 2022-07-04
modified: 2025-02-23
type: Concept
in scheme: v3
change note: Version 4.1.0

Slash manips
comment: Fan-created photo manipulations or deepfakes depicting sexual or romantic relationships between characters from various media properties. Typically erotic or pornographic in nature. Historically used for male-male couples only, but is now used more broadly; includes femslash manips.
broader: Slash fanworks
has top concept: Subcultures
issued: 2022-07-04
modified: 2025-02-23
type: Concept
in scheme: v3
change note: Version 4.1.0

Slash roleplay
preferred label: Juego de roles slash @es
alternative label: Slash role play
alternative label: Roleplay slash @es
comment: The act of pretending to be and behaving as a character in a sexual or romantic relationship with another character of the same sex or gender, sometimes to generate ideas for fanworks. Typically erotic or pornographic in nature. Historically used for male-male couples only, but is now used more broadly; includes femslash roleplay.
comment: El acto de pretender ser y comportarse como un personaje en una relación sexual o romántica con otro personaje del mismo sexo o género, a veces para generar ideas para fanworks. Normalmente de naturaleza erótica o pornográfica. Históricamente se utilizaba únicamente para parejas de hombres, pero ahora se utiliza de forma más amplia; incluye juego de rol femslash. @es
broader: Slash fanworks
related: Role behavior
related: Roleplay
has top concept: Subcultures
issued: 2022-07-04
modified: 2025-02-23
type: Concept
in scheme: v3
change note: Version 4.1.0

Slash terminology
preferred label: Terminología slash @es
alternative label: Slash terms
alternative label: Términos slash @es
comment: Slang relating to fanworks about sexual or romantic relationships between characters of the same sex or gender. Historically used for male-male couples only, but is now used more broadly; includes femslash terminology.
comment: Jerga relacionada con obras de fans sobre relaciones sexuales o románticas entre personajes del mismo sexo o género. Históricamente se utilizaba únicamente para parejas de hombres, pero ahora se utiliza de forma más amplia; incluye terminología femslash. @es
broader: Fandom terminology
broader: Slash fandom
related: LGBTQ+ slang
has top concept: Subcultures
issued: 2022-07-04
modified: 2025-02-23
type: Concept
in scheme: v3
change note: Version 4.1.0

Slash vidding
comment: Creating videos about sexual or romantic relationships between same-sex or -gender couples using scenes from television, movies, or video games. Historically used for male-male couples only, but is now used more broadly; includes femslash vidding.
broader: Slash fanworks
related: LGBTQ+ video games
has top concept: Subcultures
issued: 2022-07-04
modified: 2025-02-23
type: Concept
in scheme: v3
change note: Version 4.1.0

Transfic
comment: Term used to describe fanfiction about trans characters, typically characters who are not stated to be transgender, transsexual, or gender diverse in the canon text
comment: Término utilizado para describir fanfiction sobre personajes trans, generalmente personajes que no se declaran como transgénero, transexual o de género diverso en el texto canónico. @es
broader: Fanfiction
related: Gender swapping
related: Transgender fiction
related: Alternate universe settings (Fanfiction)
has top concept: Subcultures
issued: 2022-07-04
modified: 2025-02-23
type: Concept
in scheme: v3
change note: Version 4.1.0

Transgender people in fandom
preferred label: Personas transgénero en fandom @es
alternative label: Trans people in fandom
alternative label: Personas trans en fandom @es
comment: The participation and inclusion of transgender people in fan communities.
comment: La participación e inclusión de personas transgénero en las comunidades de fans. @es
broader: Gender in fandom
broader: LGBTQ+ people in fandom
related: Transgender people
related: Transgender fiction
related: Transgender authors
has top concept: Subcultures
issued: 2022-07-04
modified: 2025-02-23
type: Concept
in scheme: v3
change note: Version 4.1.0

Transphobia in fandom
preferred label: Transfobia en fandom @es
comment: Issues and discussions about the presence of transphobia in fan spaces and works.
comment: Asuntos y debates sobre la presencia de la transfobia en espacios y obras de fans. @es
broader: Transphobia
broader: Gender in fandom
related: LGBTQ+ people in fandom
related: Racism in fandom
has top concept: LGBTQ+ phobia
issued: 2022-07-04
modified: 2025-02-23
type: Concept
in scheme: v3
change note: Version 4.1.0

Two-Spirit people in fandom
preferred label: Personas dos espíritus en fandom @es
alternative label: 2S people in fandom
alternative label: Two Spirit people in fandom
alternative label: Two Spirited people in fandom
alternative label: Two-Spirited people in fandom
comment: The participation and inclusion of Two-Spirit people in fan communities.
comment: La participación e inclusión de las personas dos espíritus en las comunidades de aficionados. @es
broader: Gender in fandom
related: Two-Spirit people
related: Two-Spirit fiction
related: LGBTQ+ people in fandom
has top concept: Subcultures
issued: 2022-07-04
modified: 2025-02-23
type: Concept
in scheme: v3
change note: Version 4.1.0

Uke (Yaoi)
comment: Term used in yaoi and yaoi fan communities to describe the receiving or submissive partner in a fictional male-male relationship.
comment: Término utilizado en las comunidades de fans del yaoi y del yaoi para describir a la pareja receptora o sumisa en una relación ficticia entre hombres. @es
broader: Yaoi
related: Bishounen
related: Boys' Love (Genre)
has top concept: Subcultures
issued: 2022-07-04
modified: 2025-02-23
type: Concept
in scheme: v3
change note: Version 4.1.0

Underage (Content warning)
preferred label: Menor de edad (Advertencia de contenido) @es
comment: A content warning applied to fanworks to signal the depiction of people under the age of consent in sexual situations, either with other underage people or adults.
comment: Advertencia de contenido aplicada a las obras de fans para señalar la representación de personas menores a la de edad de consentimiento en situaciones sexuales, ya sea con otras personas menores de edad o con personas adultas. @es
broader: Content warnings
related: Age of consent
related: Consent
has top concept: Subcultures
issued: 2022-07-04
modified: 2025-02-23
type: Concept
in scheme: v3
change note: Version 4.1.0

Women in fandom
preferred label: Mujeres en fandom @es
comment: The participation and inclusion of women in fan communities.
comment: La participación e inclusión de las mujeres en las comunidades de fans. @es
broader: Gender in fandom
related: Females
has top concept: Subcultures
issued: 2022-07-04
modified: 2025-02-23
type: Concept
in scheme: v3
change note: Version 4.1.0

Yaoi
comment: Japanese word used by English-speaking anime and manga fans to describe explicit or pornographic works featuring male-male couples that are typically created by heterosexual female authors for heterosexual female readers. Note that the Japanese meaning and usage of "yaoi" and related terms differ considerably.
comment: Palabra japonesa utilizada por los fanáticos del anime y el manga de habla inglesa para describir obras explícitas o pornográficas que presentan parejas de hombres y que generalmente son creadas por autoras heterosexuales para lectoras heterosexuales. Tenga en cuenta que el significado y el uso japonés de "yaoi" y términos relacionados difieren considerablemente. @es
broader: Yaoi fandom
narrower: Seme (Yaoi)
narrower: Uke (Yaoi)
related: Gay fiction
related: Gay erotic literature
related: Hentai
related: Original slash fiction
related: Slash fanworks
has top concept: Subcultures
issued: 2022-07-04
modified: 2025-02-23
type: Concept
in scheme: v3
change note: Version 4.1.0

Yaoi fandom
preferred label: Fandom yaoi @es
comment: The fan community that focuses on, incorporates, or details the sexual or romantic relationships between male characters from anime and manga.
comment: La comunidad de fans que se centra sobre, incorpora o detalla las relaciones sexuales o románticas entre personajes masculinos del anime y manga. @es
broader: Boys' Love (Genre)
narrower: Fujoshi
narrower: Yaoi
has top concept: Subcultures
issued: 2022-07-04
modified: 2025-02-23
type: Concept
in scheme: v3
change note: Version 4.1.0

Yiff
comment: Slang term used by members of the furry fandom to describe the act of sex.
comment: Término en inglés de la jerga utilizado por miembros del fandom o comunidad furro para describir el acto sexual. @es
broader: Furries
related: Sex (Act)
has top concept: Subcultures
issued: 2022-07-04
modified: 2025-02-23
type: Concept
in scheme: v3
change note: Version 4.1.0

Yuri
comment: A genre focusing on the romantic or sexual relationships between female characters from anime and manga.
comment: Un género del anime y manga que se centra en las relaciones románticas o sexuales entre personajes femeninos. @es
broader: Yuri fandom
related: Lesbian fiction
related: Lesbian erotic literature
related: Femslash
has top concept: Subcultures
issued: 2022-07-04
modified: 2025-02-23
type: Concept
in scheme: v3
change note: Version 4.1.0

Yuri fandom
preferred label: Fandom yuri @es
comment: The fan community that focuses on, incorporates, or details the romantic or sexual relationships between female characters from anime and manga.
comment: La comunidad de fans que se centra sobre, incorpora o detalla las relaciones románticas o sexuales entre personajes femeninos del anime y manga. @es
broader: Anime and manga fandom
broader: Girls’ Love (Genre)
narrower: Yuri
related: Femslash
related: Slash fandom
has top concept: Subcultures
issued: 2022-07-04
modified: 2025-02-23
type: Concept
in scheme: v3
change note: Version 4.1.0

Non-binary children
preferred label: Niños no binarios @es
alternative label: Non-binary kids
alternative label: Nonbinary children
alternative label: Nonbinary kids
alternative label: Niñxs no binarios @es
comment: Non-binary people who have not yet reached the age of adolescence.
comment: Niños menores de 18 años que se identifican como no binarios. @es
broader: LGBTQ+ children
broader: Non-binary youth
related: Gender creative
has top concept: Family members
issued: 2022-07-19
modified: 2025-02-23
type: Concept
in scheme: v3
change note: Version 4.1.0

Non-binary youth
preferred label: Zines no binarios @es
alternative label: Non-binary adolescents
alternative label: Non-binary teenagers
alternative label: Non-binary teens
alternative label: Nonbinary youth
comment: Non-binary people who are between the ages of childhood and adulthood.
comment: Publicaciones independientes de pequeña tirada generalmente reproducidas mediante fotocopiadora; utilícese para revistas creadas por personas no binarias y/o que se centran en identidades, cuestiones o culturas no binarias. @es
broader: Non-binary people
broader: LGBTQ+ youth
narrower: Non-binary children
has top concept: LGBTQ+ people
issued: 2022-07-19
modified: 2025-02-23
type: Concept
in scheme: v3
change note: Version 4.1.0

Parents of LGBTQ+ people
preferred label: Madres y padres de personas LGBTQ+ @es
alternative label: LGBTQ people's parents
alternative label: LGBTQ+ people's parents
alternative label: Parents of LGBTQ people
alternative label: Padres de personas LGBTQ+ @es
alternative label: Madres de personas LGBTQ+ @es
comment: Individuals who have one or more LGBTQ+ child.
comment: Personas que actúan como padres de una o más personas LGBTQ+. Para padres que son LGBTQ+, utilice el término "madres y padres LGBTQ+" @es
broader: Parents
narrower: Parents of bisexual people
narrower: Parents of gay men
narrower: Parents of lesbians
narrower: Parents of queer people
narrower: Parents of transgender people
narrower: Parents of non-binary people
narrower: Parents of intersex people
narrower: Parents of asexual people
has top concept: Family members
issued: 2022-07-19
modified: 2025-02-23
type: Concept
in scheme: v3
change note: Version 4.1.0

Parents of non-binary people
preferred label: Madres y padres de personas no binarias @es
alternative label: Non-binary people's parents
alternative label: Nonbinary people's parents
alternative label: Parents of nonbinary people
alternative label: Madres de personas no binarias @es
alternative label: Padres de personas no binarias @es
comment: Individuals who have one or more non-binary child.
comment: Personas actual como padres de una o más personas no binarias. Para padres que son non binarios, utilice el término "madres y padres no binarios" @es
broader: Parents of LGBTQ+ people
has top concept: Family members
issued: 2022-07-19
modified: 2025-02-23
type: Concept
in scheme: v3
change note: Version 4.1.0

LGBTQ+ people who use substances for medical purposes
preferred label: Personas LGBTQ+ que utilizan sustancias con fines médicos @es
alternative label: People who use substances for medical purposes (LGBTQ)
alternative label: Personas que utilizan sustancias con fines médicos (LGBTQ) @es
comment: LGBTQ+ people who use substances (that are typically deemed harmful or are subject to legal restriction, such as drugs or alcohol) in order to manage pain and other symptoms related to a medical condition or disability.
comment: Personas LGBTQ+ que utilizan sustancias (que suelen ser consideradas nocivas o están sujetas a restricciones legales, como las drogas o el alcohol) para controlar el dolor y otros síntomas relacionados con una enfermedad o discapacidad. @es
broader: LGBTQ+ people who use substances
related: Cocaine
related: LGBTQ+ disabled people
related: LGBTQ+ people with chronic illnesses
related: Two-Spirit people who use substances for medical purposes
has top concept: LGBTQ+ people
issued: 2022-07-19
modified: 2025-04-24
type: Concept
in scheme: v3
change note: Version 4.1.0

Fairies (Gay culture)
preferred label: Faeries (cultura gay) @es
alternative label: Fairy (Gay culture)
alternative label: Hadas @es
comment: Pejorative term used chiefly in North America to describe gay men (or men assumed to be gay) and insult their perceived femininity. Some gay men have reclaimed this term and use it to describe themselves. Not to be confused with Faeries, the queer spiritual group.
comment: Término peyorativo utilizado principalmente en Norteamérica para describir a los hombres gay (o a los hombres que se asume que son gay) e insultar su feminidad percibida. Algunos hombres gay han recuperado este término y lo utilizan para describirse a sí mismos. No debe confundirse con "Faeries", el grupo espiritual queer. @es
broader: LGBTQ+ historical terms
broader: Reclaimed terms
broader: Slurs
related: Gay culture
related: Gay slang
has top concept: LGBTQ+ historical terms
issued: 2022-07-20
modified: 2025-03-20
type: Concept
in scheme: v3
change note: Version 4.1.0

Gujarati LGBTQ+ people
preferred label: Personas LGBTQ+ guyaratí @es
alternative label: Gujarati people (LGBTQ)
alternative label: Gujaratis (LGBTQ)
alternative label: LGBTQ+ Gujarati people
alternative label: LGBTQ+ Gujaratis
comment: LGBTQ+ people who reside in or are descended from those indigenous to the Indian state of Gujarat.
comment: Personas LGBTQ+ que residen en o son descendientes de las personas indígenas del estado indio de Gujarat. @es
broader: LGBTQ+ people of shared ethnic or national identities
broader: LGBTQ+ people of color
narrower: Gujarati lesbians
narrower: Gujarati gay men
narrower: Gujarati bisexual people
narrower: Gujarati transgender people
narrower: Gujarati asexual people
narrower: Gujarati queer people
narrower: Gujarati intersex people
narrower: Gujarati non-binary people
has top concept: LGBTQ+ people
issued: 2022-07-20
modified: 2025-02-23
type: Concept
in scheme: v3
change note: Version 4.1.0

Gujarati lesbians
preferred label: Lesbianas guyaratí @es
alternative label: Lesbian Gujaratis
comment: Lesbians who reside in or are descended from those indigenous to the Indian state of Gujarat.
comment: Lesbianas que residen en o son descendientes de las personas indígenas del estado indio de Gujarat. @es
broader: Gujarati LGBTQ+ people
has top concept: LGBTQ+ people
issued: 2022-07-20
modified: 2025-02-23
type: Concept
in scheme: v3
change note: Version 4.1.0

Gujarati gay men
preferred label: Hombres gay guyaratí @es
alternative label: Gay Gujarati men
alternative label: Gay Gujaratis
comment: Gay men who reside in or are descended from those indigenous to the Indian state of Gujarat.
comment: Hombres gay que residen en o son descendientes de las personas indígenas del estado indio de Gujarat. @es
broader: Gujarati LGBTQ+ people
has top concept: LGBTQ+ people
issued: 2022-07-20
modified: 2025-02-23
type: Concept
in scheme: v3
change note: Version 4.1.0

Gujarati bisexual people
preferred label: Personas bisexuales guyaratí @es
alternative label: Bisexual Gujarati people
alternative label: Bisexual Gujaratis
comment: Bisexual people who reside in or are descended from those indigenous to the Indian state of Gujarat.
comment: Personas bisexuales que residen en o son descendientes de las personas indígenas del estado indio de Gujarat. @es
broader: Gujarati LGBTQ+ people
has top concept: LGBTQ+ people
issued: 2022-07-20
modified: 2025-02-23
type: Concept
in scheme: v3
change note: Version 4.1.0

Gujarati transgender people
preferred label: Personas transgénero guyaratí @es
alternative label: Trangender Gujaratis
alternative label: Transgender Gujarati people
comment: Transgender people who reside in or are descended from those indigenous to the Indian state of Gujarat.
comment: Personas transgénero que residen en o son descendientes de las personas indígenas del estado indio de Gujarat. @es
broader: Gujarati LGBTQ+ people
has top concept: LGBTQ+ people
issued: 2022-07-20
modified: 2025-02-23
type: Concept
in scheme: v3
change note: Version 4.1.0

Gujarati asexual people
preferred label: Personas asexuales guyaratí @es
alternative label: Asexual Gujarati people
alternative label: Asexual Gujaratis
comment: Asexual people who reside in or are descended from those indigenous to the Indian state of Gujarat.
comment: Personas asexuales que residen en o son descendientes de las personas indígenas del estado indio de Gujarat. @es
broader: Gujarati LGBTQ+ people
has top concept: LGBTQ+ people
issued: 2022-07-20
modified: 2025-02-23
type: Concept
in scheme: v3
change note: Version 4.1.0

Gujarati queer people
preferred label: Personas queer guyaratí @es
alternative label: Queer Gujarati people
alternative label: Queer Gujaratis
comment: Queer people who reside in or are descended from those indigenous to the Indian state of Gujarat.
comment: Personas queer que residen en o son descendientes de las personas indígenas del estado indio de Gujarat. @es
broader: Gujarati LGBTQ+ people
has top concept: LGBTQ+ people
issued: 2022-07-20
modified: 2025-02-23
type: Concept
in scheme: v3
change note: Version 4.1.0

Gujarati intersex people
preferred label: Personas intersexuales guyaratí @es
alternative label: Intersex Gujarati people
alternative label: Intersex Gujaratis
alternative label: Personas intersex guyaratí @es
comment: Intersex people who reside in or are descended from those indigenous to the Indian state of Gujarat.
comment: Personas intersexuales que residen en o son descendientes de las personas indígenas del estado indio de Gujarat. @es
broader: Gujarati LGBTQ+ people
has top concept: LGBTQ+ people
issued: 2022-07-20
modified: 2025-02-23
type: Concept
in scheme: v3
change note: Version 4.1.0

Haryanvi LGBTQ+ people
preferred label: Personas LGBTQ+ haryanvi @es
alternative label: Haryanvi people (LGBTQ)
alternative label: Haryanvis (LGBTQ)
alternative label: LGBTQ+ Haryanvi people
alternative label: LGBTQ+ Haryanvis
comment: LGBTQ+ people who are indigenous to or descended from those indigenous to what is now the Indian state of Haryana. This term can also apply to those who currently reside in Haryana.
comment: Personas LGBTQ+ que son indígenas o son descendientes de personas indígenas de lo que hoy es el estado de Haryana. Este término también es aplicable a quienes actualmente residen en Haryana. @es
broader: LGBTQ+ people of shared ethnic or national identities
broader: LGBTQ+ people of color
narrower: Haryanvi lesbians
narrower: Haryanvi gay men
narrower: Haryanvi bisexual people
narrower: Haryanvi transgender people
narrower: Haryanvi queer people
narrower: Haryanvi intersex people
narrower: Haryanvi asexual people
narrower: Haryanvi non-binary people
has top concept: LGBTQ+ people
issued: 2022-07-28
modified: 2025-02-23
type: Concept
in scheme: v3
change note: Version 4.1.0

Haryanvi lesbians
preferred label: Lesbianas haryanvi @es
alternative label: Lesbian Haryanvis
comment: Lesbians who are indigenous to or descended from those indigenous to what is now the Indian state of Haryana. This term can also apply to those who currently reside in Haryana.
comment: Lesbianas que son indígenas o son descendientes de personas indígenas de lo que hoy es el estado de Haryana. Este término también es aplicable a quienes actualmente residen en Haryana. @es
broader: Haryanvi LGBTQ+ people
has top concept: LGBTQ+ people
issued: 2022-07-28
modified: 2025-02-23
type: Concept
in scheme: v3
change note: Version 4.1.0

Haryanvi gay men
preferred label: Hombres haryanvi @es
alternative label: Gay Haryanvi men
alternative label: Gay Haryanvis
comment: Gay men who are indigenous to or descended from those indigenous to what is now the Indian state of Haryana. This term can also apply to those who currently reside in Haryana.
comment: Hombres gay que son indígenas o son descendientes de personas indígenas de lo que hoy es el estado de Haryana. Este término también es aplicable a quienes actualmente residen en Haryana. @es
broader: Haryanvi LGBTQ+ people
has top concept: LGBTQ+ people
issued: 2022-07-28
modified: 2025-02-23
type: Concept
in scheme: v3
change note: Version 4.1.0

Haryanvi bisexual people
preferred label: Personas bisexuales haryanvi @es
alternative label: Bisexual Haryanvi people
alternative label: Bisexual Haryanvis
comment: Bisexual people who are indigenous to or descended from those indigenous to what is now the Indian state of Haryana. This term can also apply to those who currently reside in Haryana.
comment: Personas bisexuales que son indígenas o son descendientes de personas indígenas de lo que hoy es el estado de Haryana. Este término también es aplicable a quienes actualmente residen en Haryana. @es
broader: Haryanvi LGBTQ+ people
has top concept: LGBTQ+ people
issued: 2022-07-28
modified: 2025-02-23
type: Concept
in scheme: v3
change note: Version 4.1.0

Haryanvi transgender people
preferred label: Personas transgénero haryanvi @es
alternative label: Transgender Haryanvi people
alternative label: Transgender Haryanvis
comment: Transgender people who are indigenous to or descended from those indigenous to what is now the Indian state of Haryana. This term can also apply to those who currently reside in Haryana.
comment: Personas transgénero que son indígenas o son descendientes de personas indígenas de lo que hoy es el estado de Haryana. Este término también es aplicable a quienes actualmente residen en Haryana. @es
broader: Haryanvi LGBTQ+ people
has top concept: LGBTQ+ people
issued: 2022-07-28
modified: 2025-02-23
type: Concept
in scheme: v3
change note: Version 4.1.0

Haryanvi queer people
preferred label: Personas queer haryanvi @es
alternative label: Queer Haryanvi people
alternative label: Queer Haryanvis
comment: Queer people who are indigenous to or descended from those indigenous to what is now the Indian state of Haryana. This term can also apply to those who currently reside in Haryana.
comment: Personas queer que son indígenas o son descendientes de personas indígenas de lo que hoy es el estado de Haryana. Este término también es aplicable a quienes actualmente residen en Haryana. @es
broader: Haryanvi LGBTQ+ people
has top concept: LGBTQ+ people
issued: 2022-07-28
modified: 2025-02-23
type: Concept
in scheme: v3
change note: Version 4.1.0

Haryanvi intersex people
preferred label: Personas intersexuales haryanvi @es
alternative label: Intersex Haryanvi people
alternative label: Intersex Haryanvis
alternative label: Personas intersex haryanvi @es
comment: Intersex people who are indigenous to or descended from those indigenous to what is now the Indian state of Haryana. This term can also apply to those who currently reside in Haryana.
comment: Personas intersexuales que son indígenas o son descendientes de personas indígenas de lo que hoy es el estado de Haryana. Este término también es aplicable a quienes actualmente residen en Haryana. @es
broader: Haryanvi LGBTQ+ people
has top concept: LGBTQ+ people
issued: 2022-07-28
modified: 2025-02-23
type: Concept
in scheme: v3
change note: Version 4.1.0

Haryanvi asexual people
preferred label: Personas asexuales haryanvi @es
alternative label: Asexual Haryanvi people
alternative label: Asexual Haryanvis
comment: Asexual people who are indigenous to or descended from those indigenous to what is now the Indian state of Haryana. This term can also apply to those who currently reside in Haryana.
comment: Personas asexuales que son indígenas o son descendientes de personas indígenas de lo que hoy es el estado de Haryana. Este término también es aplicable a quienes actualmente residen en Haryana. @es
broader: Haryanvi LGBTQ+ people
has top concept: LGBTQ+ people
issued: 2022-07-28
modified: 2025-02-23
type: Concept
in scheme: v3
change note: Version 4.1.0

Kalash LGBTQ+ people
preferred label: Personas LGBTQ+ kalash @es
alternative label: Kalasha (LGBTQ)
alternative label: Kalasha LGBTQ+ people
alternative label: LGBTQ+ Kalasha
comment: LGBTQ+ people who belong to the indigenous Kalasha people and reside in the Chitral District of Khyber-Pakhtunkhwa province in Pakistan.
comment: Personas LGBTQ+ que pertenecen al pueblo indígena kalasha y residen en el distrito Chitral de la provincia Khyber-Pakhtunkhwa en Pakistán. @es
broader: LGBTQ+ people of shared ethnic or national identities
broader: LGBTQ+ people of color
narrower: Kalash lesbians
narrower: Kalash gay men
narrower: Kalash bisexual people
narrower: Kalash transgender people
narrower: Kalash queer people
narrower: Kalash intersex people
narrower: Kalash asexual people
narrower: Kalash non-binary people
has top concept: LGBTQ+ people
issued: 2022-07-28
modified: 2025-02-23
type: Concept
in scheme: v3
change note: Version 4.1.0

Kalash lesbians
preferred label: Lesbianas kalash @es
alternative label: Lesbian Kalasha
comment: Lesbians who belong to the indigenous Kalasha people and reside in the Chitral District of Khyber-Pakhtunkhwa province in Pakistan.
comment: Lesbianas que pertenecen al pueblo indígena kalasha y residen en el distrito Chitral de la provincia Khyber-Pakhtunkhwa en Pakistán. @es
broader: Kalash LGBTQ+ people
has top concept: LGBTQ+ people
issued: 2022-07-28
modified: 2025-02-23
type: Concept
in scheme: v3
change note: Version 4.1.0

Kalash gay men
preferred label: Hombres gay kalash @es
alternative label: Gay Kalash men
alternative label: Gay Kalasha men
comment: Gay men who belong to the indigenous Kalasha people and reside in the Chitral District of Khyber-Pakhtunkhwa province in Pakistan.
comment: Hombres gay que pertenecen a el pueblo indígena Kalasha y residen en el distrito Chitral de la provincia Khyber-Pakhtunkhwa en Pakistan. @es
broader: Kalash LGBTQ+ people
has top concept: LGBTQ+ people
issued: 2022-07-28
modified: 2025-02-23
type: Concept
in scheme: v3
change note: Version 4.1.0

Kalash bisexual people
preferred label: Personas bisexuales kalash @es
alternative label: Bisexual Kalash people
alternative label: Kalasha bisexual people
comment: Bisexual people who belong to the indigenous Kalasha people and reside in the Chitral District of Khyber-Pakhtunkhwa province in Pakistan.
comment: Personas bisexuales que pertenecen a el pueblo indígena Kalasha y residen en el distrito Chitral de la provincia Khyber-Pakhtunkhwa en Pakistan. @es
broader: Kalash LGBTQ+ people
has top concept: LGBTQ+ people
issued: 2022-07-28
modified: 2025-02-23
type: Concept
in scheme: v3
change note: Version 4.1.0

Kalash transgender people
preferred label: Personas transgénero kalash @es
alternative label: Transgender Kalash people
alternative label: Transgender Kalasha
comment: Transgender people who belong to the indigenous Kalasha people and reside in the Chitral District of Khyber-Pakhtunkhwa province in Pakistan.
comment: Personas transgénero que pertenecen al pueblo indígena kalasha y residen en el distrito Chitral de la provincia Khyber-Pakhtunkhwa en Pakistán. @es
broader: Kalash LGBTQ+ people
has top concept: LGBTQ+ people
issued: 2022-07-28
modified: 2025-02-23
type: Concept
in scheme: v3
change note: Version 4.1.0

Kalash queer people
preferred label: Personas queer kalash @es
alternative label: Queer Kalash people
alternative label: Queer Kalasha
comment: Queer people who belong to the indigenous Kalasha people and reside in the Chitral District of Khyber-Pakhtunkhwa province in Pakistan.
comment: Personas queer que pertenecen al pueblo indígena kalasha y residen en el distrito Chitral de la provincia Khyber-Pakhtunkhwa en Pakistán. @es
broader: Kalash LGBTQ+ people
has top concept: LGBTQ+ people
issued: 2022-07-28
modified: 2025-02-23
type: Concept
in scheme: v3
change note: Version 4.1.0

Kalash intersex people
preferred label: Personas intersexuales kalash @es
alternative label: Intersex Kalash people
alternative label: Intersex Kalasha
alternative label: Personas intersex kalash @es
comment: Intersex people who belong to the indigenous Kalasha people and reside in the Chitral District of Khyber-Pakhtunkhwa province in Pakistan.
comment: Personas intersexuales que pertenecen a el pueblo indígena Kalasha y residen en el distrito Chitral de la provincia Khyber-Pakhtunkhwa en Pakistan. @es
broader: Kalash LGBTQ+ people
has top concept: LGBTQ+ people
issued: 2022-07-28
modified: 2025-02-23
type: Concept
in scheme: v3
change note: Version 4.1.0

Kalash asexual people
preferred label: Personas asexuales kalash @es
alternative label: Asexual Kalash people
alternative label: Asexual Kalasha
comment: Asexual people who belong to the indigenous Kalasha people and reside in the Chitral District of Khyber-Pakhtunkhwa province in Pakistan.
comment: Personas asexuales que pertenecen a el pueblo indígena Kalasha y residen en el distrito Chitral de la provincia Khyber-Pakhtunkhwa en Pakistan. @es
broader: Kalash LGBTQ+ people
has top concept: LGBTQ+ people
issued: 2022-07-28
modified: 2025-02-23
type: Concept
in scheme: v3
change note: Version 4.1.0

Polygamous people
preferred label: Personas polígamas @es
comment: Individuals who engage in relationships in which the dominant partner has multiple spouses, though the marriages are not typically recognized by society or law.
comment: Personas que entablan relaciones en las que la pareja dominante tiene múltiples cónyuges, aunque los matrimonios no suelen ser reconocidos por la sociedad o la ley. @es
broader: Relationship minorities
related: Partner preference
related: Polyamory
related: Polygamy
related: Hierarchical non-monogamy
related: Non-monogamy
has top concept: Relationship minorities
issued: 2022-09-09
modified: 2025-02-23
type: Concept
in scheme: v3
change note: Version 4.1.0

Gender euphoria
preferred label: Euforia de género @es
comment: The powerful feeling of joy and comfort an individual experiences when their assigned gender, gender expression, and/or the way their gender is perceived by themselves and others aligns with their gender identity. Though gender euphoria is often associated with trans people, people of any identity may experience gender euphoria when they feel that their gender has been seen and affirmed, or when they feel "right" in their body and the way their gender is being expressed.
comment: El poderoso sentimiento de alegría y consuelo que una persona experimenta cuando su género asignado, su expresión de género y/o la forma en que la propia persona y las demás personas perciben su género se alinea con su identidad de género. Aunque la euforia de género a menudo se asocia con las personas trans, las personas de cualquier identidad pueden experimentar euforia de género cuando sienten que su género ha sido visto y afirmado, o cuando se sienten "bien" con su cuerpo y la forma en que se expresa su género. @es
related: Gender assigned at birth
related: Gender dysphoria
related: Gender expression
related: Gender identity
related: Gender dysphoria in children
related: Gender dysphoria in youth
related: Queer joy
related: Trans joy
issued: 2022-09-09
modified: 2025-02-23
type: Concept
in scheme: v3
change note: Version 4.1.0

Anti-Blackness
preferred label: Anti-negritud @es
alternative label: Anti Blackness
alternative label: Antinegritud @es
comment: Term used to acknowledge the particularities of racism as directed toward Black people. Anti-Blackness includes the belief that Black people possess different inherent behavioral traits that correspond to inherited attributes and are inferior to those of other races--particularly white people. Anti-Blackness also encompasses prejudice, discrimination, and antagonism (whether personal or systematic) directed toward Black people because of their race and its perceived inferiority.
comment: Término utilizado para reconocer las particularidades del racismo dirigido hacia las personas negras. La antinegritud incluye la creencia de que las personas negras poseen diferentes características conductuales inherentes que corresponden a atributos heredados, y que son inferiores a otras razas, particularmente a las personas blancas. La antinegritud también abarca el prejuicio, la discriminación y el antagonismo (ya sea personal o sistemático) dirigido hacia las personas negras debido a su raza y su percibida inferioridad. @es
broader: Racism
related: Critical race theory
related: Transmisogynoir
related: Misogynoir
related: Police harassment of Black LGBTQ+ people
related: Gentrification
related: Redlining
has top concept: Racism
issued: 2022-09-09
modified: 2025-02-23
type: Concept
in scheme: v3
change note: Version 4.1.0

AIDS death and dying
preferred label: Morir y la muerte por SIDA @es
comment: Experiences related to people with AIDS approaching or having reached the end of their lives.
comment: Experiencias relacionadas a personas con SIDA que se acercan o han llegado al final de sus vidas. @es
related: LGBTQ+ death and dying
related: LGBTQ+ death notices
related: LGBTQ+ obituaries
related: Terminal care (AIDS)
issued: 2022-11-08
modified: 2025-02-23
type: Concept
in scheme: v3
change note: Version 4.1.0

Gender-neutral language
preferred label: Lenguaje de género neutro @es
alternative label: Gender inclusive language
alternative label: Gender neutral language
alternative label: Gender-inclusive language
alternative label: Lenguaje de género inclusivo @es
alternative label: Lenguage inclusivo @es
alternative label: Lenguaje de género neutral @es
alternative label: Lenguaje neutro @es
comment: Language that avoids the use of gender-specific words, either to be inclusive of nonbinary, agender, and other gender diverse peoples, or to avoid gender bias.
comment: Lenguaje que evita el uso de palabras generizadas, ya sea para incluir a personas no binarias, agénero y otras personas género-diversas, o para evitar prejuicios de género. @es
related: Misgendering
related: Pronouns
related: Sexism
issued: 2022-11-08
modified: 2025-02-23
type: Concept
in scheme: v3
change note: Version 4.1.0

LGBTQ+ history
preferred label: Historia LGBTQ+ @es
alternative label: History (LGBTQ)
alternative label: LGBTQ history
alternative label: Historia (LGBTQ) @es
alternative label: Historia LGBTQ @es
comment: Past events or accounts of the past concerning LGBTQ+ people, or people who might be perceived as LGBTQ+ if they were alive today.
comment: Eventos pasados ​​o relatos del pasado relacionados con personas LGBTQ+, o personas que podrían ser percibidas como LGBTQ+ si estuvieran vivas hoy. @es
narrower: Lesbian history
narrower: Gay history
narrower: Bisexual history
narrower: Transgender history
narrower: Queer history
narrower: Intersex history
narrower: Asexual history
narrower: Non-binary history
narrower: Two-Spirit history
narrower: Aromantic history
narrower: Demisexual history
narrower: Megasexual history
narrower: Greyromantic history
related: LGBTQ+ historical terms
related: LGBTQ+ memorials
related: LGBTQ+ biographies
related: LGBTQ+ autobiographies
related: LGBTQ+ cultural heritage institutions
related: LGBTQ+ History Month
issued: 2022-11-08
modified: 2026-02-24
type: Concept
in scheme: v3
change note: Version 4.1.0

Lesbian history
preferred label: Historia lésbica @es
alternative label: Historia lesbiana @es
comment: Past events or accounts of the past concerning lesbians, or people who might be perceived as lesbian if they were alive today.
comment: Eventos pasados ​​o relatos del pasado relacionados con lesbianas, o con personas que podrían ser percibidas como lesbianas si estuvieran vivas hoy. @es
broader: LGBTQ+ history
has top concept: LGBTQ+ history
issued: 2022-11-08
modified: 2025-02-23
type: Concept
in scheme: v3
change note: Version 4.1.0

Gay history
preferred label: Historia gay @es
comment: Past events or accounts of the past concerning gay men, or men who might be perceived as gay if they were alive today.
comment: Eventos pasados ​​o relatos del pasado relacionados con hombres gay, o hombres que podrían ser percibidos como gay si estuvieran vivos hoy. @es
broader: LGBTQ+ history
has top concept: LGBTQ+ history
issued: 2022-11-08
modified: 2025-02-23
type: Concept
in scheme: v3
change note: Version 4.1.0

Bisexual history
preferred label: Personas bisexuales con problemas de audición @es
alternative label: Personas bisexuales con dificultades de audición @es
alternative label: Personas bisexuales con dificultades auditivas @es
comment: Past events or accounts of the past concerning bisexual people, or people who might be perceived as bisexual if they were alive today.
comment: Personas bisexuales con pérdida auditiva significativa o total que pueden o no considerarse S/sordas. @es
broader: LGBTQ+ history
has top concept: LGBTQ+ history
issued: 2022-11-08
modified: 2025-02-23
type: Concept
in scheme: v3
change note: Version 4.1.0

Transgender history
preferred label: Historia transgénero @es
comment: Past events or accounts of the past concerning transgender people, or people who might be perceived as transgender if they were alive today.
comment: Eventos pasados ​​o relatos del pasado relacionados con personas transgénero, o personas que podrían ser percibidas como transgénero si estuvieran vivas hoy. @es
broader: LGBTQ+ history
has top concept: LGBTQ+ history
issued: 2022-11-08
modified: 2025-02-23
type: Concept
in scheme: v3
change note: Version 4.1.0

Queer history
preferred label: Historia queer @es
comment: Past events or accounts of the past concerning queer people, or people who might be perceived as queer if they were alive today.
comment: Eventos pasados ​​o relatos del pasado relacionados con personas queer, o personas que podrían ser percibidas como queer si estuvieran vivas hoy. @es
broader: LGBTQ+ history
has top concept: LGBTQ+ history
issued: 2022-11-08
modified: 2025-02-23
type: Concept
in scheme: v3
change note: Version 4.1.0

Intersex history
preferred label: Historia intersex @es
comment: Past events or accounts of the past concerning intersex people, or people who might be perceived as intersex if they were alive today.
comment: Eventos pasados ​​o relatos del pasado relacionados con personas intersex, o personas que podrían ser percibidas como intersex si estuvieran vivas hoy. @es
broader: LGBTQ+ history
has top concept: LGBTQ+ history
issued: 2022-11-08
modified: 2025-02-23
type: Concept
in scheme: v3
change note: Version 4.1.0

Asexual history
preferred label: Historia asexual @es
alternative label: Ace history
alternative label: Historia ace @es
comment: Past events or accounts of the past concerning asexual people, or people who might be perceived as asexual if they were alive today.
comment: Eventos pasados o relatos del pasado relacionados con personas asexuales o con personas que podrían ser percibidas como asexuales si estuvieran vivas hoy. @es
broader: LGBTQ+ history
has top concept: LGBTQ+ history
issued: 2022-11-08
modified: 2025-02-23
type: Concept
in scheme: v3
change note: Version 4.1.0

Non-binary history
preferred label: Historia no binaria @es
alternative label: Nonbinary history
alternative label: Historia no-binaria @es
comment: Past events or accounts of the past concerning non-binary people, or people who might be perceived as non-binary if they were alive today.
comment: Eventos pasados ​​o relatos del pasado relacionados con personas no binarias, o personas que podrían ser percibidas como no binarias si estuvieran vivas hoy. @es
broader: LGBTQ+ history
has top concept: LGBTQ+ history
issued: 2022-11-08
modified: 2025-02-23
type: Concept
in scheme: v3
change note: Version 4.1.0

Anti-racism
preferred label: Anti-racismo @es
alternative label: Antiracism
alternative label: Antirracismo @es
comment: Umbrella term used to describe a range of ideas, policies, and political actions that are intended to actively challenge, reject, or oppose racism and racial oppression (whether personal or systemic), as well as advocate for racial equity.
comment: Término general utilizado para describir una variedad de ideas, políticas y acciones políticas que tienen como objetivo desafiar, rechazar u oponerse activamente al racismo y la opresión racial (ya sea personal o sistémica), así como defender la equidad racial. @es
related: Critical race theory
related: Racism
issued: 2022-11-08
modified: 2025-02-23
type: Concept
in scheme: v3
change note: Version 4.1.0

Black feminism
preferred label: Feminismo negro @es
alternative label: Afro feminism
alternative label: Afro-feminism
alternative label: Afro feminismo @es
alternative label: Afro-feminismo @es
comment: A form of feminism that developed in response to the failures of mainstream feminist and civil rights efforts to acknowledge the ways white supremacy and the patriarchy interact to inform the particular experiences of Black women.
comment: Una forma de feminismo que se desarrolló en respuesta a los fracasos de los esfuerzos feministas y de derechos civiles dominantes para reconocer las formas en que la supremacía blanca y el patriarcado interactúan para informar las experiencias particulares de las mujeres negras. @es
broader: Feminism
related: Intersectionality
related: Racism
related: Womanism
related: Black feminists
has top concept: Feminism
issued: 2022-11-08
modified: 2025-02-23
type: Concept
in scheme: v3
change note: Version 4.1.0

White feminism
preferred label: Feminismo blanco @es
comment: Term used to describe (and criticize) forms of feminism that focus on the needs of white women at the expense of women of color.
comment: Término utilizado para describir (y criticar) formas de feminismo que se centran en las necesidades de las mujeres blancas a expensas de las mujeres de color. @es
broader: Feminism
related: Intersectionality
related: Social privilege
related: Racism
related: Womanism
has top concept: Feminism
issued: 2022-11-08
modified: 2025-02-23
type: Concept
in scheme: v3
change note: Version 4.1.0

Womanism
preferred label: Mujerismo @es
alternative label: Womanist theory
alternative label: Teoria mujerista @es
comment: A social theory based on the history and everyday experiences of Black women. Womanism grew out of the perceived indifference of the feminist movement towards the needs of Black women, who are often excluded from the categories of "female" and "femininity" as understood by white feminists. At the core of womanism is the idea that mainstream feminism is a movement led by white women to serve white women's goals, which can be indifferent or even oppositional to the needs of Black women.
comment: Una teoría social basada en la historia y las experiencias cotidianas de las mujeres negras. El mujerismo surgió de la indiferencia percibida del movimiento feminista hacia las necesidades de las mujeres negras, que a menudo están excluidas de las categorías de "femenino" y "feminidad" tal como las entienden las feministas blancas. Al centro del mujerismo está la idea de que el feminismo dominante es un movimiento liderado por mujeres blancas para servir a los objetivos de las mujeres blancas, que pueden ser indiferentes o incluso opuestos a las necesidades de las mujeres negras. @es
broader: Theories
related: Intersectionality
related: Racism
related: Black feminism
related: White feminism
related: Womanists
has top concept: Theories
issued: 2022-11-08
modified: 2025-02-23
type: Concept
in scheme: v3
change note: Version 4.1.0

QTPOC
alternative label: Queer and trans people of color
alternative label: Personas queer y trans de color @es
comment: Acronym used to refer to queer and trans people of color as a group. Typically used to acknowledge the particularities of queer and trans people of color's experiences and the intersections of queerphobia, transphobia, and racism as directed towards queer and trans people of color.
comment: Acrónimo utilizado para referirse a personas de color queer y trans como grupo. Normalmente se utiliza para reconocer las particularidades de las experiencias de las personas queer y trans de color y las intersecciones de la queerfobia, la transfobia y el racismo dirigidas hacia las personas queer y trans de color. @es
related: Transmisogyny
related: BIPOC
related: LGBTQ+ people of color
issued: 2022-11-08
modified: 2025-02-23
type: Concept
in scheme: v3
change note: Version 4.1.0

Transfeminism
preferred label: Transfeminismo @es
alternative label: Trans feminism
alternative label: Trans feminismo @es
comment: As defined by Emi Koyama, transfeminism is a movement by and for trans woman who view the liberation of trans women as essential to the liberation of all women.
comment: Como lo define Emi Koyama, el transfeminismo es un movimiento por y para mujeres trans que ven la liberación de las mujeres trans como esencial para la liberación de todas las mujeres. @es
broader: Feminism
related: Intersectionality
related: Trans women
related: Transmisogyny
has top concept: Feminism
issued: 2022-11-08
modified: 2025-02-28
type: Concept
in scheme: v3
change note: Version 4.1.0

Third-wave feminism
preferred label: Feminismo de la tercera ola @es
alternative label: Third wave feminism
comment: Period of feminist political activity beginning in the early 1990s that embraced diversity and individualism in women and sought to redefine what it meant to be a feminist. The third wave is characterized by the emergence of new feminist movements and theories such as intersectionality, sex positivity, ecofeminism, transfeminism, and postmodern feminism.
comment: Periodo de actividad política feminista que comenzó a principios de la década de 1990 y que abrazó la diversidad y el individualismo de las mujeres y buscó redefinir lo que significaba ser feminista. La tercera ola se caracteriza por el surgimiento de nuevos movimientos y teorías feministas como la interseccionalidad, la positividad sexual, el ecofeminismo, el transfeminismo y el feminismo posmoderno. @es
broader: Feminism
related: Third-wave feminists
has top concept: Feminism
issued: 2022-11-08
modified: 2025-02-23
type: Concept
in scheme: v3
change note: Version 4.1.0

Sapphic identity
preferred label: Identidad sáfica @es
alternative label: Sapphist identity
alternative label: Identidad safista @es
comment: Sexual identity or sexuality term used to describe women and, in some definitions, non-binary people who are sapphic, or attracted to women. Only use to describe individuals who describe their identity as sapphic.
comment: Término de identidad sexual o de sexualidad utilizado para describir a mujeres y, en algunas definiciones, a personas no binarias que son sáficas o que se ven atraídas por mujeres. Utilícese únicamente para describir a personas que describen su identidad como sáfica. @es
broader: Sexual identity
related: Sapphics
has top concept: Sexual identity
issued: 2022-11-08
modified: 2025-02-23
type: Concept
in scheme: v3
change note: Version 4.1.0

Sapphics
preferred label: Sáficas @es
alternative label: Sapphists
alternative label: Personas sáficas @es
comment: Women and, in some definitions, non-binary people of any sexual identity or sexuality who are attracted to women. Some but not all sapphics use the term "sapphic" to describe their sexual identity or sexuality. Only use to describe individuals who self-identify as sapphic.
comment: Mujeres y, en algunas definiciones, personas no binarias de cualquier identidad sexual o sexualidad que se sientan atraídas por mujeres. Algunas pero no todas las personas sáficas utilizan el término "sáfica" para describir su identidad sexual o sexualidad. Utilícese únicamente para describir a personas que se identifican como sáficas. @es
broader: LGBTQ+ people
broader: Sexual minorities
related: Sapphic identity
has top concept: LGBTQ+ people
issued: 2022-11-08
modified: 2025-02-23
type: Concept
in scheme: v3
change note: Version 4.1.0

MLM (Men Loving Men)
alternative label: Man loving man
alternative label: Men loving men
alternative label: Hombres que aman hombres @es
comment: Slang term used to describe men who have romantic and/or sexual relationships with other men; often used as an alternative to the term "Men who have sex with men." Can be used to describe men who are exclusively or primarily interested in men, as well as men who are also interested in people of other or all genders. Only use to describe people who self-identify as MLM.
comment: Término de la jerga utilizado para describir a hombres que tienen relaciones románticas y/o sexuales con otros hombres; a menudo se utiliza como alternativa al término "Hombres que tienen sexo con hombres". Puede utilizarse para describir a hombres que están interesados ​​exclusiva o principalmente en hombres, así como a hombres que también están interesados ​​en personas de otros o todos los géneros. Utilícese únicamente para describir a las personas que se autoidentifiquen como MLM. @es
broader: LGBTQ+ people
broader: Males
broader: Sexual minorities
related: Down-low
related: Same-gender-loving
has top concept: LGBTQ+ people
issued: 2022-11-08
modified: 2025-02-23
type: Concept
in scheme: v3
change note: Version 4.1.0

WLW (Women Loving Women)
preferred label: WLW (Mujeres que aman mujeres) @es
alternative label: Woman loving woman
alternative label: Women loving women
alternative label: Mujeres amando mujeres @es
alternative label: Mujeres amando a mujeres @es
comment: Slang term used to describe women who have romantic and/or sexual relationships with other women. Can be used to describe women who are exclusively or primarily interested in women, as well as women who are also interested in people of other or all genders. Only use to describe people who self-identify as WLW.
comment: Término de la jerga utilizado para describir a mujeres que tienen relaciones románticas y/o sexuales con otras mujeres. Puede utilizarse para describir a mujeres que están exclusiva o principalmente interesadas en mujeres, así como a mujeres que también están interesadas en personas de otros o todos los géneros. Utilícese únicamente para describir a personas que se identifiquen como WLW. @es
broader: LGBTQ+ people
broader: Sexual minorities
broader: Females
related: Same-gender-loving
related: Women's sexuality
has top concept: LGBTQ+ people
issued: 2022-11-08
modified: 2025-02-23
type: Concept
in scheme: v3
change note: Version 4.1.0

Mothers of queer people
preferred label: Madres de personas queer @es
alternative label: Moms of queer people
alternative label: Queer people's moms
alternative label: Queer people's mothers
alternative label: Mamás de personas queer @es
comment: Individuals who assume the role of mother to a queer person or queer people; use only for individuals who self-identify as mothers.
comment: Personas que asumen el rol de madre de una persona o personas queer; utilícese únicamente para personas que se autoidentifiquen como madres. @es
broader: Mothers of LGBTQ+ people
has top concept: Family members
issued: 2022-11-10
modified: 2025-02-23
type: Concept
in scheme: v3
change note: Version 4.1.0

Cisgender youth
preferred label: Juventud cisgénero @es
alternative label: Cis youth
alternative label: Cisgender adolescents
alternative label: Cisgender teenagers
alternative label: Cisgender teens
alternative label: Juventud cis @es
alternative label: Adolescentes cisgénero @es
alternative label: Adolescentes cis @es
alternative label: Jóvenes cis @es
comment: Cisgender people who are between the ages of childhood and adulthood.
comment: Personas cisgénero que se encuentran entre las edades de la niñez y la edad adulta. @es
broader: Cisgender people
broader: Youth
narrower: Cisgender children
narrower: Cisgender boys
narrower: Cisgender girls
has top concept: Cisgender people
issued: 2022-11-10
modified: 2025-02-23
type: Concept
in scheme: v3
change note: Version 4.1.0

Cisgender children
preferred label: Niños cisgénero @es
alternative label: Cis children
alternative label: Cis kids
alternative label: Cisgender kids
alternative label: Niños cis @es
alternative label: Niñas cis @es
comment: Children younger than 18 years who identify as cisgender.
comment: Niños menores de 18 años que se autoidentifican como cisgénero. @es
broader: Children
broader: Cisgender people
broader: Cisgender youth
narrower: Cisgender boys
narrower: Cisgender girls
has top concept: Family members
issued: 2022-11-10
modified: 2025-02-23
type: Concept
in scheme: v3
change note: Version 4.1.0

Cisgender boys
preferred label: Niños cisgénero @es
alternative label: Cis boys
alternative label: Niños cis @es
comment: Boys (typically children or youth younger than 18) who are cisgender.
comment: Niños (normalmente menores de 18 años) que son cisgénero. @es
broader: Boys
broader: Cisgender youth
broader: Cisgender children
has top concept: Family members
issued: 2022-11-10
modified: 2025-02-23
type: Concept
in scheme: v3
change note: Version 4.1.0

Cisgender girls
preferred label: Niñas cisgénero @es
alternative label: Cis girls
alternative label: Niñas cis @es
comment: Girls (typically children or youth younger than 18) who are cisgender.
comment: Niñas (normalmente menores de 18 años) que son cisgénero. @es
broader: Girls
broader: Cisgender youth
broader: Cisgender children
has top concept: Family members
issued: 2022-11-10
modified: 2025-02-23
type: Concept
in scheme: v3
change note: Version 4.1.0

Heterosexual children
preferred label: Niños heterosexuales @es
alternative label: Heterosexual kids
alternative label: Straight children
alternative label: Straight kids
comment: Children younger than 18 years who identify as heterosexual.
comment: Niños menores de 18 años que se autoidentifican como heterosexuales. @es
broader: Children
broader: Heterosexuals
broader: Heterosexual youth
narrower: Heterosexual boys
narrower: Heterosexual girls
has top concept: Family members
issued: 2022-11-10
modified: 2025-02-23
type: Concept
in scheme: v3
change note: Version 4.1.0

Yan daudu
comment: Nigerian term that directly translates to "feminine men" but cannot be easily understood through Euro-American understandings of gender. The term has been used to describe people who may identify variously as feminine men, gay men, both male and female (or third gender), and/or trans. While some people self-identify as yan daudu, others consider the term a slur. Only use to describe individuals who self-identify as yan daudu.
comment: Término nigeriano que se traduce directamente como "hombres femeninos" pero que no puede entenderse fácilmente a través de la interpretación euroamericana del género. El término se ha utilizado para describir a personas que pueden identificarse de diversas formas como hombres femeninos, hombres gay, tanto masculinos como femeninos (o de tercer género) y/o trans. Mientras que algunas personas seautoidentifican como yan daudu, otras consideran el término un insulto. Utilícese únicamente para describir a personas que seautoidentifican como yan daudu. @es
broader: Non-Euro-American gender and sexual identities
has top concept: Gender
issued: 2022-11-10
modified: 2025-02-23
type: Concept
in scheme: v3
change note: Version 4.1.0

Mustaches
preferred label: Bigotes @es
preferred label: Moustaches
comment: Facial hair on the upper lip. Includes false or drag mustaches as well as naturally grown hair.
comment: Vello facial en el labio superior. Incluye bigotes postizos o de drag, así como vello crecido de forma natural. @es
broader: Hair
narrower: Cookie dusters
has top concept: Sex (Body)
issued: 2022-11-10
modified: 2025-02-23
type: Concept
in scheme: v3
change note: Version 4.1.0

Cookie dusters
alternative label: Muff ticklers
alternative label: Pussy dusters
alternative label: Womb brooms
comment: Slang term for mustaches or facial hair on the upper lip, particularly that of lesbians.
broader: Mustaches
related: Lesbian slang
has top concept: Sex (Body)
issued: 2022-11-10
modified: 2025-02-23
type: Concept
in scheme: v3
change note: Version 4.1.0

Chemsex
preferred label: Sexdopaje @es
comment: Sexual activities that include the use of drugs, typically to trigger sexual arousal, increase sexual pleasure, and/or facilitate sexual encounters that last several hours or days.
comment: Actividades sexuales que incluyen el uso de drogas, generalmente para desencadenar la excitación sexual, aumentar el placer sexual y/o facilitar encuentros sexuales que duran varias horas o días. @es
broader: Sex (Act)
related: Erection pills
related: Party drugs
related: Two-Spirit people who use substances for recreational purposes
has top concept: Sex (Act)
issued: 2022-11-10
modified: 2025-04-24
type: Concept
in scheme: v3
change note: Version 4.1.0

Gender equality
preferred label: Igualdad de género @es
comment: The state of equal ease of access to resources and opportunities regardless of gender, including economic participation and decision-making, as well as the state of valuing different behaviors, aspirations, and needs equally, regardless of gender.
comment: El estado de igualdad en facilidad de acceso a recursos y oportunidades independientemente del género, incluida la participación económica y la toma de decisiones, así como el estado de valorar diferentes comportamientos, aspiraciones y necesidades por igual, independientemente del género. @es
broader: Human rights
related: Feminism
related: Women's movement
has top concept: Human rights
issued: 2022-11-10
modified: 2025-02-23
type: Concept
in scheme: v3
change note: Version 4.1.0

Inclusivity
preferred label: Inclusividad @es
alternative label: Inclusion
alternative label: Inclusive
alternative label: Inclusión @es
alternative label: Inclusivo @es
comment: The practice or policy of providing equal access and support to groups of people who might otherwise be excluded or marginalized, such as LGBTQ+ people, people of color, disabled people, etc.
comment: La práctica o política de brindar igualdad de acceso y apoyo a grupos de personas que, de otro modo, podrían quedar excluidas o marginadas, como las personas LGBTQ+, las personas de color, las personas discapacitadas, etc. @es
narrower: Trans inclusivity
narrower: Trans exclusivity
issued: 2022-11-10
modified: 2026-02-26
type: Concept
in scheme: v3
change note: Version 4.1.0

Asexual youth
preferred label: Juventud asexual @es
alternative label: Ace youth
alternative label: Asexual adolescents
alternative label: Asexual teenagers
alternative label: Asexual teens
alternative label: Juventud ace @es
alternative label: Adolescentes asexuales @es
alternative label: Adolescentes ace @es
alternative label: Jóvenes ace @es
comment: Asexual people who are between the ages of childhood and adulthood.
comment: Personas asexuales que se encuentran entre la infancia y la adultez. @es
broader: Asexual people
broader: LGBTQ+ youth
related: Asexual youth literature
has top concept: Sexual minorities
issued: 2022-11-10
modified: 2025-02-23
type: Concept
in scheme: v3
change note: Version 4.1.0

Piblings
preferred label: Tíes @es
alternative label: Tixs || @es
comment: Gender-neutral term used to refer to the siblings or siblings-in-law of one's parents; an alternative to "aunts" or "uncles."
comment: Término de género neutro utilizado para referirse a los hermanos o cuñados de los padres; una alternativa a "tías" o "tíos". @es
broader: Family members
has top concept: Family members
issued: 2022-11-10
modified: 2025-02-23
type: Concept
in scheme: v3
change note: Version 4.1.0

Niblings
preferred label: Sobrinxs @es
alternative label: Sobrines @es
comment: Gender-neutral term used to refer to the children of one's sibling; an alternative to "nephews" or "nieces."
comment: Término de género neutro utilizado para referirse a los hijos de un hermano; una alternativa a "sobrinos" o "sobrinas". @es
broader: Family members
has top concept: Family members
issued: 2022-11-10
modified: 2025-02-23
type: Concept
in scheme: v3
change note: Version 4.1.0

Kashmiri LGBTQ+ people
preferred label: Personas LGBTQ+ cachemires @es
alternative label: LGBTQ+ Kashmiri people
alternative label: LGBTQ+ Kashmiris
comment: LGBTQ+ people who live in or are descended from those native to the Kashmir Valley in the Indian subcontinent.
comment: Personas LGBTQ+ que viven en o son descendientes de las personas nativas del valle de Cachemira en el subcontinente indio. @es
broader: LGBTQ+ people of shared ethnic or national identities
broader: LGBTQ+ people of color
narrower: Kashmiri lesbians
narrower: Kashmiri gay men
narrower: Kashmiri bisexual people
narrower: Kashmiri queer people
narrower: Kashmiri transgender people
narrower: Kashmiri intersex people
narrower: Kashmiri asexual people
narrower: Kashmiri non-binary people
has top concept: LGBTQ+ people
issued: 2022-11-15
modified: 2025-02-23
type: Concept
in scheme: v3
change note: Version 4.1.0

Kashmiri lesbians
preferred label: Lesbianas cachemires @es
alternative label: Lesbian Kashmiris
comment: Lesbians who live in or are descended from those native to the Kashmir Valley in the Indian subcontinent.
comment: Lesbianas que viven en o son descendientes de las personas nativas del valle de Cachemira en el subcontinente indio. @es
broader: Kashmiri LGBTQ+ people
has top concept: LGBTQ+ people
issued: 2022-11-15
modified: 2025-02-23
type: Concept
in scheme: v3
change note: Version 4.1.0

Kashmiri gay men
preferred label: Hombres gay cachemires @es
alternative label: Gay Kashmiri men
alternative label: Gay Kashmiris
comment: Gay men who live in or are descended from those native to the Kashmir Valley in the Indian subcontinent.
comment: Hombres gay que viven en o son descendientes de las personas nativas del valle de Cachemira en el subcontinente indio. @es
broader: Kashmiri LGBTQ+ people
has top concept: LGBTQ+ people
issued: 2022-11-15
modified: 2025-02-23
type: Concept
in scheme: v3
change note: Version 4.1.0

Kashmiri bisexual people
preferred label: Personas bisexuales cachemires @es
alternative label: Bisexual Kashmiri people
alternative label: Bisexual Kashmiris
comment: Bisexual people who live in or are descended from those native to the Kashmir Valley in the Indian subcontinent.
comment: Personas bisexuales que viven en o son descendientes de las personas nativas del valle de Cachemira en el subcontinente indio. @es
broader: Kashmiri LGBTQ+ people
has top concept: LGBTQ+ people
issued: 2022-11-15
modified: 2025-02-23
type: Concept
in scheme: v3
change note: Version 4.1.0

Kashmiri queer people
preferred label: Personas queer cachemires @es
alternative label: Queer Kashmiri people
alternative label: Queer Kashmiris
comment: Queer people who live in or are descended from those native to the Kashmir Valley in the Indian subcontinent.
comment: Personas queer que viven en o son descendientes de las personas nativas del valle de Cachemira en el subcontinente indio. @es
broader: Kashmiri LGBTQ+ people
has top concept: LGBTQ+ people
issued: 2022-11-15
modified: 2025-02-23
type: Concept
in scheme: v3
change note: Version 4.1.0

Kashmiri transgender people
preferred label: Personas transgénero cachemires @es
alternative label: Transgender Kashmiri people
alternative label: Transgender Kashmiris
comment: Transgender people who live in or are descended from those native to the Kashmir Valley in the Indian subcontinent.
comment: Personas transgénero que viven en o son descendientes de las personas nativas del valle de Cachemira en el subcontinente indio. @es
broader: Kashmiri LGBTQ+ people
has top concept: LGBTQ+ people
issued: 2022-11-15
modified: 2025-02-23
type: Concept
in scheme: v3
change note: Version 4.1.0

Kashmiri intersex people
preferred label: Personas intesexuales cachemires @es
alternative label: Intersex Kashmiri people
alternative label: Intersex Kashmiris
alternative label: Personas intesex cachemires @es
comment: Intersex people who live in or are descended from those native to the Kashmir Valley in the Indian subcontinent.
comment: Personas intersexuales que viven en o son descendientes de las personas nativas del valle de Cachemira en el subcontinente indio. @es
broader: Kashmiri LGBTQ+ people
has top concept: LGBTQ+ people
issued: 2022-11-15
modified: 2025-02-23
type: Concept
in scheme: v3
change note: Version 4.1.0

Kashmiri asexual people
preferred label: Personas asexuales cachemires @es
alternative label: Asexual Kashmiri people
alternative label: Asexual Kashmiris
comment: Asexual people who live in or are descended from those native to the Kashmir Valley in the Indian subcontinent.
comment: Personas asexuales que viven en o son descendientes de las personas nativas del valle de Cachemira en el subcontinente indio. @es
broader: Kashmiri LGBTQ+ people
has top concept: LGBTQ+ people
issued: 2022-11-15
modified: 2025-02-23
type: Concept
in scheme: v3
change note: Version 4.1.0

Konkan LGBTQ+ people
preferred label: Personas LGBTQ+ konkani @es
alternative label: LGBTQ+ Konkani
comment: LGBTQ+ people who are from or descended from those native to the Konkan region of the Indian subcontinent, and who speak any of the dialects of the Konkani language.
comment: Personas LGBTQ+ que pertenecen a o son descendientes de las personas nativas de la región Konkan del subcontinente indio, y que hablan cualquiera de los dialectos de la lengua konkani. @es
broader: LGBTQ+ people of shared ethnic or national identities
broader: LGBTQ+ people of color
narrower: Konkan lesbians
narrower: Konkan gay men
narrower: Konkan bisexual people
narrower: Konkan queer people
narrower: Konkan transgender people
narrower: Konkan intersex people
narrower: Konkan asexual people
narrower: Konkan non-binary people
has top concept: LGBTQ+ people
issued: 2022-11-15
modified: 2025-02-23
type: Concept
in scheme: v3
change note: Version 4.1.0

Konkan lesbians
preferred label: Lesbianas konkani @es
alternative label: Lesbian Konkane
alternative label: Lesbian Konkani
comment: Lesbians who are from or descended from those native to the Konkan region of the Indian subcontinent, and who speak any of the dialects of the Konkani language.
comment: Lesbianas que pertenecen a o son descendientes de las personas nativas de la región Konkan del subcontinente indio, y que hablan cualquiera de los dialectos de la lengua konkani. @es
broader: Konkan LGBTQ+ people
has top concept: LGBTQ+ people
issued: 2022-11-15
modified: 2025-02-23
type: Concept
in scheme: v3
change note: Version 4.1.0

Konkan gay men
preferred label: Hombres gay konkani @es
alternative label: Gay Konkani men
alternative label: Gay Konkano men
comment: Gay men who are from or descended from those native to the Konkan region of the Indian subcontinent, and who speak any of the dialects of the Konkani language.
comment: Hombres gay que pertenecen a o son descendientes de las personas nativas de la región Konkan del subcontinente indio, y que hablan cualquiera de los dialectos de la lengua konkani. @es
broader: Konkan LGBTQ+ people
has top concept: LGBTQ+ people
issued: 2022-11-15
modified: 2025-02-23
type: Concept
in scheme: v3
change note: Version 4.1.0

Konkan bisexual people
preferred label: Personas bisexuales konkani @es
alternative label: Bisexual Konkani
comment: Bisexual people who are from or descended from those native to the Konkan region of the Indian subcontinent, and who speak any of the dialects of the Konkani language.
comment: Personas bisexuales que pertenecen a o son descendientes de las personas nativas de la región Konkan del subcontinente indio, y que hablan cualquiera de los dialectos de la lengua konkani. @es
broader: Konkan LGBTQ+ people
has top concept: LGBTQ+ people
issued: 2022-11-15
modified: 2025-02-23
type: Concept
in scheme: v3
change note: Version 4.1.0

Konkan queer people
preferred label: Personas queer konkani @es
alternative label: Queer Konkani
comment: Queer people who are from or descended from those native to the Konkan region of the Indian subcontinent, and who speak any of the dialects of the Konkani language.
comment: Personas queer que pertenecen a o son descendientes de las personas nativas de la región Konkan del subcontinente indio, y que hablan cualquiera de los dialectos de la lengua konkani. @es
broader: Konkan LGBTQ+ people
has top concept: LGBTQ+ people
issued: 2022-11-15
modified: 2025-02-23
type: Concept
in scheme: v3
change note: Version 4.1.0

Konkan transgender people
preferred label: Personas transgénero konkani @es
alternative label: Transgender Konkani
comment: Transgender people who are from or descended from those native to the Konkan region of the Indian subcontinent, and who speak any of the dialects of the Konkani language.
comment: Personas transgénero que pertenecen a o son descendientes de las personas nativas de la región Konkan del subcontinente indio, y que hablan cualquiera de los dialectos de la lengua konkani. @es
broader: Konkan LGBTQ+ people
has top concept: LGBTQ+ people
issued: 2022-11-15
modified: 2025-02-23
type: Concept
in scheme: v3
change note: Version 4.1.0

Konkan intersex people
preferred label: Personas intersexuales konkani @es
alternative label: Intersex Konkani
alternative label: Personas intersex konkani @es
comment: Intersex people who are from or descended from those native to the Konkan region of the Indian subcontinent, and who speak any of the dialects of the Konkani language.
comment: Personas intersexuales que pertenecen a o son descendientes de las personas nativas de la región Konkan del subcontinente indio, y que hablan cualquiera de los dialectos de la lengua konkani. @es
broader: Konkan LGBTQ+ people
has top concept: LGBTQ+ people
issued: 2022-11-15
modified: 2025-02-23
type: Concept
in scheme: v3
change note: Version 4.1.0

Konkan asexual people
preferred label: Personas asexuales konkani @es
alternative label: Asexual Konkani
comment: Asexual people who are from or descended from those native to the Konkan region of the Indian subcontinent, and who speak any of the dialects of the Konkani language.
comment: Personas asexuales que pertenecen a o son descendientes de las personas nativas de la región Konkan del subcontinente indio, y que hablan cualquiera de los dialectos de la lengua konkani. @es
broader: Konkan LGBTQ+ people
has top concept: LGBTQ+ people
issued: 2022-11-15
modified: 2025-02-23
type: Concept
in scheme: v3
change note: Version 4.1.0

Kumaoni LGBTQ+ people
preferred label: Personas LGBTQ+ kumaoni @es
alternative label: Kumain LGBTQ+ people
alternative label: Kumaiye LGBTQ+ people
alternative label: LGBTQ+ Kumaoni people
comment: LGBTQ+ people who live mostly in Kumaon region in the Indian Himalayas. They might also speak the Kumaoni language as their first language.
comment: Personas LGBTQ+ que viven principalmente en la región de Kumaon, en el Himalaya indio. También pueden hablar la lengua kumaoni como su primera lengua. @es
broader: LGBTQ+ people of shared ethnic or national identities
broader: LGBTQ+ people of color
narrower: Kumaoni lesbians
narrower: Kumaoni gay men
narrower: Kumaoni bisexual people
narrower: Kumaoni transgender people
narrower: Kumaoni queer people
narrower: Kumaoni intersex people
narrower: Kumaoni asexual people
narrower: Kumaoni non-binary people
has top concept: LGBTQ+ people
issued: 2022-11-15
modified: 2025-02-23
type: Concept
in scheme: v3
change note: Version 4.1.0

Kumaoni lesbians
preferred label: Lesbianas kumaoni @es
alternative label: Kumain lesbians
alternative label: Kumaiye lesbians
comment: Lesbians who live mostly in Kumaon region in the Indian Himalayas. They might also speak the Kumaoni language as their first language.
comment: Lesbianas que viven principalmente en la región de Kumaon, en el Himalaya indio. También pueden hablar la lengua kumaoni como su primera lengua. @es
broader: Kumaoni LGBTQ+ people
has top concept: LGBTQ+ people
issued: 2022-11-15
modified: 2025-02-23
type: Concept
in scheme: v3
change note: Version 4.1.0

Kumaoni gay men
preferred label: Hombres gay kumaoni @es
alternative label: Kumain gay men
alternative label: Kumaiye gay men
comment: Gay men who live mostly in Kumaon region in the Indian Himalayas. They might also speak the Kumaoni language as their first language.
comment: Hombres gay que viven principalmente en la región de Kumaon, en el Himalaya indio. También pueden hablar la lengua kumaoni como su primera lengua. @es
broader: Kumaoni LGBTQ+ people
has top concept: LGBTQ+ people
issued: 2022-11-15
modified: 2025-02-23
type: Concept
in scheme: v3
change note: Version 4.1.0

Kumaoni bisexual people
preferred label: Personas bisexuales kumaoni @es
alternative label: Kumain bisexual people
alternative label: Kumaiye bisexual people
comment: Bisexual people who live mostly in Kumaon region in the Indian Himalayas. They might also speak the Kumaoni language as their first language.
comment: Personas bisexuales que viven principalmente en la región de Kumaon, en el Himalaya indio. También pueden hablar la lengua kumaoni como su primera lengua. @es
broader: Kumaoni LGBTQ+ people
has top concept: LGBTQ+ people
issued: 2022-11-15
modified: 2025-02-23
type: Concept
in scheme: v3
change note: Version 4.1.0

Kumaoni transgender people
preferred label: Personas transgénero kumaoni @es
alternative label: Kumain transgender people
alternative label: Kumaiye transgender people
comment: Transgender people who live mostly in Kumaon region in the Indian Himalayas. They might also speak the Kumaoni language as their first language.
comment: Personas transgénero que viven principalmente en la región de Kumaon, en el Himalaya indio. También pueden hablar la lengua kumaoni como su primera lengua. @es
broader: Kumaoni LGBTQ+ people
has top concept: LGBTQ+ people
issued: 2022-11-15
modified: 2025-02-23
type: Concept
in scheme: v3
change note: Version 4.1.0

Kumaoni queer people
preferred label: Personas queer kumaoni @es
alternative label: Kumain queer people
alternative label: Kumaiye queer people
comment: Queer people who live mostly in Kumaon region in the Indian Himalayas. They might also speak the Kumaoni language as their first language.
comment: Personas queer que viven principalmente en la región de Kumaon, en el Himalaya indio. También pueden hablar la lengua kumaoni como su primera lengua. @es
broader: Kumaoni LGBTQ+ people
has top concept: LGBTQ+ people
issued: 2022-11-15
modified: 2025-02-23
type: Concept
in scheme: v3
change note: Version 4.1.0

Kumaoni intersex people
preferred label: Personas intersexuales kumaoni @es
alternative label: Kumain intersex people
alternative label: Kumaiye intersex people
alternative label: Personas intersex kumaoni @es
comment: Intersex people who live mostly in Kumaon region in the Indian Himalayas. They might also speak the Kumaoni language as their first language.
comment: Personas intersexuales que viven principalmente en la región de Kumaon, en el Himalaya indio. También pueden hablar la lengua kumaoni como su primera lengua. @es
broader: Kumaoni LGBTQ+ people
has top concept: LGBTQ+ people
issued: 2022-11-15
modified: 2025-02-23
type: Concept
in scheme: v3
change note: Version 4.1.0

Kumaoni asexual people
preferred label: Personas asexuales kumaoni @es
alternative label: Kumain asexual people
alternative label: Kumaiye asexual people
comment: Asexual people who live mostly in Kumaon region in the Indian Himalayas. They might also speak the Kumaoni language as their first language.
comment: Personas asexuales que viven principalmente en la región de Kumaon, en el Himalaya indio. También pueden hablar la lengua kumaoni como su primera lengua. @es
broader: Kumaoni LGBTQ+ people
has top concept: LGBTQ+ people
issued: 2022-11-15
modified: 2025-02-23
type: Concept
in scheme: v3
change note: Version 4.1.0

Kutchi LGBTQ+ people
preferred label: Personas LGBTQ+ kutchi @es
alternative label: LGBTQ+ Kutchi people
comment: LGBTQ+ people who are from or are descended from those native to the Kutch district of the Indian state of Gujarat and the Sindh region of Pakistan.
comment: Personas LGBTQ+ que pertenecen a o son descendientes de las personas nativas del distrito Konkan del estado indio de Guyarat y la región Sind de Pakistán. @es
broader: LGBTQ+ people of shared ethnic or national identities
broader: LGBTQ+ people of color
narrower: Kutchi lesbians
narrower: Kutchi gay men
narrower: Kutchi bisexual people
narrower: Kutchi queer people
narrower: Kutchi intersex people
narrower: Kutchi transgender people
narrower: Kutchi asexual people
narrower: Kutchi non-binary people
has top concept: LGBTQ+ people
issued: 2022-11-15
modified: 2025-02-23
type: Concept
in scheme: v3
change note: Version 4.1.0

Kutchi lesbians
preferred label: Lesbianas kutchi @es
alternative label: Lesbian Kutchi people
comment: Lesbians who are from or are descended from those native to the the Kutch district of the Indian state of Gujarat and the Sindh region of Pakistan.
comment: Lesbianas que pertenecen a o son descendientes de las personas nativas del distrito Konkan del estado indio de Guyarat y la región Sind de Pakistán. @es
broader: Kutchi LGBTQ+ people
has top concept: LGBTQ+ people
issued: 2022-11-15
modified: 2025-02-23
type: Concept
in scheme: v3
change note: Version 4.1.0

Kutchi gay men
preferred label: Hombres gay kutchi @es
alternative label: Gay Kutchi men
comment: Gay men who are from or are descended from those native to the the Kutch district of the Indian state of Gujarat and the Sindh region of Pakistan.
comment: Hombres gay que pertenecen a o son descendientes de las personas nativas del distrito Konkan del estado indio de Guyarat y la región Sind de Pakistán. @es
broader: Kutchi LGBTQ+ people
has top concept: LGBTQ+ people
issued: 2022-11-15
modified: 2025-02-23
type: Concept
in scheme: v3
change note: Version 4.1.0

Kutchi bisexual people
preferred label: Personas bisexuales kutchi @es
alternative label: Bisexual Kutchi people
comment: Bisexual people who are from or are descended from those native to the the Kutch district of the Indian state of Gujarat and the Sindh region of Pakistan.
comment: Personas bisexuales que pertenecen a o son descendientes de las personas nativas del distrito Konkan del estado indio de Guyarat y la región Sind de Pakistán. @es
broader: Kutchi LGBTQ+ people
has top concept: LGBTQ+ people
issued: 2022-11-15
modified: 2025-02-23
type: Concept
in scheme: v3
change note: Version 4.1.0

Kutchi queer people
preferred label: Personas queer kutchi @es
alternative label: Queer Kutchi people
comment: Queer people who are from or are descended from those native to the the Kutch district of the Indian state of Gujarat and the Sindh region of Pakistan.
comment: Personas queer que pertenecen a o son descendientes de las personas nativas del distrito Konkan del estado indio de Guyarat y la región Sind de Pakistán. @es
broader: Kutchi LGBTQ+ people
has top concept: LGBTQ+ people
issued: 2022-11-15
modified: 2025-02-23
type: Concept
in scheme: v3
change note: Version 4.1.0

Kutchi intersex people
preferred label: Personas intersexuales kutchi @es
alternative label: Intersex Kutchi people
alternative label: Personas intersex kutchi @es
comment: Intersex people who are from or are descended from those native to the the Kutch district of the Indian state of Gujarat and the Sindh region of Pakistan.
comment: Personas intersexuales que pertenecen a o son descendientes de las personas nativas del distrito Konkan del estado indio de Guyarat y la región Sind de Pakistán. @es
broader: Kutchi LGBTQ+ people
has top concept: LGBTQ+ people
issued: 2022-11-15
modified: 2025-02-23
type: Concept
in scheme: v3
change note: Version 4.1.0

Kutchi transgender people
preferred label: Personas transgénero kutchi @es
alternative label: Transgender Kutchi people
comment: Transgender people who are from or are descended from those native to the the Kutch district of the Indian state of Gujarat and the Sindh region of Pakistan.
comment: Personas transgénero que pertenecen a o son descendientes de las personas nativas del distrito Konkan del estado indio de Guyarat y la región Sind de Pakistán. @es
broader: Kutchi LGBTQ+ people
has top concept: LGBTQ+ people
issued: 2022-11-15
modified: 2025-02-23
type: Concept
in scheme: v3
change note: Version 4.1.0

Kutchi asexual people
preferred label: Personas asexuales kutchi @es
alternative label: Asexual Kutchi people
comment: Asexual people who are from or are descended from those native to the Kutch district of the Indian state of Gujarat and the Sindh region of Pakistan.
comment: Personas asexuales que pertenecen a o son descendientes de las personas nativas del distrito Konkan del estado indio de Guyarat y la región Sind de Pakistán. @es
broader: Kutchi LGBTQ+ people
has top concept: LGBTQ+ people
issued: 2022-11-15
modified: 2025-02-23
type: Concept
in scheme: v3
change note: Version 4.1.0

LGBTQ+ cinema
preferred label: Cine LGBTQ+ @es
alternative label: Cinema (LGBTQ)
alternative label: Film (LGBTQ)
alternative label: LGBTQ+ film
comment: Term that encompasses LGBTQ+ filmmaking, the LGBTQ+ film industry, and film as an art form within LGBTQ+ culture. For specific movies created by or representing LGBTQ+ people, use the term "LGBTQ+ films."
comment: Término que abarca el cine LGBTQ+, la industria cinematográfica LGBTQ+ y el cine como forma de arte dentro de la cultura LGBTQ+. Para películas específicas creadas por personas LGBTQ+ o que las representen, utilice el término "películas LGBTQ+". @es
broader: LGBTQ+ arts
narrower: LGBTQ+ films
narrower: Lesbian cinema
narrower: Gay cinema
narrower: Drag in film
narrower: LGBTQ+ film criticism
related: LGBTQ+ film censorship
related: LGBTQ+ film festivals
has top concept: Subcultures
issued: 2022-11-15
modified: 2025-02-23
type: Concept
in scheme: v3
change note: Version 4.1.0

Lesbian cinema
preferred label: Cine lésbico @es
alternative label: Lesbian film
comment: Term that encompasses lesbian filmmaking, the lesbian film industry, and film as an art form within lesbian culture. For specific movies created by or representing lesbians, use the term "Lesbian films."
comment: Término que abarca el cine lésbico, la industria cinematográfica lésbica y el cine como forma de arte dentro de la cultura lésbica. Para películas específicas creadas por lesbianas o que las representen, utilícese el término "películas de lesbianas". @es
broader: LGBTQ+ cinema
narrower: Lesbian films
has top concept: Subcultures
issued: 2022-11-15
modified: 2025-02-23
type: Concept
in scheme: v3
change note: Version 4.1.0

Lesbian films
preferred label: Películas lésbicas @es
alternative label: Lesbian movies
comment: Motion pictures, or movies, created by lesbian directors, depicting lesbians, or that are regarded as important within lesbian culture.
comment: Películas creadas por directoras lesbianas, que representan a lesbianas o a personas consideradas importantes dentro de la cultura lésbica. @es
broader: LGBTQ+ films
broader: Lesbian cinema
narrower: Lesbian porn films
has top concept: Subcultures
issued: 2022-11-15
modified: 2025-02-23
type: Concept
in scheme: v3
change note: Version 4.1.0

Gay cinema
preferred label: Cine gay @es
alternative label: Gay film
alternative label: Filmes gay @es
alternative label: Películas gay @es
comment: Term that encompasses gay filmmaking, the gay film industry, and film as an art form within gay culture. For specific movies created by or representing gay men, use the term "Gay films."
comment: Término que abarca el cine gay, la industria cinematográfica gay y el cine como forma de arte dentro de la cultura gay. Para películas específicas creadas por o que representan a hombres gay, utilice el término "películas gay". @es
broader: LGBTQ+ cinema
narrower: Gay films
has top concept: Subcultures
issued: 2022-11-15
modified: 2025-02-23
type: Concept
in scheme: v3
change note: Version 4.1.0

Gay films
preferred label: Películas gay @es
alternative label: Gay movies
comment: Motion pictures, or movies, created by gay directors, depicting gay men, or that are regarded as important within gay culture.
comment: Películas creadas por directores gay, que representan a hombres gay o a personas consideradas importantes dentro de la cultura gay. @es
broader: LGBTQ+ films
broader: Gay cinema
narrower: Gay porn films
has top concept: Subcultures
issued: 2022-11-15
modified: 2025-02-23
type: Concept
in scheme: v3
change note: Version 4.1.0

Two-Spirit history
preferred label: Historia dos espíritus @es
alternative label: 2S history
alternative label: Two Spirit history
alternative label: Two Spirited history
alternative label: Two-Spirited history
comment: Past events or accounts of the past concerning Two-Spirit people, or people who might be perceived as Two-Spirit if they were alive today.
comment: Eventos pasados o relatos del pasado relacionados con personas dos espíritus o con personas que podrían ser percibidas como dos espíritus si estuvieran vivas hoy. @es
broader: LGBTQ+ history
has top concept: LGBTQ+ history
issued: 2022-11-15
modified: 2025-02-23
type: Concept
in scheme: v3
change note: Version 4.1.0

LGBTQ+ people of the African diaspora
preferred label: Personas LGBTQ+ de la diáspora africana @es
comment: LGBTQ+ people of native African ancestry living outside of the continent of Africa. While this term is commonly used to describe descendants of Africans who were enslaved and forcibly transported to the Americas via the transatlantic slave trade between the 16th and 19th centuries, it can also be used to refer to descendants of Africans who voluntarily immigrated to other parts of the world. Do not conflate with Black LGBTQ+ people or African American LGBTQ+ people. Follow the individual's preference whenever possible.
comment: Personas LGBTQ+ de ascendencia africana nativa que viven fuera del continente africano. Si bien este término se utiliza comúnmente para describir a quienes descienden de personas africanas que fueron esclavizadas y forzosamente transportadas a América a través de la trata transatlántica de esclavos entre los siglos XVI y XIX, también se puede utilizar para referirse quienes descienden de personas africanas que emigraron voluntariamente a otras partes del mundo. No lo combine ni confunda con personas negras LGBTQ+ o personas afroamericanas LGBTQ+. Siga las preferencias de la persona siempre que sea posible. @es
issued: 2022-11-15
modified: 2025-04-24
type: Concept
in scheme: v3
change note: Version 4.1.0

Black asexual people
preferred label: Personas asexuales negras @es
alternative label: Asexual Black people
alternative label: Black ace people
alternative label: Personas negras asexuales @es
alternative label: Personas negras ace @es
comment: Black people who are asexual. Use only for individuals who self-identity as Black. Follow the individual’s preference for African American or Black whenever possible.
comment: Personas negras que son asexuales. Utilícese únicamente para personas que se autoidentifiquen como negras. Siga la preferencia de la persona sobre el uso de "afroamericanos" o "negros" siempre que sea posible. @es
broader: Black LGBTQ+ people
narrower: Afro-Canadian asexual people
narrower: Afro-Caribbean asexual people
narrower: Afro-European asexual people
narrower: Afro-Latin American asexual people
has top concept: LGBTQ+ people
issued: 2022-12-13
modified: 2025-02-23
type: Concept
in scheme: v3
change note: Version 4.1.0

African American asexual people
preferred label: Personas asexuales afroamericanas @es
alternative label: African American ace people
alternative label: Asexual African American people
alternative label: Asexual African Americans
alternative label: Afroamericanos asexuales @es
alternative label: Afroamericanos ace @es
alternative label: Afroamericanas asexuales @es
alternative label: Afroamericanas ace @es
alternative label: Personas ace afroamericanas @es
alternative label: Personas afroamericanas asexuales @es
comment: Asexual people of African descent born in the United States or asexual people born in African countries who live in or have a strong connection to the United States. Use for individuals who self-identity as African American. Follow the individual’s preference for African American or Black whenever possible.
comment: Personas asexuales de ascendencia africana nacidas en los Estados Unidos o personas asexuales nacidas en países africanos que viven o tienen una conexión fuerte con los Estados Unidos. Utilícese para personas que se autoidentifiquen como afroamericanas. @es
broader: African American LGBTQ+ people
has top concept: LGBTQ+ people
issued: 2022-12-13
modified: 2025-02-23
type: Concept
in scheme: v3
change note: Version 4.1.0

Adopted LGBTQ+ people
preferred label: Personas LGBTQ+ adoptadas @es
alternative label: Adopted people (LGBTQ)
alternative label: LGBTQ+ adopted people
alternative label: Personas adoptadas (LGBTQ) @es
comment: LGBTQ+ people who were adopted, whether or not by LGBTQ+ parents.
comment: Personas LGBTQ+ que fueron adoptadas, ya sea o no por padres LGBTQ+ @es
broader: LGBTQ+ people
has top concept: LGBTQ+ people
issued: 2022-12-13
modified: 2025-02-23
type: Concept
in scheme: v3
change note: Version 4.1.0

LGBTQ+ fathers
preferred label: Padres LGBTQ+ @es
alternative label: Dads (LGBTQ)
alternative label: Fathers (LGBTQ)
alternative label: LGBTQ+ dads
alternative label: Papás LGBTQ+ @es
comment: LGBTQ+ people who are fathers.
comment: Personas LGBTQ+ que son padres. @es
broader: Fathers
broader: LGBTQ+ parents
narrower: Transgender fathers
narrower: Bisexual fathers
narrower: Gay fathers
narrower: Lesbian fathers
narrower: Queer fathers
narrower: Intersex fathers
narrower: Asexual fathers
has top concept: Family members
issued: 2022-12-13
modified: 2025-02-23
type: Concept
in scheme: v3
change note: Version 4.1.0

Bisexual fathers
preferred label: Ficción fantástica bisexual @es
alternative label: Bisexual dads
comment: Bisexual people who are fathers.
comment: Obras escritas que incluyan elementos mágicos o fantásticos; utilícese en referencia a ficción fantástica centrada en personajes o temas bisexuales. @es
broader: LGBTQ+ fathers
has top concept: Family members
issued: 2022-12-13
modified: 2025-02-23
type: Concept
in scheme: v3
change note: Version 4.1.0

Gay fathers
preferred label: Padres gay @es
alternative label: Gay dads
alternative label: Papás gay @es
comment: Gay men who are fathers.
comment: Hombres gay que son padres. @es
broader: LGBTQ+ fathers
has top concept: Family members
issued: 2022-12-13
modified: 2025-02-23
type: Concept
in scheme: v3
change note: Version 4.1.0

Lesbian fathers
preferred label: Padres lesbianos @es
alternative label: Lesbian dads
alternative label: Papás lesbianos @es
comment: Lesbians who are fathers. This includes non-binary people who have children and identify as fathers, as well as trans women who had children before transitioning and still identify as fathers to those children. Do not use to describe lesbian parents unless they self-identify as fathers.
comment: Lesbianas que son padres. Esto incluye a las personas no binarias que tienen hijos y se autoidentifican como padres, así como a las mujeres trans que tuvieron hijos antes de transicionar y aún se autoidentifican como padres de esos niños. No debe utilizarse para describir a padres lesbianos a menos que se autoidentifiquen como padres. @es
broader: LGBTQ+ fathers
has top concept: Family members
issued: 2022-12-13
modified: 2025-02-23
type: Concept
in scheme: v3
change note: Version 4.1.0

Queer fathers
preferred label: Padres queer @es
alternative label: Queer dads
alternative label: Papás queer @es
comment: Queer people who are fathers.
comment: Personas queer que son padres. @es
broader: LGBTQ+ fathers
has top concept: Family members
issued: 2022-12-13
modified: 2025-02-23
type: Concept
in scheme: v3
change note: Version 4.1.0

Fathers of LGBTQ+ people
preferred label: Padres de personas LGBTQ+ @es
alternative label: Dads of LGBTQ+ people
alternative label: Papás de personas LGBTQ+ @es
comment: People who act as a father to one or more LGBTQ+ person. For fathers who are themselves LGBTQ+, use the term "LGBTQ+ fathers."
comment: Personas que asumen el rol de padre de personas LGBTQ+. Utilícese únicamente para describir a personas que se autoidentifiquen como padres. @es
broader: Fathers
narrower: Fathers of bisexual people
narrower: Fathers of gay men
narrower: Fathers of lesbians
narrower: Fathers of queer people
narrower: Fathers of transgender people
narrower: Fathers of intersex people
narrower: Fathers of asexual people
narrower: Fathers of non-binary people
has top concept: Family members
issued: 2022-12-13
modified: 2025-02-23
type: Concept
in scheme: v3
change note: Version 4.1.0

LGBTQ+ mothers
preferred label: Madres LGBTQ+ @es
alternative label: LGBTQ+ moms
alternative label: Moms (LGBTQ)
alternative label: Mothers (LGBTQ)
alternative label: Mamás LGBTQ+ @es
alternative label: Mamás LGBTQ @es
alternative label: Madres LGBTQ @es
alternative label: Madres (LGBTQ) @es
alternative label: Mamás (LGBTQ) @es
comment: LGBTQ+ people who are mothers.
comment: Personas LGBTQ+ que son madres. @es
broader: Mothers
broader: LGBTQ+ parents
narrower: Transgender mothers
narrower: Bisexual mothers
narrower: Gay mothers
narrower: Lesbian mothers
narrower: Queer mothers
narrower: Asexual mothers
narrower: Intersex mothers
has top concept: Family members
issued: 2022-12-13
modified: 2025-02-23
type: Concept
in scheme: v3
change note: Version 4.1.0

Bisexual mothers
preferred label: Amas bisexuales @es
alternative label: Bisexual moms
comment: Bisexual people who are mothers.
comment: Mujeres bisexuales que forman parte de la escena BDSM y asumen el rol de ama en las relaciones sexuales con una dinámica ama/esclava. @es
broader: LGBTQ+ mothers
has top concept: Family members
issued: 2022-12-13
modified: 2025-02-23
type: Concept
in scheme: v3
change note: Version 4.1.0

Gay mothers
preferred label: Hombres gay con enfermedades crónicas @es
alternative label: Gay moms
alternative label: Enfermos crónicos gay @es
alternative label: Hombres enfermos crónicos gay @es
comment: Gay men who are mothers. This includes trans men who had children before transitioning and still identify as mothers to those children. Do not use to describe gay parents unless they self-identify as mothers.
comment: Hombres gay que tienen condiciones de salud a largo plazo que requieren atención médica continua y/o impactan o limitan significativamente la vida diaria; algunas, pero no todas, las personas con enfermedades crónicas se consideran discapacitadas. @es
broader: LGBTQ+ mothers
has top concept: Family members
issued: 2022-12-13
modified: 2025-02-23
type: Concept
in scheme: v3
change note: Version 4.1.0

Lesbian mothers
preferred label: Madres lesbianas @es
alternative label: Lesbian moms
alternative label: Mamás lesbianas @es
comment: Lesbians who are mothers.
comment: Lesbianas que son madres. @es
broader: LGBTQ+ mothers
has top concept: Family members
issued: 2022-12-13
modified: 2025-02-23
type: Concept
in scheme: v3
change note: Version 4.1.0

Queer mothers
preferred label: Madres queer @es
alternative label: Queer moms
alternative label: Mamás queer @es
comment: Queer people who are mothers.
comment: Personas queer que son madres. @es
broader: LGBTQ+ mothers
has top concept: Family members
issued: 2022-12-13
modified: 2025-02-23
type: Concept
in scheme: v3
change note: Version 4.1.0

Mothers of LGBTQ+ people
preferred label: Madres de personas LGBTQ+ @es
alternative label: Moms of LGBTQ+ people
alternative label: Mamás de personas LGBTQ+ @es
comment: People who act as a mother to one or more LGBTQ+ person. For mothers who are themselves LGBTQ+, use the term "LGBTQ+ mothers."
comment: Personas que actúan como madre de una o más personas LGBTQ+. Para las madres que son LGBTQ+, utilice el término "madres LGBTQ+". @es
broader: Mothers
narrower: Mothers of bisexual people
narrower: Mothers of gay men
narrower: Mothers of lesbians
narrower: Mothers of transgender people
narrower: Mothers of queer people
narrower: Mothers of asexual people
narrower: Mothers of intersex people
has top concept: Family members
issued: 2022-12-13
modified: 2025-02-23
type: Concept
in scheme: v3
change note: Version 4.1.0

LGBTQ+ siblings
preferred label: Hermanos LGBTQ+ @es
alternative label: Siblings (LGBTQ)
alternative label: Hermanos (LGBTQ) @es
comment: LGBTQ+ people who have siblings.
comment: Personas LGBTQ+ que tienen hermanos. @es
broader: LGBTQ+ people
broader: Siblings
related: Half-siblings
has top concept: LGBTQ+ people
issued: 2022-12-13
modified: 2025-02-23
type: Concept
in scheme: v3
change note: Version 4.1.0

Siblings of LGBTQ+ people
preferred label: Hermanos de personas LGBTQ+ @es
alternative label: Hermanas de personas LGBTQ+ @es
alternative label: Hermanxs de personas LGBTQ+ @es
comment: People who share a sibling relationship with one or more LGBTQ+ person. For siblings who are themselves LGBTQ+, use the term "LGBTQ+ siblings."
comment: Personas que comparten una relación de hermanos con una o más personas LGBTQ+. Para hermanos que son LGBTQ+, utilice el término "hermanos LGBTQ+". @es
broader: Siblings
has top concept: Family members
issued: 2022-12-13
modified: 2025-02-23
type: Concept
in scheme: v3
change note: Version 4.1.0

Daughters
preferred label: Hijas @es
comment: People who are daughters.
comment: Personas que son hijas. @es
broader: Family members
narrower: LGBTQ+ daughters
narrower: Daughters of LGBTQ+ people
has top concept: Family members
issued: 2022-12-13
modified: 2025-02-23
type: Concept
in scheme: v3
change note: Version 4.1.0

Daughters of LGBTQ+ people
preferred label: Hijas de personas LGBTQ+ @es
comment: Daughters who have one or more LGBTQ+ parent. For daughters who are themselves LGBTQ+, use the term "LGBTQ+ daughters."
comment: Hijas que tienen uno o más padres LGBTQ+. Para las hijas que son LGBTQ+, utilice el término "hijas LGBTQ+". @es
broader: Daughters
narrower: Daughters of bisexual people
narrower: Daughters of gay men
narrower: Daughters of lesbians
narrower: Daughters of transgender people
narrower: Daughters of queer people
narrower: Daughters of intersex people
narrower: Daughters of asexual people
narrower: Daughters of non-binary people
has top concept: Family members
issued: 2022-12-13
modified: 2025-02-23
type: Concept
in scheme: v3
change note: Version 4.1.0

Sons
preferred label: Hijos @es
comment: People who are sons.
comment: Personas que son hijos. @es
broader: Family members
narrower: LGBTQ+ sons
narrower: Sons of LGBTQ+ people
narrower: Two-Spirit sons
has top concept: Family members
issued: 2022-12-13
modified: 2025-02-23
type: Concept
in scheme: v3
change note: Version 4.1.0

Sons of LGBTQ+ people
preferred label: Hijos de personas LGBTQ+ @es
comment: Sons who have one or more LGBTQ+ parent. For sons who are themselves LGBTQ+, use the term "LGBTQ+ sons."
comment: Hijos que tienen uno o más padres LGBTQ+. Para los hijos que son LGBTQ+, utilice el término "hijos LGBTQ+". @es
broader: Sons
narrower: Sons of bisexual people
narrower: Sons of gay men
narrower: Sons of lesbians
narrower: Sons of transgender people
narrower: Sons of queer people
narrower: Sons of intersex people
narrower: Sons of asexual people
has top concept: Family members
issued: 2022-12-13
modified: 2025-02-23
type: Concept
in scheme: v3
change note: Version 4.1.0

LGBTQ+ grandchildren
preferred label: Nietas y nietos LGBTQ+ @es
alternative label: Grandchildren (LGBTQ)
alternative label: Nietas LGBTQ+ @es
alternative label: Nietos LGBTQ+ @es
comment: LGBTQ+ people who are grandchildren.
comment: Personas LGBTQ+ que son nietos. @es
broader: Grandchildren
broader: LGBTQ+ people
has top concept: Family members
issued: 2022-12-13
modified: 2025-02-23
type: Concept
in scheme: v3
change note: Version 4.1.0

Grandchildren of LGBTQ+ people
preferred label: Nietos de personas LGBTQ+ @es
comment: People who have one or more LGBTQ+ grandparent. For grandchildren who are themselves LGBTQ+, use the term "LGBTQ+ grandchildren."
comment: Personas que tienen uno o más abuelos LGBTQ+. Para los nietos que son LGBTQ+, utilice el término "nietos LGBTQ+". @es
broader: Grandchildren
has top concept: Family members
issued: 2022-12-13
modified: 2025-02-23
type: Concept
in scheme: v3
change note: Version 4.1.0

LGBTQ+ grandparents
preferred label: Abuelas y abuelos LGBTQ+ @es
alternative label: Grandparents (LGBTQ)
alternative label: Abuelas LGBTQ+ @es
alternative label: Abuelos LGBTQ+ @es
comment: LGBTQ+ people who are grandparents.
comment: Personas LGBTQ+ que son abuelos. @es
broader: Grandparents
broader: LGBTQ+ people
related: LGBTQ+ family generations
has top concept: Family members
issued: 2022-12-13
modified: 2025-02-23
type: Concept
in scheme: v3
change note: Version 4.1.0

Grandparents of LGBTQ+ people
preferred label: Abuelos de personas LGBTQ+ @es
comment: People who have one or more LGBTQ+ grandchild. For grandparents who are themselves LGBTQ+, use the term "LGBTQ+ grandparents."
comment: Personas que tienen uno o más nietos LGBTQ+. Para los abuelos que son LGBTQ+, utilice el término "abuelos LGBTQ+". @es
broader: Grandparents
has top concept: Family members
issued: 2022-12-13
modified: 2025-02-23
type: Concept
in scheme: v3
change note: Version 4.1.0

LGBTQ+ family members
preferred label: Familiares LGBTQ+ @es
alternative label: Family members (LGBTQ)
comment: Family members who are LGBTQ+.
comment: Miembros de la familia que son LGBTQ+. @es
broader: Family members
broader: LGBTQ+ people
has top concept: Family members
issued: 2022-12-13
modified: 2025-02-23
type: Concept
in scheme: v3
change note: Version 4.1.0

Family members of LGBTQ+ people
preferred label: Miembros de familia de personas LGBTQ+ @es
alternative label: Familares de personas LGBTQ+ @es
comment: People who have one or more LGBTQ+ family member. For family members who are themselves LGBTQ+, use the term "LGBTQ+ family members."
comment: Personas que tienen uno o más familiares LGBTQ+. Para miembros de la familia que son LGBTQ+, utilícese el término "miembros LGBTQ+ de la familia". @es
broader: Family members
has top concept: Family members
issued: 2022-12-13
modified: 2025-02-23
type: Concept
in scheme: v3
change note: Version 4.1.0

Lesbian children
preferred label: Niños lesbianas @es
alternative label: Lesbian kids
alternative label: Niñxs lesbianas @es
comment: Lesbians who have not yet reached the age of adolescence.
comment: Niñas menores de 18 años que se autoidentifican como lesbianas. @es
broader: LGBTQ+ children
related: Lesbian girls
has top concept: Family members
issued: 2022-12-13
modified: 2025-02-23
type: Concept
in scheme: v3
change note: Version 4.1.0

Gay children
preferred label: Niños gay @es
alternative label: Gay kids
comment: Gay people who have not yet reached the age of adolescence.
comment: Niños menores de 18 años que se autoidentifican como gay. @es
broader: LGBTQ+ children
related: Gay boys
has top concept: Family members
issued: 2022-12-13
modified: 2025-02-23
type: Concept
in scheme: v3
change note: Version 4.1.0

Partners
preferred label: Parejas @es
comment: People who share a romantic, sexual, or play partnership with another person or people.
comment: Personas que comparten una relación romántica, sexual o de juego con otra persona o personas. @es
narrower: LGBTQ+ partners
narrower: Partners of crossdressers
narrower: Primary partners
narrower: Secondary partners
narrower: Anchor partners
narrower: Nesting partners
narrower: Partners of LGBTQ+ people
narrower: Two-Spirit partners
related: Partner notification
related: Partner preference
related: Partner rights
related: Significant others
issued: 2022-12-13
modified: 2025-02-23
type: Concept
in scheme: v3
change note: Version 4.1.0

Partners of LGBTQ+ people
preferred label: Parejas de personas LGBTQ+ @es
comment: Individuals who have one ore more romantic, sexual, or play partner who is LGBTQ+.
comment: Personas que tienen una o más parejas románticas, sexuales o de juego que sean LGBTQ+. @es
broader: Partners
narrower: Partners of bisexual people
narrower: Partners of gay men
narrower: Partners of lesbians
narrower: Partners of queer people
narrower: Partners of transgender people
narrower: Partners of intersex people
narrower: Partners of asexual people
has top concept: Partners
issued: 2022-12-13
modified: 2025-02-23
type: Concept
in scheme: v3
change note: Version 4.1.0

Lesbian partners
preferred label: Parejas lesbianas @es
comment: Lesbians who are the romantic, sexual, or play partners of another person or people.
comment: Lesbianas que son compañeras románticas, sexuales o de juego de otra persona o personas. @es
broader: LGBTQ+ partners
has top concept: LGBTQ+ families
issued: 2022-12-13
modified: 2025-02-23
type: Concept
in scheme: v3
change note: Version 4.1.0

Gay partners
preferred label: Padres gay @es
alternative label: Papás gay @es
comment: Gay men who are the romantic, sexual, or play partners of another person or people.
comment: Hombres gay que son padres. @es
broader: LGBTQ+ partners
has top concept: LGBTQ+ families
issued: 2022-12-13
modified: 2025-02-23
type: Concept
in scheme: v3
change note: Version 4.1.0

Bisexual partners
preferred label: Paganos bisexuales @es
comment: Bisexual people who are the romantic, sexual, or play partners of another person or people.
comment: Personas bisexuales que son miembros de religiones politeístas u otras religiones fuera de la cultura dominante que típicamente incorporan el culto a la naturaleza y/o lo sagrado femenino, como la Wicca, el druidismo, el paganismo, etc. Utilícese para describir a las personas bisexuales que se autoidentifican como paganas. @es
broader: LGBTQ+ partners
has top concept: LGBTQ+ families
issued: 2022-12-13
modified: 2025-02-23
type: Concept
in scheme: v3
change note: Version 4.1.0

Transgender partners
preferred label: Parejas transgénero @es
comment: Transgender people who are the romantic, sexual, or play partners of another person or people.
comment: Personas transgénero que son parejas románticas, sexuales o de juego de otra persona o personas. @es
broader: LGBTQ+ partners
has top concept: LGBTQ+ families
issued: 2022-12-13
modified: 2025-02-23
type: Concept
in scheme: v3
change note: Version 4.1.0

Queer partners
preferred label: Parejas queer @es
comment: Queer people who are the romantic, sexual, or play partners of another person or people.
comment: Personas queer que son parejas románticas, sexuales o de juego de otra persona o personas. @es
broader: LGBTQ+ partners
has top concept: LGBTQ+ families
issued: 2022-12-13
modified: 2025-02-23
type: Concept
in scheme: v3
change note: Version 4.1.0

Parents
preferred label: Madres y padres @es
comment: People who act as parents to one or more people.
comment: Personas que actúan como padres y/o madres de una o más personas. @es
broader: Family members
narrower: Adoptive parents
narrower: Birth parents
narrower: Foster parents
narrower: LGBTQ+ parents
narrower: Parents of crossdressers
narrower: Two-Spirit parents
narrower: Parents of LGBTQ+ people
has top concept: Family members
issued: 2022-12-13
modified: 2025-02-23
type: Concept
in scheme: v3
change note: Version 4.1.0

Police interactions with LGBTQ+ people
preferred label: Interacciones policiales con personas LGBTQ+ @es
alternative label: Police treatment of LGBTQ+ people
alternative label: Policing and the LGBTQ+ community
alternative label: Tratamiento policial de personas LGBTQ+ @es
alternative label: Vigilancia y la comunidad LGBTQ+ @es
comment: Umbrella term including any of various forms of interactions between police and LGBTQ+ individuals or communities.
comment: Término general que incluye cualquiera de las diversas formas de interacción entre la policía y personas o comunidades LGBTQ+. @es
narrower: Arrests of LGBTQ+ people
narrower: Police entrapment of LGBTQ+ people
narrower: Police harassment of LGBTQ+ people
narrower: Police violence toward LGBTQ+ people
narrower: Identification of LGBTQ+ people by police
narrower: Attitudes of LGBTQ+ people toward police
narrower: Performative LGBTQ+ activism by police
related: Sexual offenses laws
related: Sodomy laws
related: LGBTQ+ survivors of hate crimes
issued: 2023-01-13
modified: 2026-02-27
type: Concept
in scheme: v3
change note: Version 4.1.0

Police entrapment of LGBTQ+ people
preferred label: Aprisionamiento policial de personas LGBTQ+ @es
alternative label: Atrapamiento policial de personas LGBTQ+ @es
comment: A practice in which law enforcement agents or agents of the state coerce an LGBTQ+ person to commit a "crime" they would have otherwise been unlikely or unwilling to commit. Legal definitions of entrapment vary widely depending on the jurisdiction, but the term is often used colloquially to refer to police acting dishonestly or in bad faith, as well as policing focused on anticipating and inducing crime, rather than responding to reports of crime.
comment: Práctica mediante la cual la policía induce a personas LGBTQ+ a cometer acciones consideradas delitos que de otro modo no se habrían cometido o que era poco probable que se hubieran cometido. @es
broader: Police entrapment
broader: Police interactions with LGBTQ+ people
has top concept: Harassment
issued: 2023-01-13
modified: 2025-02-23
type: Concept
in scheme: v3
change note: Version 4.1.0

Police harassment of LGBTQ+ people
preferred label: Acoso policial a personas LGBTQ+ @es
alternative label: Mistreatment of LGBTQ+ people by police
alternative label: Harassment of LGBTQ+ people by police
alternative label: Police brutality toward LGBTQ+ people
alternative label: Police misconduct toward LGBTQ+ people
alternative label: Police mistreatment of LGBTQ+ people
alternative label: Maltrato hacia personas LGBTQ+ por la policía @es
alternative label: Acoso de personas LGBtQ+ por la policía @es
alternative label: Brutalidad policial hacia personas LGBTQ+ @es
alternative label: Mala conducta policial hacia personas LGBTQ+ @es
alternative label: Maltrato policial contra personas LGBTQ+ @es
comment: Any of various forms of inappropriate conduct, illegal actions, or abuses of power undertaken by law enforcement agents or agents of the state against LGBTQ+ members of the public. This includes but is not limited to racial, ethnic, and other forms of profiling; unwarranted surveillance, searches, and seizure; selective enforcement; excessive use of force; sexual misconduct; intimidation and witness tampering; falsification of evidence; coerced confessions; false arrests and imprisonment; and bribing or lobbying.
comment: Cualquiera de las diversas formas de conducta inapropiada, acciones ilegales o abusos de poder que violentan directa o indirectamente a las personas LGBTQ+, incluidas, entre otras, confesiones forzadas, intimidación, arrestos y encarcelamientos falsos, falsificación de pruebas, perjurio policial, manipulación de testigos, brutalidad y corrupción policial, elaboración de caracterizaciones raciales, étnicos y de otro tipo, vigilancia injustificada, registros o incautación de propiedad, soborno o cabildeo para obtener poder o estatus excesivo o para evitar consecuencias, aplicación selectiva de la ley y conducta sexual inapropiada. @es
broader: Police harassment
broader: Police interactions with LGBTQ+ people
narrower: Police harassment of Black LGBTQ+ people
narrower: Police harassment of Indigenous LGBTQ+ people
has top concept: Harassment
issued: 2023-01-13
modified: 2025-02-23
type: Concept
in scheme: v3
change note: Version 4.1.0

Police harassment of Black LGBTQ+ people
preferred label: Acoso policial a personas LGBTQ+ negras @es
comment: Any of various forms of inappropriate conduct, illegal actions, or abuses of power undertaken by law enforcement agents or agents of the state against Black LGBTQ+ members of the public. This includes but is not limited to racial, ethnic, and other forms of profiling; unwarranted surveillance, searches, and seizure; selective enforcement; excessive use of force; sexual misconduct; intimidation and witness tampering; falsification of evidence; coerced confessions; false arrests and imprisonment; and bribing or lobbying.
comment: Cualquiera de las diversas formas de conducta inapropiada, acciones ilegales o abusos de poder que violentan directa o indirectamente a las personas LGBTQ+ negras, incluidas, entre otras, confesiones forzadas, intimidación, arrestos y encarcelamientos falsos, falsificación de pruebas, perjurio policial, manipulación de testigos, brutalidad y corrupción policial, elaboración de caracterizaciones raciales, étnicos y de otro tipo, vigilancia injustificada, registros o incautación de propiedad, soborno o cabildeo para obtener poder o estatus excesivo o para evitar consecuencias, aplicación selectiva de la ley y conducta sexual inapropiada. @es
broader: Police harassment of LGBTQ+ people
related: Black LGBTQ+ people
related: Anti-Blackness
related: White supremacy in policing
has top concept: Harassment
issued: 2023-01-13
modified: 2025-02-23
type: Concept
in scheme: v3
change note: Version 4.1.0

Police harassment of Indigenous LGBTQ+ people
preferred label: Acoso policial a personas LGBTQ+ indígenas @es
comment: Any of various forms of inappropriate conduct, illegal actions, or abuses of power undertaken by law enforcement agents or agents of the state against Indigenous LGBTQ+ members of the public. This includes but is not limited to racial, ethnic, and other forms of profiling; unwarranted surveillance, searches, and seizure; selective enforcement; excessive use of force; sexual misconduct; intimidation and witness tampering; falsification of evidence; coerced confessions; false arrests and imprisonment; and bribing or lobbying.
comment: Cualquiera de las diversas formas de conducta inapropiada, acciones ilegales o abusos de poder que violentan directa o indirectamente a las personas LGBTQ+ indígenas, incluidas, entre otras, confesiones forzadas, intimidación, arrestos y encarcelamientos falsos, falsificación de pruebas, perjurio policial, manipulación de testigos, brutalidad y corrupción policial, elaboración de caracterizaciones raciales, étnicos y de otro tipo, vigilancia injustificada, registros o incautación de propiedad, soborno o cabildeo para obtener poder o estatus excesivo o para evitar consecuencias, aplicación selectiva de la ley y conducta sexual inapropiada. @es
broader: Police harassment of LGBTQ+ people
related: Indigenous LGBTQ+ people
related: White supremacy in policing
has top concept: Harassment
issued: 2023-01-13
modified: 2025-02-23
type: Concept
in scheme: v3
change note: Version 4.1.0

Police violence toward LGBTQ+ people
preferred label: Violencia policial hacia personas LGBTQ+ @es
alternative label: Police abuse toward LGBTQ+ people
alternative label: Police torture of LGBTQ+ people
alternative label: Abuso policial contra personas LGBTQ+ @es
alternative label: Tortura policial contra personas LGBTQ+ @es
comment: Any of various forms of police violence aimed toward LGBTQ+ people.
comment: Cualquiera de las diversas formas de violencia policial dirigida hacia personas LGBTQ+. @es
broader: Anti-LGBTQ+ violence
broader: Police interactions with LGBTQ+ people
narrower: Police raids on LGBTQ+-related establishments
narrower: Shootings of LGBTQ+ people by police
has top concept: Anti-LGBTQ+ violence
issued: 2023-01-13
modified: 2025-02-23
type: Concept
in scheme: v3
change note: Version 4.1.0

LGBTQ+ criminalization
preferred label: Criminalización LGBTQ+ @es
alternative label: Criminalization of LGBTQ+ people
alternative label: Criminalización de personas LGBTQ+ @es
comment: Criminalization of existing or identifying as an LGBTQ+ person, being perceived as LGBTQ+, or engaging in any of various actions considered to be linked to LGBTQ+ status.
comment: La criminalización de una persona LGBTQ+ por existir o identificarse como tal, ser percibida como LGBTQ+ o participar de cualquiera de las diversas acciones consideradas vinculadas al estatus LGBTQ+. @es
broader: Criminalization
narrower: Criminalization of homosexuality
related: LGBTQ+ discrimination
has top concept: Law
issued: 2023-01-13
modified: 2025-02-23
type: Concept
in scheme: v3
change note: Version 4.1.0

Criminalization of homosexuality
preferred label: Criminalización de la homosexualidad @es
alternative label: Criminalization of same-gender relations
alternative label: Criminalization of same-sex relations
alternative label: Criminalización de las relación del mismo género @es
alternative label: Criminalización de las relación del mismo sexo @es
comment: Criminalization of acts considered to be sexual or romantic between individuals perceived as being of the same gender category in a given sociocultural context.
comment: La criminalización de actos considerados sexuales o románticos entre personas percibidas como de la misma categoría de género en un determinado contexto sociocultural. @es
broader: LGBTQ+ criminalization
related: Sodomy laws
has top concept: Law
issued: 2023-01-13
modified: 2026-02-11
type: Concept
in scheme: v3
change note: Version 4.1.0

Police raids on LGBTQ+-related establishments
preferred label: Redadas policiales en establecimientos relacionados con comunidades LGBTQ+|| Redadas policiales en establecimientos relacionados con identidades LGBTQ+ @es
alternative label: Anti-LGBTQ+ police raids
alternative label: Police raids on LGBTQ+ establishments
alternative label: Police raids on LGBTQ+ venues
alternative label: Police raids to LGBTQ+ venues
alternative label: Redadas policiales anti-LGBTQ+ @es
alternative label: Redadas policiales en establecimientos LGBTQ+ @es
alternative label: Redadas policiales en lugares LGBTQ+ @es
comment: Unexpected and unannounced entry into and searches of establishments owned or frequented by LGBTQ+ people by law enforcement officers with the aim of using surprise to seize evidence or arrest suspects. Police raids may be undertaken legally using a search warrant or through exigent circumstances, such as probable cause, though the latter is highly subjective and civilians often have little resources to appeal illegal raids.
comment: Un registro no anunciado y sin orden judicial de una residencia o un establecimiento principalmente afiliado o relacionado con comunidades o identidades LGBTQ+ por parte de la policía. Estos ataques suelen ser traumáticos y caóticos y pueden eludir los procedimientos penales típicos y las libertades civiles. @es
broader: Police raids
broader: Police violence toward LGBTQ+ people
narrower: Police raids on LGBTQ+ bathhouses
narrower: Police raids on LGBTQ+ meeting places
narrower: Police raids on LGBTQ+ bars
narrower: Police raids on LGBTQ+ nightclubs
related: LGBTQ+-owned businesses
related: LGBTQ+-focused businesses
has top concept: Harassment
issued: 2023-01-13
modified: 2025-02-23
type: Concept
in scheme: v3
change note: Version 4.1.0

Police raids on LGBTQ+ bathhouses
preferred label: Redadas policiales en saunas LGBTQ+ @es
alternative label: Redadas policiales en casas de baño LGBTQ+ @es
comment: Unexpected and unannounced entry into and searches of bathouses, saunas, or spas owned or frequented by LGBTQ+ people by law enforcement officers with the aim of using surprise to seize evidence or arrest suspects. Police raids may be undertaken legally using a search warrant or through exigent circumstances, such as probable cause, though the latter is highly subjective and civilians often have little resources to appeal illegal raids.
comment: Redadas policiales en baños, saunas, spas, etc. afiliados o relacionados con comunidades o identidades LGBTQ+. @es
broader: Police raids on LGBTQ+-related establishments
related: Gay saunas
has top concept: Harassment
issued: 2023-01-13
modified: 2025-02-23
type: Concept
in scheme: v3
change note: Version 4.1.0

Police raids on LGBTQ+ meeting places
preferred label: Redadas policiales en espacios de encuentro LGBTQ+ @es
comment: Unexpected and unannounced entry into and searches of meeting places owned or frequented by LGBTQ+ people, including individuals' residences, businesses, and other institutions, by law enforcement officers with the aim of using surprise to seize evidence or arrest suspects. Police raids may be undertaken legally using a search warrant or through exigent circumstances, such as probable cause, though the latter is highly subjective and civilians often have little resources to appeal illegal raids.
comment: Redadas policiales en lugares de encuentro afiliados o relacionados con comunidades o identidades LGBTQ+, ya sea la residencia de una persona, un negocio u otra institución. @es
broader: Police raids on LGBTQ+-related establishments
has top concept: Harassment
issued: 2023-01-13
modified: 2025-02-23
type: Concept
in scheme: v3
change note: Version 4.1.0

Police raids on LGBTQ+ bars
preferred label: Redadas policiales en bares LGBTQ+ @es
comment: Unexpected and unannounced entry into and searches of drinking establishments owned or frequented by LGBTQ+ people by law enforcement officers with the aim of using surprise to seize evidence or arrest suspects. Police raids may be undertaken legally using a search warrant or through exigent circumstances, such as probable cause, though the latter is highly subjective and civilians often have little resources to appeal illegal raids.
comment: Redadas policiales en bares afiliados o relacionados con comunidades e identidades LGBTQ+. @es
broader: Police raids on LGBTQ+-related establishments
related: LGBTQ+ bars
has top concept: Harassment
issued: 2023-01-13
modified: 2025-02-23
type: Concept
in scheme: v3
change note: Version 4.1.0

Police raids on LGBTQ+ nightclubs
preferred label: Redadas policiales en clubs LGBTQ+|| Redadas policiales en clubes nocturnos LGBTQ+ @es
comment: Unexpected and unannounced entry into and searches of nightclubs owned or frequented by LGBTQ+ people by law enforcement officers with the aim of using surprise to seize evidence or arrest suspects. Police raids may be undertaken legally using a search warrant or through exigent circumstances, such as probable cause, though the latter is highly subjective and civilians often have little resources to appeal illegal raids.
comment: Redadas policiales en clubes nocturnos afiliados o relacionados con comunidades o identidades LGBTQ+ @es
broader: Police raids on LGBTQ+-related establishments
related: LGBTQ+ night life
has top concept: Harassment
issued: 2023-01-13
modified: 2025-02-23
type: Concept
in scheme: v3
change note: Version 4.1.0

No Police at Pride
alternative label: No Cops at Pride movement
alternative label: No Cops at Pride
alternative label: No Police at Pride movement
alternative label: Movimiento No Cops at Pride @es
alternative label: Moviento No Police at Pride @es
comment: Primarily Canadian and U.S. American movement wherein police officers were banned from LGBTQ+ pride events in some locations, due to historical and contemporary mistreatment of LGBTQ+ persons, especially Black and Indigenous LGBTQ+ persons. In recent years acted as a response to the 2010-2017 Toronto serial homicides and the mishandling of the investigation by the Toronto Police Service.
comment: Movimiento principalmente canadiense y estadounidense en el que se le prohibió a agentes de policía participar en eventos del orgullo LGBTQ+ en algunos lugares, debido al maltrato histórico y contemporáneo hacia las personas LGBTQ+, especialmente las personas LGBTQ+ negras e indígenas. En los últimos años, fungió como respuesta a los homicidios en serie de Toronto de 2010-2017 y al mal manejo de la investigación por parte del Servicio Policial de Toronto. @es
related: Pride events
related: LGBTQ+ pride
issued: 2023-01-13
modified: 2026-02-27
type: Concept
in scheme: v3
change note: Version 4.1.0

Non-binary parents
preferred label: Madres y padres no binarios @es
alternative label: Padres no binarios @es
alternative label: Madres no binarias @es
comment: Parents who are non-binary.
comment: Padres y/o madres que son no-binarios. @es
broader: Non-binary people
broader: LGBTQ+ parents
has top concept: LGBTQ+ people
issued: 2023-01-13
modified: 2025-02-23
type: Concept
in scheme: v3
change note: Version 4.1.0

Criminalization of gender non-conformity
preferred label: Criminalización de la disidencia de género @es
comment: Criminalization of any expression of gender considered to be nonconforming in a given sociocultural context.
comment: La criminalización de cualquier expresión de género considerada disconforme en un determinado contexto sociocultural. @es
broader: Criminalization
narrower: Criminalization of cross-dressing
related: Gender non-conforming identity
has top concept: Law
issued: 2023-01-13
modified: 2025-02-23
type: Concept
in scheme: v3
change note: Version 4.1.0

Criminalization of cross-dressing
preferred label: Criminalización del transformismo @es
comment: Criminalization of any expression of gender considered to be cross-dressing in a given sociocultural context.
comment: La criminalización de cualquier expresión de género considerada transformismo en un determinado contexto sociocultural. @es
broader: Criminalization of gender non-conformity
has top concept: Law
issued: 2023-01-13
modified: 2025-02-23
type: Concept
in scheme: v3
change note: Version 4.1.0

Defund the police movement
preferred label: Movimiento para desfinanciar a la policía @es
alternative label: Defund the Police
alternative label: Movement to defund police
alternative label: Desfinanciación de la policía @es
alternative label: Movimiento para desfinanciar la policía @es
comment: Primarily a U.S. American and Canadian movement which supports divesting funds from, or abolition of, police departments (and often police structures generally) and reallocating them to non-policing forms of public safety and community support, such as social services, youth services, housing, education, healthcare and other community resources.
comment: Principalmente, un movimiento estadounidense y canadiense que apoya la desinversión de fondos, o la abolición, de los departamentos de policía (y a menudo de las estructuras policiales en general) y su reasignación a formas no policiales de seguridad pública y apoyo comunitario, como los servicios sociales, los servicios para la juventud, la vivienda, la educación, los servicios médicos y otros recursos comunitarios. @es
broader: Social movements
related: Police
related: Police abolitionist movement
has top concept: Social movements
issued: 2023-01-13
modified: 2025-02-23
type: Concept
in scheme: v3
change note: Version 4.1.0

Police abolitionist movement
preferred label: Movimiento por la abolición de la policía @es
alternative label: Abolishing the police movement
alternative label: Abolición de la policía @es
comment: A primarily U.S. American and Canadian political movement that advocates replacing policing with other systems of public safety. Police abolitionists believe that policing, as a system, is inherently flawed and cannot be reformed—a view that rejects the ideology of police reformists. While reformists seek to address the ways in which policing occurs, abolitionists seek to transform policing altogether through a process of disbanding, disempowering, and disarming the police. Abolitionists argue that the institution of policing is deeply rooted in a history of white supremacy and settler colonialism and that it is inseparable from a pre-existing racial capitalist order, and thus believe a reformist approach to policing will always fail.
comment: Un movimiento político principalmente estadounidense y canadiense que aboga por reemplazar la vigilancia policial con otros sistemas de seguridad pública. Los abolicionistas policiales creen que la vigilancia policial, como sistema, es inherentemente defectuosa y no puede reformarse, una visión que rechaza la ideología de los reformistas policiales. Mientras los reformistas buscan abordar las formas en que se realiza la actividad policial, los abolicionistas buscan transformarla por completo a través de un proceso de disolución, desempoderamiento y desarme de la policía. Los abolicionistas argumentan que la institución policial está profundamente arraigada en una historia de supremacía blanca y asentamiento colonial y que es inseparable de un orden capitalista racial preexistente y, por lo tanto, creen que un enfoque reformista de la policía siempre fracasará. @es
broader: Social movements
related: Police
related: Defund the police movement
has top concept: Social movements
issued: 2023-01-13
modified: 2025-02-23
type: Concept
in scheme: v3
change note: Version 4.1.0

Identification of LGBTQ+ people by police
preferred label: Identificación de personas LGBTQ+ por la policía @es
comment: Identification of LGBTQ+ people, or people believed to be LGBTQ+, by police using any of various tools and mechanisms, many of which are pseudoscientific in nature. Such data is then used to entrap and prosecute LGBTQ+ persons, especially in areas where being LGBTQ+ is still criminalized.
comment: Identificación de personas LGBTQ+, o personas que se cree que son LGBTQ+, por parte de la policía utilizando cualquiera de diversas herramientas y mecanismos, muchas de los cuales son de naturaleza pseudocientífica. Luego, esos datos se utilizan para atrapar y procesar a personas LGBTQ+, especialmente en áreas donde ser LGBTQ+ todavía está criminalizado. @es
broader: Police interactions with LGBTQ+ people
narrower: Digital identification of LGBTQ+ people by police
related: Outing (LGBTQ+ culture)
has top concept: Police interactions with LGBTQ+ people
issued: 2023-01-13
modified: 2025-02-23
type: Concept
in scheme: v3
change note: Version 4.1.0

Digital identification of LGBTQ+ people by police
preferred label: Identificación digital de personas LGBTQ+ por parte de la policía @es
alternative label: Digital stop and search to identify LGBTQ+ people
alternative label: Identification of LGBTQ+ people by police using phone data
alternative label: Police use of digital tools to identify LGBTQ+ people
alternative label: Detenciones y registros digitales para identificar a personas LGBTQ+ @es
alternative label: Identificación de personas LGBTQ+ por la policía mediante datos telefónicos @es
alternative label: Uso policial de herramientas digitales para identificar a personas LGBTQ+ @es
comment: Identification of LGBTQ+ people, or people believed to be LGBTQ+, by police using digital tools, such as phone records, mobile applications, facial identification algorithms, and artificial intelligence technologies. Such data is then used to entrap and prosecute LGBTQ+ persons, especially in areas where being LGBTQ+ is still criminalized.
comment: Identificación de personas LGBTQ+, o personas que se cree que son LGBTQ+, por parte de la policía utilizando herramientas digitales, como registros telefónicos, aplicaciones móviles, algoritmos de identificación facial y tecnologías de inteligencia artificial. Luego, esos datos se utilizan para atrapar y procesar a personas LGBTQ+, especialmente en áreas donde ser LGBTQ+ aún está criminalizado. @es
broader: Identification of LGBTQ+ people by police
related: Dating applications
related: LGBTQ+ dating websites
has top concept: Police interactions with LGBTQ+ people
issued: 2023-01-13
modified: 2026-02-27
type: Concept
in scheme: v3
change note: Version 4.1.0

Attitudes of LGBTQ+ people toward police
preferred label: Posturas de las personas LGBTQ+ sobre la policía @es
alternative label: LGBTQ+ viewpoints on police
alternative label: LGBTQ+ views of police
alternative label: Perceptions of police by LGBTQ+ communities
alternative label: Perceptions of police by LGBTQ+ people
alternative label: Opiniones de las personas LGBTQ+ hacia la policía @es
comment: Attitudes and assessments of feelings, relationships, and interactions between LGBTQ+ people and police.
comment: Actitudes y evaluaciones de los sentimientos, relaciones e interacciones entre las personas LGBTQ+ y la policía. @es
broader: Police interactions with LGBTQ+ people
has top concept: Police interactions with LGBTQ+ people
issued: 2023-01-13
modified: 2026-02-27
type: Concept
in scheme: v3
change note: Version 4.1.0

Shootings of LGBTQ+ people by police
preferred label: Disparos contra personas LGBTQ+ por parte de la policía @es
alternative label: Tiroteos contra personas LGBTQ+ por parte de la policía @es
comment: Shooting of LGBTQ+ individuals or individuals perceived as being LGBTQ+ by police officers.
comment: Disparos contra personas LGBTQ+ o personas percibidas como LGBTQ+ por agentes de la policía. @es
broader: Police violence toward LGBTQ+ people
has top concept: Anti-LGBTQ+ violence
issued: 2023-01-13
modified: 2025-02-23
type: Concept
in scheme: v3
change note: Version 4.1.0

Performative LGBTQ+ activism by police
preferred label: Activismo performativo LGBTQ+ de la policía @es
alternative label: Gay copaganda
alternative label: LGBTQ+ copaganda
alternative label: Pinkwashing by police officers
alternative label: Pride patches on police uniforms
alternative label: Rainbow colored patrol cars
alternative label: Rainbow hate crime cars
alternative label: Rainbow-hued police cars
alternative label: Rainbow-painted police cars
alternative label: Rainbow-washing by police officers
alternative label: Copaganda gay @es
alternative label: Copaganda LGBTQ+ @es
comment: LGBTQ+ activism undertaken by police organizations and institutions which intends to increase the social capital of such institutions, rather than to actually serve LGBTQ+ communities.
comment: Activismo LGBTQ+ emprendido por organizaciones e instituciones policiales que pretende aumentar el capital social de dichas instituciones, en lugar de servir realmente a las comunidades LGBTQ+. @es
broader: Police interactions with LGBTQ+ people
related: LGBTQ+ activism
has top concept: Police interactions with LGBTQ+ people
issued: 2023-01-13
modified: 2026-02-27
type: Concept
in scheme: v3
change note: Version 4.1.0

White supremacy in policing
preferred label: Supremacía blanca en la policía @es
alternative label: Far-right presence in police forces
alternative label: Infiltration of police by white supremacists
alternative label: Law enforcement and white supremacy
alternative label: Police and right-wing extremism
alternative label: Police officer ties with white supremacists
alternative label: Police with far-right ties
alternative label: Presencia de la extrema derecha en las fuerzas policiales @es
alternative label: Infiltración de supremacistas blancos en la policía @es
alternative label: Fuerzas del orden y supremacía blanca @es
alternative label: Policía y extremismo de derecha @es
alternative label: Vínculos de policías con supremacistas blancos @es
alternative label: Policía vinculada a la extrema derecha|| @es
comment: Historical and contemporary linkages between white supremacist ideologies and modern policing institutions, primarily discussed within the context of the countries of Canada and the United States.
comment: Vínculos históricos y contemporáneos entre las ideologías supremacistas blancas y las instituciones policiales modernas, discutidos principalmente en el contexto de los países de Canadá y Estados Unidos. @es
related: Police
related: Police harassment of Black LGBTQ+ people
related: Police harassment of Indigenous LGBTQ+ people
issued: 2023-01-13
modified: 2025-02-23
type: Concept
in scheme: v3
change note: Version 4.1.0

Black Lives Matter movement
preferred label: Movimiento Black Lives Matter @es
alternative label: BLM
alternative label: Black Lives Matter
alternative label: BlackLivesMatter
alternative label: Movement for Black Lives
alternative label: Movimiento BLM @es
alternative label: Movimiento por las vidas negras @es
alternative label: Movimiento Las Vidas Negras Importan @es
comment: A primarily U.S. American and Canadian decentralized political and social movement advocating for non-violent civil disobedience in protest against incidents of police brutality and all racially motivated violence against Black people. The broader movement and its related organizations typically advocate against police violence towards Black people, as well as for various other policy changes considered to be related to Black liberation.
comment: Un movimiento político y social descentralizado principalmente estadounidense y canadiense que aboga por la desobediencia civil no-violenta como protesta contra incidentes de brutalidad policial y toda violencia por motivos raciales contra las personas negras. El movimiento más amplio y sus respectivas organizaciones suelen abogar contra la violencia policial hacia las personas negras, así como a favor de otros cambios de políticas que se consideran relacionados con la liberación negra. @es
broader: Social movements
narrower: Black Trans Lives Matter movement
related: Black LGBTQ+ people
has top concept: Social movements
issued: 2023-01-13
modified: 2025-02-23
type: Concept
in scheme: v3
change note: Version 4.1.0

Black Trans Lives Matter movement
preferred label: Movimiento Black Trans Lives Matter @es
alternative label: BTLM Movement
alternative label: BTLM
alternative label: Movimiento BTLM @es
comment: A part of the Black Lives Matter movement which specifically advocates for Black trans people (especially Black trans women) and fights for racial equity and Black liberation.
comment: Una parte del movimiento Black Lives Matter (Las Vidas Negras Importan en inglés) que aboga específicamente por las personas trans negras (especialmente las mujeres trans negras) y lucha por la equidad racial y la liberación negra. @es
broader: Black Lives Matter movement
related: Black LGBTQ+ people
related: Black transgender people
has top concept: Social movements
issued: 2023-01-13
modified: 2025-02-23
type: Concept
in scheme: v3
change note: Version 4.1.0

Aromantic comics
preferred label: Cómics arrománticos @es
alternative label: Historietas arrománticas @es
comment: Works consisting of sequential images often accompanied by text; use in reference to comics focusing on aromantic characters or themes.
comment: Obras que consisten de imágenes secuenciales, a menudo acompañadas de texto; utilícese en referencia a cómics que se centran en personajes o temas arrománticos. @es
broader: LGBTQ+ comics
has top concept: Subcultures
issued: 2023-01-14
modified: 2025-02-23
type: Concept
in scheme: v3
change note: Version 4.1.0

Aromantic poetry
preferred label: Poesía arromántica @es
comment: Literary work, typically written in verse, that focuses on aromantic characters, themes, or identity.
comment: Obras literarias, normalmente escritas en verso, que se centran en personajes, temas o identidades arrománticas. @es
broader: LGBTQ+ poetry
related: Aromantic authors
related: Aromantic literature
has top concept: Subcultures
issued: 2023-01-17
modified: 2025-02-23
type: Concept
in scheme: v3
change note: Version 4.1.0

Intersex comics
preferred label: Cómics intersex @es
alternative label: Historietas intersex @es
comment: Works consisting of sequential images often accompanied by text; use in reference to comics focusing on intersexual characters or themes.
comment: Obras que consisten en imágenes secuenciales, a menudo acompañadas de texto; utilícese en referencia a cómics que se centran en personajes o temas intersex. @es
broader: LGBTQ+ comics
has top concept: Subcultures
issued: 2023-01-17
modified: 2025-02-23
type: Concept
in scheme: v3
change note: Version 4.1.0

Intersex poetry
preferred label: Poesía intersex @es
comment: Literary work, typically written in verse, that focuses on intersex characters, themes, or identity.
comment: Obras literarias, típicamente escritas en verso, que se centran en personajes, temas o identidades intersex. @es
broader: LGBTQ+ poetry
has top concept: Subcultures
issued: 2023-01-17
modified: 2025-02-23
type: Concept
in scheme: v3
change note: Version 4.1.0

Asexual comics
preferred label: Cómics asexuales @es
alternative label: Historietas asexuales @es
comment: Works consisting of sequential images often accompanied by text; use in reference to comics focusing on asexual characters or themes.
comment: Obras que consisten de imágenes secuenciales, a menudo acompañadas de texto; utilícese en referencia a los cómics centrados en personajes o temas asexuales. @es
broader: LGBTQ+ comics
has top concept: Subcultures
issued: 2023-01-17
modified: 2025-02-23
type: Concept
in scheme: v3
change note: Version 4.1.0

Asexual poetry
preferred label: Poesía asexual @es
comment: Literary work, typically written in verse, that focuses on asexual characters, themes, or identity.
comment: Obras literarias, normalmente escritas en verso, que se centran en personajes, temas o en la identidad asexual. @es
broader: LGBTQ+ poetry
related: Asexual authors
related: Asexual literature
has top concept: Subcultures
issued: 2023-01-17
modified: 2025-02-23
type: Concept
in scheme: v3
change note: Version 4.1.0

Demisexual comics
preferred label: Cómics demisexuales @es
alternative label: Historietas demisexuales @es
comment: Works consisting of sequential images often accompanied by text; use in reference to comics focusing on demisexual characters or themes.
comment: Obras que consisten en imágenes secuenciales, a menudo acompañadas de texto; utilícese en referencia a cómics que se centran en personajes o temas demisexuales. @es
broader: LGBTQ+ comics
has top concept: Subcultures
issued: 2023-01-17
modified: 2025-02-23
type: Concept
in scheme: v3
change note: Version 4.1.0

Demisexual fiction
preferred label: Ficción demisexual @es
comment: Written works describing imagined events or people; use in reference to fictional works focusing on demisexual characters or themes.
comment: Obras escritas que describen eventos o personas imaginadas; utilícese en referencia a obras de ficción que se centran en personajes o temas demisexuales. @es
broader: LGBTQ+ fiction
narrower: Demisexual fantasy fiction
narrower: Demisexual horror fiction
narrower: Demisexual mystery and detective fiction
narrower: Demisexual romance fiction
narrower: Demisexual science fiction
narrower: Demisexual short stories
related: Demisexual literature
related: Demisexual authors
has top concept: Subcultures
issued: 2023-01-17
modified: 2025-02-23
type: Concept
in scheme: v3
change note: Version 4.1.0

Demisexual poetry
preferred label: Poesía demisexual @es
comment: Literary work, typically written in verse, that focuses on demisexual characters, themes, or identity.
comment: Obras literarias, típicamente escritas en verso, que se centran en personajes, temas o identidades demisexuales. @es
broader: LGBTQ+ poetry
related: Demisexual literature
related: Demisexual authors
has top concept: Subcultures
issued: 2023-01-17
modified: 2025-02-23
type: Concept
in scheme: v3
change note: Version 4.1.0

Asexual erotic literature
preferred label: Literatura erótica asexual @es
comment: Literary works that have erotic or sexual elements; use in reference to erotic literature focusing on asexual characters or themes.
comment: Obras literarias que tienen elementos eróticos o sexuales; utilícese en referencia a la literatura erótica centrada en personajes o temas asexuales. @es
broader: LGBTQ+ erotic literature
has top concept: Erotica
issued: 2023-01-17
modified: 2025-02-23
type: Concept
in scheme: v3
change note: Version 4.1.0

Intersex erotic literature
preferred label: Literatura erótica intersex @es
comment: Literary works that have erotic or sexual elements; use in reference to erotic literature focusing on intersex characters or themes.
comment: Obras literarias que tengan elementos eróticos o sexuales; utilícese en referencia a la literatura erótica que se centra en personajes o temas intersex. @es
broader: LGBTQ+ erotic literature
has top concept: Erotica
issued: 2023-01-17
modified: 2025-02-23
type: Concept
in scheme: v3
change note: Version 4.1.0

Demisexual erotic literature
preferred label: Literatura erótica demisexual @es
comment: Literary works that have erotic or sexual elements; use in reference to erotic literature focusing on demisexual characters or themes.
comment: Obras literarias que tengan elementos eróticos o sexuales; utilícese en referencia a la literatura erótica que se centra en personajes o temas demisexuales. @es
broader: LGBTQ+ erotic literature
has top concept: Erotica
issued: 2023-01-17
modified: 2025-02-23
type: Concept
in scheme: v3
change note: Version 4.1.0

Asexual fantasy fiction
preferred label: Ficción fantástica asexual @es
comment: Genre that uses magic and other supernatural phenomena as a primary element of plot, theme, and/or setting; use for fantasy fiction focusing on asexual characters or themes.
comment: Género que utiliza la magia y otros fenómenos sobrenaturales como elemento principal de la trama, el tema y/o el escenario; utilícese para la ficción fantástica centrada en personajes o temas asexuales. @es
broader: LGBTQ+ fantasy fiction
broader: Asexual fiction
has top concept: Subcultures
issued: 2023-01-17
modified: 2025-02-23
type: Concept
in scheme: v3
change note: Version 4.1.0

Aromantic fantasy fiction
preferred label: Ficción fantástica arromántica @es
comment: Genre that uses magic and other supernatural phenomena as a primary element of plot, theme, and/or setting; use for fantasy fiction focusing on aromantic characters or themes.
comment: Género que utiliza la magia y otros fenómenos sobrenaturales como elemento principal de la trama, el tema y/o el escenario; utilícese para la ficción fantástica centrada en personajes o temas arrománticos. @es
broader: LGBTQ+ fantasy fiction
broader: Aromantic fiction
has top concept: Subcultures
issued: 2023-01-24
modified: 2025-02-23
type: Concept
in scheme: v3
change note: Version 4.1.0

Intersex fantasy fiction
preferred label: Ficción fantástica intersex @es
comment: Genre that uses magic and other supernatural phenomena as a primary element of plot, theme, and/or setting; use for fantasy fiction focusing on intersex characters or themes.
comment: Género que utiliza la magia y otros fenómenos sobrenaturales como elemento principal de la trama, el tema y/o el escenario; utilícese para la ficción fantástica que se centre en personajes o temas intersex. @es
broader: LGBTQ+ fantasy fiction
broader: Intersex fiction
has top concept: Subcultures
issued: 2023-01-24
modified: 2025-02-23
type: Concept
in scheme: v3
change note: Version 4.1.0

Demisexual fantasy fiction
preferred label: Ficción fantástica demisexual @es
comment: Genre that uses magic and other supernatural phenomena as a primary element of plot, theme, and/or setting; use for fantasy fiction focusing on demisexual characters or themes.
comment: Género que utiliza la magia y otros fenómenos sobrenaturales como elemento principal de la trama, tema y/o escenario; utilícese para ficción fantástica que se centra en personajes o temas demisexuales. @es
broader: LGBTQ+ fantasy fiction
broader: Demisexual fiction
has top concept: Subcultures
issued: 2023-01-24
modified: 2025-02-23
type: Concept
in scheme: v3
change note: Version 4.1.0

Asexual graphic novels
preferred label: Novelas gráficas asexuales @es
comment: Works consisting of sequential images often accompanied by text that generally contain stand-alone stories; used in reference to graphic novels focusing on asexual characters or themes.
comment: Obras que consisten en imágenes secuenciales, a menudo acompañadas de texto, que generalmente contienen historias independientes; utilícese en referencia a novelas gráficas que se centran en personajes o temas asexuales. @es
broader: LGBTQ+ graphic novels
has top concept: Subcultures
issued: 2023-01-24
modified: 2025-02-23
type: Concept
in scheme: v3
change note: Version 4.1.0

Demisexual graphic novels
preferred label: Novelas gráficas demisexuales @es
comment: Works consisting of sequential images often accompanied by text that generally contain stand-alone stories; used in reference to graphic novels focusing on demisexual characters or themes.
comment: Obras que consisten en imágenes secuenciales, a menudo acompañadas de texto que generalmente contienen historias independientes; utilícese en referencia a novelas gráficas que se centran en personajes o temas demisexuales. @es
broader: LGBTQ+ graphic novels
has top concept: Subcultures
issued: 2023-01-24
modified: 2025-02-23
type: Concept
in scheme: v3
change note: Version 4.1.0

Aromantic graphic novels
preferred label: Novelas gráficas arrománticas @es
comment: Works consisting of sequential images often accompanied by text that generally contain stand-alone stories; used in reference to graphic novels focusing on aromantic characters or themes.
comment: Obras que consisten de imágenes secuenciales, a menudo acompañadas de texto, que suelen contener historias independientes; utilícese en referencia a las novelas gráficas centradas en personajes o temas arrománticos. @es
broader: LGBTQ+ graphic novels
has top concept: Subcultures
issued: 2023-01-24
modified: 2025-02-23
type: Concept
in scheme: v3
change note: Version 4.1.0

Intersex graphic novels
preferred label: Novelas gráficas intersex @es
comment: Works consisting of sequential images often accompanied by text that generally contain stand-alone stories; used in reference to graphic novels focusing on intersex characters or themes.
comment: Obras que consisten en imágenes secuenciales, a menudo acompañadas de texto que generalmente contienen historias independientes; utilizado en referencia a novelas gráficas que se centran en personajes o temas intersex. @es
broader: LGBTQ+ graphic novels
has top concept: Subcultures
issued: 2023-01-24
modified: 2025-02-23
type: Concept
in scheme: v3
change note: Version 4.1.0

Demisexual horror fiction
preferred label: Ficción de horror demisexual @es
comment: Written works of fiction intended to frighten, scare, or disgust; use in reference to horror fiction focusing on demisexual characters or themes.
comment: Obras de ficción escritas con la intención de asustar, atemorizar o provocar disgusto; utilícese en referencia a la ficción de horror centrada en personajes o temas demisexuales. @es
broader: LGBTQ+ horror fiction
broader: Demisexual fiction
has top concept: Subcultures
issued: 2023-01-24
modified: 2025-02-23
type: Concept
in scheme: v3
change note: Version 4.1.0

Aromantic horror fiction
preferred label: Ficción de horror aromántica @es
comment: Written works of fiction intended to frighten, scare, or disgust; use in reference to horror fiction focusing on aromantic characters or themes.
comment: Obras de ficción escritas con la intención de asustar, atemorizar o provocar disgusto. Utilícese en referencia a la ficción de horror centrada en personajes o temas arrománticos. @es
broader: LGBTQ+ horror fiction
broader: Aromantic fiction
has top concept: Subcultures
issued: 2023-01-24
modified: 2025-02-23
type: Concept
in scheme: v3
change note: Version 4.1.0

Intersex horror fiction
preferred label: Ficción de horror intersex @es
comment: Written works of fiction intended to frighten, scare, or disgust; use in reference to horror fiction focusing on intersex characters or themes.
comment: Obras de ficción escritas con la intención de asustar, atemorizar o provocar disgusto; utilícese en referencia a la ficción de horror centrada en personajes o temas intersex. @es
broader: LGBTQ+ horror fiction
broader: Intersex fiction
has top concept: Subcultures
issued: 2023-01-24
modified: 2025-02-23
type: Concept
in scheme: v3
change note: Version 4.1.0

Asexual mystery and detective fiction
preferred label: Ficción asexual de misterio y de detectives @es
comment: Written literary works about the investigation of crime or the work of detectives; use in reference to mystery and detective fiction focusing on asexual characters and themes.
comment: Obras literarias escritas sobre la investigación de crímenes o el trabajo de detectives; utilícese en referencia a la ficción de misterio y de detectives centrada en personajes y temas asexuales. @es
broader: LGBTQ+ mystery and detective fiction
broader: Asexual fiction
has top concept: Subcultures
issued: 2023-01-24
modified: 2025-02-23
type: Concept
in scheme: v3
change note: Version 4.1.0

Demisexual mystery and detective fiction
preferred label: Ficción demisexual de misterio y de detectives @es
comment: Written literary works about the investigation of crime or the work of detectives; use in reference to mystery and detective fiction focusing on demisexual characters and themes.
comment: Obras literarias escritas sobre la investigación de crímenes o el trabajo de detectives; utilícese en referencia a la ficción de misterio y de detectives centrada en personajes y temas demisexuales. @es
broader: LGBTQ+ mystery and detective fiction
broader: Demisexual fiction
has top concept: Subcultures
issued: 2023-01-24
modified: 2025-02-23
type: Concept
in scheme: v3
change note: Version 4.1.0

Aromantic mystery and detective fiction
preferred label: Ficción arromántica de misterio y de detectives @es
comment: Written literary works about the investigation of crime or the work of detectives; use in reference to mystery and detective fiction focusing on aromantic characters and themes.
comment: Obras literarias escritas sobre la investigación de crímenes o el trabajo de detectives; utilícese en referencia a la ficción de misterio y de detectives centrada en personajes y temas arrománticos. @es
broader: LGBTQ+ mystery and detective fiction
broader: Aromantic fiction
has top concept: Subcultures
issued: 2023-01-24
modified: 2025-02-23
type: Concept
in scheme: v3
change note: Version 4.1.0

Intersex mystery and detective fiction
preferred label: Ficción intersex de misterio y de detectives @es
comment: Written literary works about the investigation of crime or the work of detectives; use in reference to mystery and detective fiction focusing on intersex characters and themes.
comment: Obras literarias escritas sobre la investigación de crímenes o el trabajo de detectives; utilícese en referencia a la ficción de misterio y de detectives centrada en personajes y temas intersex. @es
broader: LGBTQ+ mystery and detective fiction
broader: Intersex fiction
has top concept: Subcultures
issued: 2023-01-24
modified: 2025-02-23
type: Concept
in scheme: v3
change note: Version 4.1.0

Asexual romance fiction
preferred label: Ficción romántica asexual @es
comment: Works of fiction revolving around romantic and/or sexual relationships between the main characters; use in reference to romance fiction focusing on asexual characters.
comment: Obras de ficción que giran en torno a relaciones románticas y/o sexuales entre los personajes principales; utilícese en referencia a la ficción romántica centrada en personajes asexuales. @es
broader: LGBTQ+ romance fiction
broader: Asexual fiction
has top concept: Subcultures
issued: 2023-01-24
modified: 2025-02-23
type: Concept
in scheme: v3
change note: Version 4.1.0

Aromantic romance fiction
preferred label: Ficción romántica arromántica @es
comment: Works of fiction revolving around romantic and/or sexual relationships between the main characters; use in reference to romance fiction focusing on aromantic characters.
comment: Obras de ficción que giran en torno a las relaciones románticas y/o sexuales entre los personajes principales; utilícese en referencia a la ficción romántica centrada en personajes arománticos. @es
broader: LGBTQ+ romance fiction
broader: Aromantic fiction
has top concept: Subcultures
issued: 2023-01-24
modified: 2025-02-23
type: Concept
in scheme: v3
change note: Version 4.1.0

Intersex romance fiction
preferred label: Ficción romántica intersex @es
comment: Works of fiction revolving around romantic and/or sexual relationships between the main characters; use in reference to romance fiction focusing on intersex characters.
comment: Obras de ficción que giran en torno a relaciones románticas y/o sexuales entre los personajes principales; utilícese en referencia a la ficción romántica centrada en personajes intersex. @es
broader: LGBTQ+ romance fiction
broader: Intersex fiction
has top concept: Subcultures
issued: 2023-01-24
modified: 2025-02-23
type: Concept
in scheme: v3
change note: Version 4.1.0

Demisexual romance fiction
preferred label: Ficción romántica demisexual @es
comment: Works of fiction revolving around romantic and/or sexual relationships between the main characters; use in reference to romance fiction focusing on demisexual characters.
comment: Obras de ficción que giran en torno a relaciones románticas y/o sexuales entre los personajes principales; utilícese en referencia a la ficción romántica centrada en personajes demisexuales. @es
broader: LGBTQ+ romance fiction
broader: Demisexual fiction
has top concept: Subcultures
issued: 2023-01-24
modified: 2025-02-23
type: Concept
in scheme: v3
change note: Version 4.1.0

Asexual science fiction
preferred label: Ciencia ficción asexual @es
comment: Written literary work about imaginative or futuristic concepts incorporating science, technology, space, time travel, and other speculative elements; use in reference to science fiction focusing on asexual characters or themes.
comment: Obra literaria escrita sobre conceptos imaginativos o futuristas que incorporan la ciencia, la tecnología, el espacio, los viajes en el tiempo y otros elementos especulativos; utilícese en referencia a la ciencia ficción que se centra en personajes o temas asexuales. @es
broader: LGBTQ+ science fiction
broader: Asexual fiction
has top concept: Subcultures
issued: 2023-01-24
modified: 2025-02-23
type: Concept
in scheme: v3
change note: Version 4.1.0

Demisexual science fiction
preferred label: Ciencia ficción demisexual @es
comment: Written literary work about imaginative or futuristic concepts incorporating science, technology, space, time travel, and other speculative elements; use in reference to science fiction focusing on demisexual characters or themes.
comment: Obras literarias escritas sobre conceptos imaginativos o futuristas que incorporen la ciencia, la tecnología, el espacio, los viajes en el tiempo y otros elementos especulativos; utilícese en referencia a la ciencia ficción centrada en personajes o temas demisexuales. @es
broader: LGBTQ+ science fiction
broader: Demisexual fiction
has top concept: Subcultures
issued: 2023-01-24
modified: 2025-02-23
type: Concept
in scheme: v3
change note: Version 4.1.0

Aromantic science fiction
preferred label: Ciencia ficción arromántica @es
comment: Written literary work about imaginative or futuristic concepts incorporating science, technology, space, time travel, and other speculative elements; use in reference to science fiction focusing on aromantic characters or themes.
comment: Obras literarias escritas sobre conceptos imaginativos o futuristas que incorporan la ciencia, la tecnología, el espacio, los viajes en el tiempo y otros elementos especulativos; utilícese en referencia a la ciencia ficción centrada en personajes o temas arrománticos. @es
broader: LGBTQ+ science fiction
broader: Aromantic fiction
has top concept: Subcultures
issued: 2023-01-24
modified: 2025-02-23
type: Concept
in scheme: v3
change note: Version 4.1.0

Intersex science fiction
preferred label: Ciencia ficción intersex @es
comment: Written literary work about imaginative or futuristic concepts incorporating science, technology, space, time travel, and other speculative elements; use in reference to science fiction focusing on intersex characters or themes.
comment: Obras literarias escritas sobre conceptos imaginativos o futuristas que incorporen la ciencia, la tecnología, el espacio, los viajes en el tiempo y otros elementos especulativos; utilícese en referencia a la ciencia ficción centrada en personajes o temas intersex. @es
broader: LGBTQ+ science fiction
broader: Intersex fiction
has top concept: Subcultures
issued: 2023-01-24
modified: 2025-02-23
type: Concept
in scheme: v3
change note: Version 4.1.0

Asexual short stories
preferred label: Cuentos cortos asexuales @es
comment: Written literary works that are short in length and detail a self-contained incident or concept; use in reference to short stories focusing on asexual characters or themes.
comment: Obras literarias escritas que son breves y detallan un incidente o concepto autónomo; utilícese en referencia a historias cortas que se centren en personajes o temas asexuales. @es
broader: LGBTQ+ short stories
has top concept: Subcultures
issued: 2023-01-24
modified: 2025-02-23
type: Concept
in scheme: v3
change note: Version 4.1.0

Aromantic short stories
preferred label: Cuentos cortos arrománticos @es
alternative label: Relatos arrománticos @es
comment: Written literary works that are short in length and detail a self-contained incident or concept; use in reference to short stories focusing on aromantic characters or themes.
comment: Obras literarias escritas de corta extensión que detallan un incidente o concepto autocontenido; utilícese en referencia a relatos cortos centrados en personajes o temas arománticos. @es
broader: LGBTQ+ short stories
has top concept: Subcultures
issued: 2023-01-24
modified: 2025-02-23
type: Concept
in scheme: v3
change note: Version 4.1.0

Intersex short stories
preferred label: Cuentos cortos intersex @es
alternative label: Relatos intersex @es
comment: Written literary works that are short in length and detail a self-contained incident or concept; use in reference to short stories focusing on intersex characters or themes.
comment: Obras literarias escritas que son breves y detallan un incidente o concepto autónomo; utilícese en referencia a cuentos cortos que se centren en personajes o temas intersex. @es
broader: LGBTQ+ short stories
has top concept: Subcultures
issued: 2023-01-24
modified: 2025-02-23
type: Concept
in scheme: v3
change note: Version 4.1.0

Demisexual short stories
preferred label: Cuentos cortos demisexuales @es
alternative label: Relatos demisexuales @es
comment: Written literary works that are short in length and detail a self-contained incident or concept; use in reference to short stories focusing on demisexual characters or themes.
comment: Obras literarias escritas que son breves y detallan un incidente o concepto autónomo. Utilícese en referencia a historias cortas que se centren en personajes o temas demisexuales. @es
broader: LGBTQ+ short stories
broader: Demisexual fiction
has top concept: Subcultures
issued: 2023-01-24
modified: 2025-02-23
type: Concept
in scheme: v3
change note: Version 4.1.0

Transgender films
preferred label: Películas transgénero @es
comment: Motion pictures, or movies, created by transgender directors, depicting transgender people, or that are regarded as important within transgender culture.
comment: Películas creadas por directores transgénero, que representan a personas transgénero, o personas consideradas importantes dentro de la cultura transgénero. @es
broader: LGBTQ+ films
has top concept: Subcultures
issued: 2023-03-17
modified: 2025-02-23
type: Concept
in scheme: v3
change note: Version 4.1.0

Queer films
preferred label: Películas queer @es
comment: Motion pictures, or movies, created by queer directors, depicting queer people, or that are regarded as important within queer culture.
comment: Películas creadas por directores queer, que representan a personas queer o personas consideradas importantes dentro de la cultura queer. @es
broader: LGBTQ+ films
has top concept: Subcultures
issued: 2023-03-17
modified: 2025-02-23
type: Concept
in scheme: v3
change note: Version 4.1.0

Bisexual films
preferred label: Ficción bisexual @es
comment: Motion pictures, or movies, created by bisexual directors, depicting bisexual people, or that are regarded as important within bisexual culture.
comment: Obras escritas que describen eventos o personas imaginadas; utilícese en referencia a obras de ficción que se centran en personajes o temas bisexuales. @es
broader: LGBTQ+ films
has top concept: Subcultures
issued: 2023-03-17
modified: 2025-02-23
type: Concept
in scheme: v3
change note: Version 4.1.0

Aromantic literature
preferred label: Literatura arromántica @es
comment: Written literary works about aromanticism, aromantic characters, or aromantic themes.
comment: Obras literarias escritas sobre el aromanticismo, personajes arrománticos o temas arrománticos. @es
broader: LGBTQ+ literature
related: Aromantic authors
related: Aromantic poetry
related: Aromantic drama
has top concept: Subcultures
issued: 2023-03-20
modified: 2025-02-23
type: Concept
in scheme: v3
change note: Version 4.1.0

Aromantic erotic literature
preferred label: Literatura erótica arromántica @es
comment: Literary works with erotic or sexual elements; use in reference to erotic literature focusing on aromantic characters or themes.
comment: Obras literarias con elementos eróticos o sexuales; utilícese en referencia a la literatura erótica centrada en personajes o temas arrománticos. @es
broader: LGBTQ+ erotic literature
has top concept: Erotica
issued: 2023-03-20
modified: 2025-02-23
type: Concept
in scheme: v3
change note: Version 4.1.0

Aromantic drama
preferred label: Drama aromántico @es
comment: Works of fiction written to be performed; use in reference to dramatic works focusing on aromantic characters or themes.
comment: Obras de ficción escritas para ser puestas en escena; utilícese en referencia a obras dramáticas que se centran en personajes o temas arrománticos. @es
broader: LGBTQ+ drama
related: Aromantic literature
related: Aromantic theater
has top concept: Subcultures
issued: 2023-03-20
modified: 2025-02-23
type: Concept
in scheme: v3
change note: Version 4.1.0

Aromantic theater
preferred label: Teatro arromántico @es
comment: Works in the performance arts that focus on aromantic characters, communities, or issues.
comment: Obras de artes escénicas centradas en personajes, comunidades o temas arománticos. @es
broader: LGBTQ+ theater
related: Aromantic drama
has top concept: LGBTQ+ theater
issued: 2023-03-20
modified: 2025-02-23
type: Concept
in scheme: v3
change note: Version 4.1.0

Aromantic youth
preferred label: Juventud arromántica @es
comment: Aromantic people who are between the ages of childhood and adulthood.
comment: Personas arrománticas que se encuentran entre la infancia y la edad adulta. @es
broader: LGBTQ+ youth
related: LGBTQ+ unhoused youth
related: Aromantic youth literature
has top concept: Youth
issued: 2023-03-20
modified: 2025-02-23
type: Concept
in scheme: v3
change note: Version 4.1.0

Aromantic youth literature
preferred label: Literatura juvenil arromántica @es
comment: Written literary works for an audience of readers from 12-18 years of age, also known as young adult literature or YA; use in reference to youth literature focusing on aromantic characters or themes.
comment: Obras literarias escritas para un público de lectores de 12 a 18 años de edad, también conocidas como literatura para jóvenes adultos o YA (por sus siglas en inglés); utilícese en referencia a la literatura para jóvenes centrada en personajes o temas arrománticos. @es
broader: LGBTQ+ youth literature
related: Aromantic youth
has top concept: Subcultures
issued: 2023-03-23
modified: 2025-02-23
type: Concept
in scheme: v3
change note: Version 4.1.0

Aromantic history
preferred label: Historia arromántica @es
comment: Past events or accounts of the past concerning aromantic people, or people who might be perceived as aromantic if they were alive today.
comment: Hechos o relatos del pasado relacionados con personas arrománticas, o personas que pudiesen ser percibidas como arrománticas si vivieran hoy en día. @es
broader: LGBTQ+ history
has top concept: LGBTQ+ history
issued: 2023-03-23
modified: 2025-02-23
type: Concept
in scheme: v3
change note: Version 4.1.0

Aromantic autobiographies
preferred label: Autobiografías arrománticas @es
comment: Accounts of aromantic peoples' lives written by those people. For written accounts of aromantic people's lives that were not written by the subject, use "Aromantic biographies."
comment: Relatos de la vida de personas escritos por dichas personas. Utilícese para autobiografías escritas por autores arrománticos. @es
broader: LGBTQ+ autobiographies
related: Aromantic authors
related: Aromantic biographies
has top concept: LGBTQ+ autobiographies
issued: 2023-03-23
modified: 2025-02-23
type: Concept
in scheme: v3
change note: Version 4.1.0

Aromantic biographies
preferred label: Biografías arrománticas @es
comment: Written accounts of the lives of aromantic people. For written accounts of aromantic people's lives written by the subject, use "Aromantic autobiographies."
comment: Relatos escritos de la vida de personas conocidas por ser arrománticas. @es
broader: LGBTQ+ biographies
related: Aromantic authors
related: Aromantic autobiographies
has top concept: LGBTQ+ biographies
issued: 2023-03-23
modified: 2025-02-23
type: Concept
in scheme: v3
change note: Version 4.1.0

Aromantic literary criticism
preferred label: Crítica literaria arromántica @es
comment: The study, evaluation, and interpretation of literary works focusing on aromantic characters or themes; can also include interpretation of literature through the lens and frameworks of aromantic studies.
comment: El estudio, la evaluación y la interpretación de obras literarias centradas en personajes o temas arrománticos. También puede incluir la interpretación de la literatura a través del lente y los marcos teóricos de los estudios arrománticos. @es
broader: LGBTQ+ literary criticism
related: Lesbian literary criticism
related: Gay literary criticism
related: Bisexual literary criticism
related: Transgender literary criticism
related: Queer literary criticism
related: Aromantic authors
has top concept: LGBTQ+ literary criticism
issued: 2023-03-23
modified: 2025-02-23
type: Concept
in scheme: v3
change note: Version 4.1.0

Asexual literature
preferred label: Literatura asexual @es
comment: Written literary works about asexuality, asexual characters, or asexual themes.
comment: Obras literarias escritas sobre la asexualidad, personajes asexuales o temas asexuales. @es
broader: LGBTQ+ literature
related: Asexual authors
related: Asexual fiction
related: Asexual poetry
related: Asexual drama
has top concept: Subcultures
issued: 2023-03-23
modified: 2025-02-23
type: Concept
in scheme: v3
change note: Version 4.1.0

Asexual drama
preferred label: Drama asexual @es
comment: Works of fiction written to be performed; use in reference to dramatic works focusing on asexual characters or themes.
comment: Obras de ficción escritas para ser puestas en escena; utilícese en referencia a obras dramáticas que se centran en personajes o temas asexuales. @es
broader: LGBTQ+ drama
related: Asexual literature
related: Asexual theater
has top concept: Subcultures
issued: 2023-03-23
modified: 2025-02-23
type: Concept
in scheme: v3
change note: Version 4.1.0

Asexual theater
preferred label: Teatro asexual @es
comment: Works in the performance arts that focus on asexual characters, communities, or issues.
comment: Obras de artes escénicas que se centran en personajes, comunidades o cuestiones asexuales. @es
broader: LGBTQ+ theater
related: Asexual drama
has top concept: LGBTQ+ theater
issued: 2023-03-23
modified: 2025-02-23
type: Concept
in scheme: v3
change note: Version 4.1.0

Asexual fiction
comment: Written works describing imagined events or people; use in reference to fictional works focusing on asexual characters or themes.
broader: LGBTQ+ fiction
related: Bisexual characters
related: Bisexual literature
related: Bisexual authors
related: Asexual authors
related: Two-Spirit fiction
related: Intersex fiction
related: Aromantic fiction
related: Bisexual people in fandom
related: Greyromantic fiction
has top concept: Subcultures
is replaced by: homoit0001754
issued: 2023-03-23
modified: 2023-10-27
type: Concept
in scheme: v3
change note: Version 4.1.0

Asexual horror fiction
preferred label: Ficción de horror asexual @es
comment: Written works of fiction intended to frighten, scare, or disgust; use in reference to horror fiction focusing on asexual characters or themes.
comment: Obras de ficción escritas con la intención de asustar, atemorizar o provocar disgusto; utilícese en referencia a la ficción de horror centrada en personajes o temas asexuales. @es
broader: LGBTQ+ horror fiction
has top concept: Subcultures
issued: 2023-03-23
modified: 2025-02-23
type: Concept
in scheme: v3
change note: Version 4.1.0

Asexual youth literature
preferred label: Literatura juvenil asexual @es
comment: Written literary works for an audience of readers from 12-18 years of age, also known as young adult literature or YA; use in reference to youth literature focusing on asexual characters or themes.
comment: Obras literarias escritas para una audiencia de lectores de 12 a 18 años de edad, también conocida como literatura para adultos jóvenes o YA; utilícese en referencia a la literatura juvenil que se centra en personajes o temas asexuales @es
broader: LGBTQ+ youth literature
related: Asexual youth
has top concept: Subcultures
issued: 2023-03-23
modified: 2025-02-23
type: Concept
in scheme: v3
change note: Version 4.1.0

Asexual history
comment: Past events or accounts of the past concerning asexual people, or people who might be perceived as asexual if they were alive today.
broader: LGBTQ+ history
has top concept: LGBTQ+ history
is replaced by: homoit0002267
issued: 2023-03-24
modified: 2023-10-27
type: Concept
in scheme: v3
change note: Version 4.1.0

Asexual autobiographies
preferred label: Autobiografías asexuales @es
comment: Accounts of asexual peoples' lives written by those people. For written accounts of asexual people's lives that were not written by the subject, use "Asexual biographies."
comment: Relatos de vida de personas escritos por esas mismas personas; utilícese para autobiografías escritas por autores asexuales. @es
broader: LGBTQ+ autobiographies
related: Asexual authors
related: Asexual biographies
has top concept: LGBTQ+ autobiographies
issued: 2023-03-24
modified: 2025-02-23
type: Concept
in scheme: v3
change note: Version 4.1.0

Asexual biographies
preferred label: Biografías asexuales @es
comment: Written accounts of the lives of asexual people. For written accounts of asexual people's lives written by the subject, use "Asexual autobiographies."
comment: Relatos escritos de la vida de personas conocidas por ser asexuales. @es
broader: LGBTQ+ biographies
related: Asexual authors
related: Asexual autobiographies
has top concept: LGBTQ+ biographies
issued: 2023-03-24
modified: 2025-02-23
type: Concept
in scheme: v3
change note: Version 4.1.0

Asexual literary criticism
preferred label: Crítica literaria asexual @es
comment: The study, evaluation, and interpretation of literary works focusing on asexual characters or themes; can also include interpretation of literature through the lens and frameworks of asexual studies.
comment: El estudio, la evaluación y la interpretación de obras literarias centradas en personajes o temas asexuales; también puede incluir la interpretación de la literatura a través del lente y los marcos teóricos de los estudios asexuales. @es
broader: LGBTQ+ literary criticism
related: Lesbian literary criticism
related: Gay literary criticism
related: Bisexual literary criticism
related: Transgender literary criticism
related: Queer literary criticism
related: Asexual authors
has top concept: LGBTQ+ literary criticism
issued: 2023-03-26
modified: 2025-02-23
type: Concept
in scheme: v3
change note: Version 4.1.0

Demisexual literature
preferred label: Literatura demisexual @es
comment: Written literary works about demisexuality, demisexual characters, or demisexual themes.
comment: Obras literarias escritas sobre la demisexualidad, los personajes demisexuales o los temas demisexuales. @es
broader: LGBTQ+ literature
related: Demisexual fiction
related: Demisexual poetry
related: Demisexual drama
related: Demisexual authors
has top concept: Subcultures
issued: 2023-03-26
modified: 2025-02-23
type: Concept
in scheme: v3
change note: Version 4.1.0

Demisexual drama
preferred label: Drama demisexual @es
comment: Works of fiction written to be performed; use in reference to dramatic works focusing on demisexual characters or themes.
comment: Obras de ficción escritas para ser puestas en escena; utilícese en referencia a obras dramáticas que se centran en personajes o temas demisexuales. @es
broader: LGBTQ+ drama
related: Demisexual literature
related: Demisexual theater
has top concept: Subcultures
issued: 2023-03-26
modified: 2025-02-23
type: Concept
in scheme: v3
change note: Version 4.1.0

Demisexual theater
preferred label: Teatro demisexual @es
comment: Works in the performance arts that focus on demisexual characters, communities, or issues.
comment: Trabajos en las artes escénicas que se centran en personajes, comunidades o cuestiones demisexuales. @es
broader: LGBTQ+ theater
related: Demisexual drama
has top concept: LGBTQ+ theater
issued: 2023-03-26
modified: 2025-02-23
type: Concept
in scheme: v3
change note: Version 4.1.0

Demisexual authors
preferred label: Autores demisexuales @es
comment: Demisexual creators of written works.
comment: Creadores de obras escritas conocidos por ser demisexuales. @es
broader: LGBTQ+ authors
related: Demisexual fiction
related: Demisexual poetry
related: Demisexual literature
related: Demisexual autobiographies
related: Demisexual biographies
related: Demisexual literary criticism
related: Demisexual people's writings
has top concept: LGBTQ+ people
issued: 2023-03-26
modified: 2025-03-13
type: Concept
in scheme: v3
change note: Version 4.1.0

Demisexual history
preferred label: Historia demisexual @es
comment: Past events or accounts of the past concerning demisexual people, or people who might be perceived as demisexual if they were alive today.
comment: Eventos pasados ​​o relatos del pasado relacionados con personas demisexuales, o personas que podrían ser percibidas como demisexuales si estuvieran vivas hoy. @es
broader: LGBTQ+ history
has top concept: LGBTQ+ history
issued: 2023-03-26
modified: 2025-02-23
type: Concept
in scheme: v3
change note: Version 4.1.0

Demisexual youth
preferred label: Juventud demisexual @es
alternative label: Jóvenes demisexuales @es
comment: Demisexual people between the ages of childhood and adulthood.
comment: Personas demisexuales entre las edades de infancia y la adultez. @es
broader: LGBTQ+ youth
related: Demisexual youth literature
has top concept: Youth
issued: 2023-03-28
modified: 2025-02-23
type: Concept
in scheme: v3
change note: Version 4.1.0

Demisexual youth literature
preferred label: Literatura juvenil demisexual @es
comment: Written literary works for an audience of readers from 12-18 years of age, also known as young adult literature or YA; use in reference to youth literature focusing on demisexual characters or themes.
comment: Obras literarias escritas para una audiencia de lectores de 12 a 18 años de edad, también conocida como literatura para adultos jóvenes o YA; utilícese en referencia a la literatura juvenil que se centra en personajes o temas demisexuales. @es
broader: LGBTQ+ youth literature
related: Demisexual youth
has top concept: Subcultures
issued: 2023-03-28
modified: 2025-02-23
type: Concept
in scheme: v3
change note: Version 4.1.0

Demisexual autobiographies
preferred label: Autobiografías demisexuales @es
alternative label: Memorias demisexuales @es
comment: Accounts of demisexual peoples' lives written by those people. For written accounts of demisexual people's lives that were not written by the subject, use "Demisexual biographies."
comment: Relatos de vida de personas escritos por esas mismas personas; utilícese para autobiografías escritas por autores demisexuales @es
broader: LGBTQ+ autobiographies
related: Demisexual authors
related: Demisexual biographies
has top concept: LGBTQ+ autobiographies
issued: 2023-03-28
modified: 2025-02-23
type: Concept
in scheme: v3
change note: Version 4.1.0

Demisexual biographies
preferred label: Biografías demisexuales @es
comment: Written accounts of the lives of demisexual people. For written accounts of demisexual people's lives written by the subject, use "Demisexual autobiographies."
comment: Relatos escritos de la vida de personas conocidas por ser demisexuales. @es
broader: LGBTQ+ biographies
related: Demisexual authors
related: Demisexual autobiographies
has top concept: LGBTQ+ biographies
issued: 2023-03-28
modified: 2025-02-23
type: Concept
in scheme: v3
change note: Version 4.1.0

Demisexual literary criticism
preferred label: Crítica literaria demisexual @es
comment: The study, evaluation, and interpretation of literary works focusing on demisexual characters or themes; can also include interpretation of literature through the lens and frameworks of demisexual studies.
comment: El estudio, la evaluación y la interpretación de obras literarias que se centran en personajes o temas demisexuales; también puede incluir la interpretación de la literatura a través de un lente y marcos teóricos de los estudios demisexuales. @es
broader: LGBTQ+ literary criticism
related: Demisexual authors
has top concept: LGBTQ+ literary criticism
issued: 2023-03-28
modified: 2025-02-23
type: Concept
in scheme: v3
change note: Version 4.1.0

Megasexual erotic literature
preferred label: Literatura erótica megasexual @es
comment: Literary works with erotic or sexual elements; use in reference to erotic literature focusing on megasexual characters or themes.
comment: Obras literarias con elementos eróticos o sexuales; utilícese en referencia a la literatura erótica que se centra en personajes o temas megasexuales. @es
broader: LGBTQ+ erotic literature
has top concept: Erotica
issued: 2023-03-29
modified: 2025-02-23
type: Concept
in scheme: v3
change note: Version 4.1.0

Megasexual fantasy fiction
preferred label: Ficción fantástica megasexual @es
comment: Written works that include magical or fantastical elements; use in reference to fantasy fiction focusing on megasexual characters or themes.
comment: Obras escritas que incluyan elementos mágicos o fantásticos; utilícese en referencia a la ficción fantástica centrada en personajes o temas megasexuales. @es
broader: LGBTQ+ fantasy fiction
has top concept: Subcultures
issued: 2023-03-29
modified: 2025-02-23
type: Concept
in scheme: v3
change note: Version 4.1.0

Megasexual horror fiction
preferred label: Ficción de horror megasexual @es
comment: Written works of fiction intended to frighten, scare, or disgust; use in reference to horror fiction focusing on megasexual characters or themes.
comment: Obras de ficción escritas con la intención de asustar, atemorizar o provocar disgusto; utilícese en referencia a la ficción de horror centrada en personajes o temas megasexuales. @es
broader: LGBTQ+ horror fiction
has top concept: Subcultures
issued: 2023-03-29
modified: 2025-02-23
type: Concept
in scheme: v3
change note: Version 4.1.0

Megasexual mystery and detective fiction
preferred label: Ficción megasexual de misterio y de detetectives @es
comment: Written literary works about the investigation of crime or the work of detectives; use in reference to mystery and detective fiction focusing on megasexual characters or themes.
comment: Obras literarias escritas sobre la investigación de crímenes o el trabajo de detectives; utilícese en referencia a la ficción de misterio y de detectives centrada en personajes y temas megasexuales. @es
broader: LGBTQ+ mystery and detective fiction
has top concept: Subcultures
issued: 2023-03-29
modified: 2025-02-23
type: Concept
in scheme: v3
change note: Version 4.1.0

Megasexual romance fiction
preferred label: Ficción romántica megasexual @es
comment: Written literary work focusing on romantic relationships and love between people; use in reference to romance fiction focusing on megasexual characters or themes.
comment: Obras literarias escritas centradas en las relaciones románticas y el amor entre personas; utilícese en referencia a la ficción romántica centrada en personajes o temas megasexuales. @es
broader: LGBTQ+ romance fiction
has top concept: Subcultures
issued: 2023-03-29
modified: 2025-02-23
type: Concept
in scheme: v3
change note: Version 4.1.0

Megasexual science fiction
preferred label: Ciencia ficción megasexual @es
comment: Written literary works about imaginative or futuristic concepts incorporating science, technology, space, time travel, and other speculative elements; use in reference to science fiction focusing on megasexual characters or themes.
comment: Obras literarias escritas sobre conceptos imaginativos o futuristas que incorporen la ciencia, la tecnología, el espacio, los viajes en el tiempo y otros elementos especulativos; utilícese en referencia a la ciencia ficción centrada en personajes o temas megasexuales. @es
broader: LGBTQ+ science fiction
has top concept: Subcultures
issued: 2023-03-29
modified: 2025-02-23
type: Concept
in scheme: v3
change note: Version 4.1.0

Megasexual short stories
preferred label: Cuentos cortos megasexuales @es
alternative label: Relatos megasexuales @es
comment: Written literary works that are short in length and detail a self-contained incident or concept; use in reference to short stories focusing on megasexual characters or themes.
comment: Obras literarias escritas que son breves y detallan un incidente o concepto autónomo; utilícese en referencia a cuentos cortos que se centren en personajes o temas megasexuales. @es
broader: LGBTQ+ short stories
has top concept: Subcultures
issued: 2023-03-29
modified: 2025-02-23
type: Concept
in scheme: v3
change note: Version 4.1.0

Megasexual drama
preferred label: Drama megasexual @es
comment: Works of fiction written to be performed; use in reference to dramatic works focusing on megasexual characters or themes.
comment: Obras de ficción escritas para ser puestas en escena; utilícese en referencia a obras dramáticas que se centran en personajes o temas megasexuales. @es
broader: LGBTQ+ drama
related: Megasexual theater
related: Megasexual literature
has top concept: Subcultures
issued: 2023-03-29
modified: 2025-02-23
type: Concept
in scheme: v3
change note: Version 4.1.0

Megasexual theater
preferred label: Teatro megasexual @es
comment: Works in the performance arts that focus on megasexual characters, communities, or issues.
comment: Trabajos en las artes escénicas que se centran en personajes, comunidades o temas megasexuales. @es
broader: LGBTQ+ theater
related: Megasexual drama
has top concept: LGBTQ+ theater
issued: 2023-03-29
modified: 2025-02-23
type: Concept
in scheme: v3
change note: Version 4.1.0

Megasexual comics
preferred label: Cómics megasexuales @es
alternative label: Historietas megasexuales @es
comment: Works consisting of sequential images often accompanied by text; use in reference to comics focusing on megasexual characters or themes.
comment: Obras que consisten en imágenes secuenciales, a menudo acompañadas de texto; utilícese en referencia a cómics que se centran en personajes o temas megasexuales. @es
broader: LGBTQ+ comics
has top concept: Subcultures
issued: 2023-03-29
modified: 2025-02-23
type: Concept
in scheme: v3
change note: Version 4.1.0

Megasexual history
preferred label: Historia megasexual @es
comment: Past events or accounts of the past concerning megasexual people, or people who might be perceived as megasexual if they were alive today.
comment: Eventos pasados ​​o relatos del pasado relacionados con personas megasexuales, o personas que podrían ser percibidas como megasexuales si estuvieran vivas hoy. @es
broader: LGBTQ+ history
has top concept: LGBTQ+ history
issued: 2023-03-29
modified: 2025-02-23
type: Concept
in scheme: v3
change note: Version 4.1.0

Megasexual authors
preferred label: Autores megasexuales @es
comment: Megasexual creators of written works.
comment: Creadores de obras escritas conocidos por ser megasexuales. @es
broader: LGBTQ+ authors
related: Megasexual fiction
related: Megasexual literature
related: Megasexual poetry
related: Megasexual autobiographies
related: Megasexual biographies
related: Megasexual literary criticism
related: Megasexual people's writings
has top concept: LGBTQ+ people
issued: 2023-04-11
modified: 2025-03-13
type: Concept
in scheme: v3
change note: Version 4.1.0

Megasexual fiction
preferred label: Ficción megasexual @es
comment: Written works describing imagined events or people; use in reference to fictional works focusing on megasexual characters or themes.
comment: Obras escritas que describen eventos o personas imaginadas; utilícese en referencia a obras de ficción que se centran en personajes o temas megasexuales. @es
broader: LGBTQ+ fiction
related: Bisexual literature
related: Bisexual people in fandom
related: Megasexual authors
related: Megasexual literature
related: Megasexual poetry
has top concept: Subcultures
issued: 2023-04-11
modified: 2025-02-23
type: Concept
in scheme: v3
change note: Version 4.1.0

Megasexual literature
preferred label: Literatura megasexual @es
comment: Written literary works about megasexuality, megasexual characters, or megasexual themes.
comment: Obras literarias escritas sobre la megasexualidad, personajes megasexuales o temas megasexuales. @es
broader: LGBTQ+ literature
related: Megasexual drama
related: Megasexual authors
related: Megasexual fiction
related: Megasexual poetry
has top concept: Subcultures
issued: 2023-04-11
modified: 2025-02-23
type: Concept
in scheme: v3
change note: Version 4.1.0

Megasexual poetry
preferred label: Poesía megasexual @es
comment: Literary works, typically written in verse, that focus on megasexual characters, themes, or identity.
comment: Obras literarias, normalmente escritas en verso, que se centran en personajes, temas o identidades megasexuales. @es
broader: LGBTQ+ poetry
related: Megasexual authors
related: Megasexual fiction
related: Megasexual literature
has top concept: Subcultures
issued: 2023-04-11
modified: 2025-02-23
type: Concept
in scheme: v3
change note: Version 4.1.0

Megasexual youth
preferred label: Juventud megasexual @es
alternative label: Adolescentes megasexuales @es
comment: Megasexual people between the ages of childhood and adulthood.
comment: Personas megasexuales entre las edades de la niñez y la edad adulta. @es
broader: LGBTQ+ youth
related: Megasexual youth literature
has top concept: Youth
issued: 2023-04-11
modified: 2025-02-23
type: Concept
in scheme: v3
change note: Version 4.1.0

Megasexual youth literature
preferred label: Literatura juvenil megasexual @es
comment: Written literary works for an audience of readers from 12-18 years of age, also known as young adult literature or YA; use in reference to youth literature focusing on megasexual characters or themes.
comment: Obras literarias escritas para una audiencia de lectores de 12 a 18 años de edad, también conocidas como literatura para adultos jóvenes o YA (por sus siglas en inglés); utilícese en referencia a la literatura juvenil que se centra en personajes o temas megasexuales. @es
broader: LGBTQ+ youth literature
related: Megasexual youth
has top concept: Subcultures
issued: 2023-04-11
modified: 2025-02-23
type: Concept
in scheme: v3
change note: Version 4.1.0

Megasexual autobiographies
preferred label: Autobiografías megasexuales @es
alternative label: Memorias megasexuales @es
comment: Accounts of megasexual peoples' lives written by those people. For written accounts of megasexual people's lives that were not written by the subject, use "Megasexual biographies."
comment: Relatos de vida de personas escritos por esas mismas personas; utilícese para autobiografías escritas por autores megasexuales. @es
broader: LGBTQ+ autobiographies
related: Megasexual authors
related: Megasexual biographies
has top concept: LGBTQ+ autobiographies
issued: 2023-04-11
modified: 2025-02-23
type: Concept
in scheme: v3
change note: Version 4.1.0

Megasexual biographies
preferred label: Biografías megasexual @es
comment: Written accounts of the lives of megasexual people. For written accounts of megasexual people's lives written by the subject, use "Megasexual autobiographies."
comment: Relatos escritos de la vida de personas conocidas por ser megasexuales. @es
broader: LGBTQ+ biographies
related: Megasexual authors
related: Megasexual autobiographies
has top concept: LGBTQ+ biographies
issued: 2023-04-11
modified: 2025-02-23
type: Concept
in scheme: v3
change note: Version 4.1.0

Megasexual literary criticism
preferred label: Crítica literaria megasexual @es
comment: The study, evaluation, and interpretation of literary works focusing on megasexual characters or themes; can also include interpretation of literature through the lens and frameworks of megasexual studies.
comment: El estudio, la evaluación y la interpretación de obras literarias centradas en personajes o temas megasexuales; también puede incluir la interpretación de la literatura a través del lente y los marcos teóricos de los estudios megasexuales. @es
broader: LGBTQ+ literary criticism
related: Megasexual authors
has top concept: LGBTQ+ literary criticism
issued: 2023-04-11
modified: 2025-02-23
type: Concept
in scheme: v3
change note: Version 4.1.0

Romantic relationships
preferred label: Relaciones románticas @es
comment: Ongoing connections between two or more individuals involving romantic behaviors or activities.
comment: Conexiones continuas entre dos o más personas que involucran comportamientos o actividades románticas. @es
broader: Relationship satisfaction
has top concept: Relationship satisfaction
issued: 2023-04-11
modified: 2025-02-23
type: Concept
in scheme: v3
change note: Version 4.1.0

Greyromantic erotic literature
preferred label: Literatura erótica grisromántica @es
comment: Literary works with erotic or sexual elements; use in reference to erotic literature focusing on greyromantic erotic literature characters or themes.
comment: Obras literarias con elementos eróticos o sexuales; utilícese en referencia a la literatura erótica que se centra en personajes o temas grisrománticos. @es
broader: LGBTQ+ erotic literature
has top concept: Erotica
issued: 2023-04-11
modified: 2025-02-23
type: Concept
in scheme: v3
change note: Version 4.1.0

Greyromantic fantasy fiction
preferred label: Ficción fantástica grisromántica @es
comment: Written works that include magical or fantastical elements; use in reference to fantasy fiction focusing on greyromantic characters or themes.
comment: Obras escritas que incluyan elementos mágicos o fantásticos; utilícese en referencia a la ficción fantástica centrada en personajes o temas grisrománticos. @es
broader: LGBTQ+ fantasy fiction
has top concept: Subcultures
issued: 2023-04-11
modified: 2025-02-23
type: Concept
in scheme: v3
change note: Version 4.1.0

Greyromantic horror fiction
preferred label: Ficción de horror grisromántica @es
comment: Written works of fiction intended to frighten, scare, or disgust; use in reference to horror fiction focusing on greyromantic characters or themes.
comment: Obras de ficción escritas con la intención de asustar, atemorizar o provocar disgusto; utilícese en referencia a la ficción de horror centrada en personajes o temas grisrománticos. @es
broader: LGBTQ+ horror fiction
has top concept: Subcultures
issued: 2023-04-11
modified: 2025-02-23
type: Concept
in scheme: v3
change note: Version 4.1.0

Greyromantic mystery and detective fiction
preferred label: Ficción grisromántica de misterio y de detectives @es
comment: Written literary works about the investigation of crime or the work of detectives; use in reference to mystery and detective fiction focusing on greyromantic characters or themes.
comment: Obras literarias escritas sobre la investigación de crímenes o el trabajo de detectives; utilícese en referencia a la ficción de misterio y de detectives centrada en personajes y temas grisrománticos. @es
broader: LGBTQ+ mystery and detective fiction
has top concept: Subcultures
issued: 2023-04-11
modified: 2025-02-23
type: Concept
in scheme: v3
change note: Version 4.1.0

Greyromantic romance fiction
preferred label: Ficción romántica grisromántica @es
comment: Written literary work focusing on romantic relationships and love between people; use in reference to romance fiction focusing on greyromantic characters or themes.
comment: Obras literarias escritas centradas en las relaciones románticas y el amor entre personas; utilícese en referencia a la ficción romántica centrada en personajes o temas grisrománticos. @es
broader: LGBTQ+ romance fiction
has top concept: Subcultures
issued: 2023-04-11
modified: 2025-02-23
type: Concept
in scheme: v3
change note: Version 4.1.0

Greyromantic science fiction
preferred label: Ciencia ficción grisromántica @es
comment: Written literary works about imaginative or futuristic concepts incorporating science, technology, space, time travel, and other speculative elements; use in reference to science fiction focusing on greyromantic characters or themes.
comment: Obras literarias escritas sobre conceptos imaginativos o futuristas que incorporan la ciencia, la tecnología, el espacio, los viajes en el tiempo y otros elementos especulativos; utilícese en referencia a la ciencia ficción centrada en personajes o temas grisrománticos. @es
broader: LGBTQ+ science fiction
has top concept: Subcultures
issued: 2023-04-11
modified: 2025-02-23
type: Concept
in scheme: v3
change note: Version 4.1.0

Greyromantic short stories
preferred label: Cuentos cortos grisrománticos @es
alternative label: Relatos grisrománticos @es
comment: Written literary works that are short in length and detail a self-contained incident or concept; use in reference to short stories focusing on greyromantic characters or themes.
comment: Obras literarias escritas que son breves y detallan un incidente o concepto autónomo; utilícese en referencia a historias cortas que se centren en personajes o temas grisrománticos. @es
broader: LGBTQ+ short stories
has top concept: Subcultures
issued: 2023-04-11
modified: 2025-02-23
type: Concept
in scheme: v3
change note: Version 4.1.0

Greyromantic drama
preferred label: Drama grisromántico @es
comment: Works of fiction written to be performed; use in reference to dramatic works focusing on greyromantic characters or themes.
comment: Obras de ficción escritas para ser puestas en escena; utilícese en referencia a obras dramáticas que se centran en personajes o temas grisrománticos. @es
broader: LGBTQ+ drama
related: Greyromantic theater
related: Greyromantic literature
has top concept: Subcultures
issued: 2023-04-11
modified: 2025-02-23
type: Concept
in scheme: v3
change note: Version 4.1.0

Greyromantic theater
preferred label: Teatro grisromántico @es
comment: Works in the performance arts that focus on greyromantic characters, communities, or issues.
comment: Obras de artes escénicas centradas en personajes, comunidades o temas grisrománticos. @es
broader: LGBTQ+ theater
related: Greyromantic drama
has top concept: LGBTQ+ theater
issued: 2023-04-11
modified: 2025-02-23
type: Concept
in scheme: v3
change note: Version 4.1.0

Greyromantic comics
preferred label: Cómics grisrománticos @es
alternative label: Historietas grisrománticas @es
comment: Works consisting of sequential images often accompanied by text; use in reference to comics focusing on greyromantic characters or themes.
comment: Obras que consisten en imágenes secuenciales, a menudo acompañadas de texto; utilícese en referencia a cómics que se centran en personajes o temas grisrománticos. @es
broader: LGBTQ+ comics
has top concept: Subcultures
issued: 2023-04-11
modified: 2025-02-23
type: Concept
in scheme: v3
change note: Version 4.1.0

Greyromantic history
preferred label: Historia grisromántica @es
comment: Past events or accounts of the past concerning greyromantic people, or people who might be perceived as greyromantic if they were alive today.
comment: Eventos pasados ​​o relatos del pasado relacionados con personas grisrománticas, o personas que podrían ser percibidas como grisrománticas si estuvieran vivas hoy. @es
broader: LGBTQ+ history
has top concept: LGBTQ+ history
issued: 2023-04-11
modified: 2025-02-23
type: Concept
in scheme: v3
change note: Version 4.1.0

Armenian LGBTQ+ people
preferred label: Personas LGBTQ+ armenias @es
alternative label: LGBTQ+ Armenians
alternative label: Armenios LGBTQ+ @es
alternative label: Armenios LGBTQ @es
alternative label: Armenias LGBTQ+ @es
alternative label: Armenias LGBTQ @es
comment: LGBTQ+ people who are ethnically Armenian.
comment: Personas LGBTQ+ de etnia armenia. @es
broader: LGBTQ+ people of shared ethnic or national identities
narrower: Armenian gay men
narrower: Armenian lesbians
narrower: Armenian bisexual people
narrower: Armenian queer people
narrower: Armenian transgender people
narrower: Armenian intersex people
narrower: Armenian asexual people
has top concept: LGBTQ+ people
issued: 2023-04-11
modified: 2025-02-23
type: Concept
in scheme: v3
change note: Version 4.1.0

Armenian gay men
preferred label: Hombres gay armenios @es
alternative label: Gay Armenians
alternative label: Armenios gay @es
comment: Gay men who are ethnically Armenian.
comment: Hombres gay de etnia armenia. @es
broader: Armenian LGBTQ+ people
has top concept: LGBTQ+ people
issued: 2023-04-11
modified: 2025-02-23
type: Concept
in scheme: v3
change note: Version 4.1.0

Armenian lesbians
preferred label: Lesbianas armenias @es
alternative label: Lesbian Armenians
alternative label: Armenias lesbianas @es
comment: Lesbians who are ethnically Armenian.
comment: Lesbianas de etnia armenia. @es
broader: Armenian LGBTQ+ people
has top concept: LGBTQ+ people
issued: 2023-04-11
modified: 2025-02-23
type: Concept
in scheme: v3
change note: Version 4.1.0

Armenian bisexual people
preferred label: Personas bisexuales armenias @es
alternative label: Bisexual Armenians
alternative label: Armenios bisexuales @es
alternative label: Armenias bisexuales @es
comment: Bisexual people who are ethnically Armenian.
comment: Personas bisexuales de etnia armenia. @es
broader: Armenian LGBTQ+ people
has top concept: LGBTQ+ people
issued: 2023-04-11
modified: 2025-02-23
type: Concept
in scheme: v3
change note: Version 4.1.0

Armenian queer people
preferred label: Personas queer armenias @es
alternative label: Queer Armenians
alternative label: Armenios queer @es
alternative label: Armenias queer @es
comment: Queer people who are ethnically Armenian.
comment: Personas queer de etnia armenia. @es
broader: Armenian LGBTQ+ people
has top concept: LGBTQ+ people
issued: 2023-04-11
modified: 2025-02-23
type: Concept
in scheme: v3
change note: Version 4.1.0

Armenian transgender people
preferred label: Personas transgénero armenias @es
alternative label: Transgender Armenians
alternative label: Armenios transgénero @es
alternative label: Armenias transgénero @es
comment: Transgender people who are ethnically Armenian.
comment: Personas transgénero de etnia armenia @es
broader: Armenian LGBTQ+ people
has top concept: LGBTQ+ people
issued: 2023-04-11
modified: 2025-02-23
type: Concept
in scheme: v3
change note: Version 4.1.0

Armenian intersex people
preferred label: Personas intersexuales armenias @es
alternative label: Intersex Armenians
alternative label: Armenios intersex @es
alternative label: Armenias intersex @es
alternative label: Personas intersex armenias @es
comment: Intersex people who are ethnically Armenian.
comment: Personas intersexuales de etnia armenia. @es
broader: Armenian LGBTQ+ people
has top concept: LGBTQ+ people
issued: 2023-04-11
modified: 2025-02-23
type: Concept
in scheme: v3
change note: Version 4.1.0

Armenian asexual people
preferred label: Personas asexuales armenias @es
alternative label: Asexual Armenians
alternative label: Armenios asexuales @es
alternative label: Armenias asexuales @es
comment: Asexual people who are ethnically Armenian.
comment: Personas asexuales de etnia armenia. @es
broader: Armenian LGBTQ+ people
has top concept: LGBTQ+ people
issued: 2023-04-11
modified: 2025-02-23
type: Concept
in scheme: v3
change note: Version 4.1.0

Greyromantic authors
preferred label: Autores grisrománticos @es
comment: Greyromantic creators of written works.
comment: Creadores de obras escritas conocidos por ser grisrománticos. @es
broader: LGBTQ+ authors
related: Greyromantic fiction
related: Greyromantic poetry
related: Greyromantic literature
related: Greyromantic autobiographies
related: Greyromantic biographies
related: Greyromantic literary criticism
related: Greyromantic people's writings
has top concept: LGBTQ+ people
issued: 2023-04-11
modified: 2025-03-13
type: Concept
in scheme: v3
change note: Version 4.1.0

Greyromantic fiction
preferred label: Ficción grisromántica @es
comment: Written works describing imagined events or people; use in reference to fictional works focusing on greyromantic characters or themes.
comment: Obras escritas que describen eventos o personas imaginadas; utilícese en referencia a obras de ficción que se centran en personajes o temas grisrománticos. @es
broader: LGBTQ+ fiction
related: Bisexual characters
related: Bisexual fiction
related: Bisexual literature
related: Intersex fiction
related: Asexual fiction
related: Bisexual people in fandom
related: Greyromantic authors
related: Greyromantic literature
has top concept: Subcultures
issued: 2023-04-11
modified: 2025-02-23
type: Concept
in scheme: v3
change note: Version 4.1.0

Greyromantic poetry
preferred label: Poesía grisromántica @es
comment: Literary works, typically written in verse, that focus on greyromantic characters, themes, or identity.
comment: Obras literarias, normalmente escritas en verso, que se centran en personajes, temas o identidades grisrománticos. @es
broader: LGBTQ+ poetry
related: Greyromantic authors
related: Greyromantic literature
has top concept: Subcultures
issued: 2023-04-11
modified: 2025-02-23
type: Concept
in scheme: v3
change note: Version 4.1.0

Greyromantic literature
preferred label: Literatura grisromántica @es
comment: Written literary works about greyromanticism, greyromantic characters, or greyromantic themes.
comment: Obras literarias escritas sobre el grisromanticismo, personajes grisrománticos o temas grisrománticos. @es
broader: LGBTQ+ literature
related: Greyromantic drama
related: Greyromantic authors
related: Greyromantic fiction
related: Greyromantic poetry
has top concept: Subcultures
issued: 2023-04-11
modified: 2025-02-23
type: Concept
in scheme: v3
change note: Version 4.1.0

Greyromantic youth
preferred label: Juventud grisromántica @es
comment: Greyromantic people between the ages of childhood and adulthood.
comment: Personas grisrománticas entre las edades de la infancia y la edad adulta. @es
broader: LGBTQ+ youth
related: Greyromantic youth literature
has top concept: Youth
issued: 2023-04-11
modified: 2025-02-23
type: Concept
in scheme: v3
change note: Version 4.1.0

Greyromantic youth literature
preferred label: Literatura juvenil grisromántica @es
comment: Written literary works for an audience of readers from 12-18 years of age, also known as young adult literature or YA; use in reference to youth literature focusing on greyromantic characters or themes.
comment: Obras literarias escritas para un público de lectores de 12 a 18 años de edad, también conocidas como literatura para jóvenes adultos o YA (por sus siglas en inglés); utilícese en referencia a la literatura juvenil centrada en personajes o temas grisrománticos. @es
broader: LGBTQ+ youth literature
related: Greyromantic youth
has top concept: Subcultures
issued: 2023-04-11
modified: 2025-02-23
type: Concept
in scheme: v3
change note: Version 4.1.0

Greyromantic autobiographies
preferred label: Autobiografías grisrománticas @es
alternative label: Memorias grisrománticas @es
comment: Accounts of greyromantic peoples' lives written by those people. For written accounts of greyromantic people's lives that were not written by the subject, use "Greyromantic biographies."
comment: Relatos de vida de personas escritos por esas mismas personas; utilícese para autobiografías escritas por autores grisrománticos. @es
broader: LGBTQ+ autobiographies
related: Greyromantic authors
related: Greyromantic biographies
has top concept: LGBTQ+ autobiographies
issued: 2023-04-11
modified: 2025-02-23
type: Concept
in scheme: v3
change note: Version 4.1.0

Greyromantic biographies
preferred label: Biografías grisrománticas @es
comment: Written accounts of the lives of greyromantic people. For written accounts of greyromantic people's lives written by the subject, use "Greyromantic autobiographies."
comment: Relatos escritos de la vida de personas conocidas por ser grisrománticas. @es
broader: LGBTQ+ biographies
related: Greyromantic authors
related: Greyromantic autobiographies
has top concept: LGBTQ+ biographies
issued: 2023-04-11
modified: 2025-02-23
type: Concept
in scheme: v3
change note: Version 4.1.0

Greyromantic literary criticism
preferred label: Crítica literaria grisromántica @es
comment: The study, evaluation, and interpretation of literary works focusing on greyromantic characters or themes; can also include interpretation of literature through the lens and frameworks of greyromantic studies.
comment: El estudio, la evaluación y la interpretación de obras literarias centradas en personajes o temas grisrománticos; también puede incluir la interpretación de la literatura a través del lente y los marcos teóricos de los estudios grisrománticos. @es
broader: LGBTQ+ literary criticism
related: Lesbian literary criticism
related: Gay literary criticism
related: Bisexual literary criticism
related: Transgender literary criticism
related: Queer literary criticism
related: Greyromantic authors
has top concept: LGBTQ+ literary criticism
issued: 2023-04-11
modified: 2025-02-23
type: Concept
in scheme: v3
change note: Version 4.1.0

LGBTQ+ erotic films
preferred label: Películas eróticas LGBTQ+ @es
comment: Erotic films or movies, created by LGBTQ+ directors, depicting LGBTQ+ people, or that are regarded as important within LGBTQ+ culture. Use a more specific narrower term where applicable.
comment: Filmes o películas eróticas, creadas por directores LGBTQ+, que representan a personas LGBTQ+ o a personas consideradas importantes dentro de la cultura LGBTQ+.Utilicese un término más específico y restringido cuando corresponda. @es
broader: LGBTQ+ films
narrower: Lesbian erotic films
narrower: Gay erotic films
narrower: Bisexual erotic films
narrower: Transgender erotic films
narrower: Queer erotic films
narrower: Intersex erotic films
narrower: Aromantic erotic films
narrower: Asexual erotic films
narrower: Demisexual erotic films
related: LGBTQ+ porn films
related: Two-Spirit erotic films
related: LGBTQ+ erotic art
has top concept: Subcultures
issued: 2023-04-12
modified: 2025-02-23
type: Concept
in scheme: v3
change note: Version 4.1.0

Two-Spirit erotic films
preferred label: Películas eróticas dos espíritus @es
alternative label: 2S erotic films
alternative label: Two Spirit erotic films
alternative label: Two Spirited erotic films
alternative label: Two-Spirited erotic films
comment: Erotic films or movies, created by Two-Spirit directors, depicting Two-Spirit people, or that are regarded as important within Two-Spirit culture.
comment: Filmes o películas eróticas, creadas por directores dos espíritus, que representan a personas dos espíritus o a personas consideradas importantes dentro de la cultura dos espíritus. @es
broader: Two-Spirit films
narrower: Two-Spirit porn films
related: LGBTQ+ erotic films
has top concept: Two-Spirit films
issued: 2023-04-12
modified: 2025-02-23
type: Concept
in scheme: v3
change note: Version 4.1.0

Lesbian erotic films
preferred label: Películas eróticas lésbicas @es
comment: Erotic films or movies, created by lesbian directors, depicting lesbian people, or that are regarded as important within lesbian culture.
comment: Filmes o películas eróticas, creadas por directoras lesbianas, que representan a lesbianas o a personas consideradas importantes dentro de la cultura lésbica. @es
broader: LGBTQ+ erotic films
broader: Lesbian erotic art
related: Lesbian porn films
has top concept: Subcultures
issued: 2023-04-12
modified: 2025-02-23
type: Concept
in scheme: v3
change note: Version 4.1.0

Gay erotic films
preferred label: Películas eróticas gay @es
comment: Erotic films or movies, created by gay directors, depicting gay people, or that are regarded as important within gay culture.
comment: Filmes o películas eróticas, creadas por directores gay, que representan a hombres gay o a personas consideradas importantes dentro de la cultura gay. @es
broader: LGBTQ+ erotic films
broader: Gay erotic art
related: Gay porn films
has top concept: Subcultures
issued: 2023-04-12
modified: 2025-02-23
type: Concept
in scheme: v3
change note: Version 4.1.0

Bisexual erotic films
preferred label: Arte erótico bisexual @es
comment: Erotic films or movies, created by bisexual directors, depicting bisexual people, or that are regarded as important within bisexual culture.
comment: Arte erótico, creado por artistas bisexuales, que representa a personas bisexuales o a personas consideradas importantes dentro de la cultura bisexual. @es
broader: LGBTQ+ erotic films
broader: Bisexual erotic art
related: Bisexual porn films
has top concept: Subcultures
issued: 2023-04-12
modified: 2025-02-23
type: Concept
in scheme: v3
change note: Version 4.1.0

Transgender erotic films
preferred label: Películas eróticas transgénero @es
comment: Erotic films or movies, created by transgender directors, depicting transgender people, or that are regarded as important within transgender culture.
comment: Filmes o películas eróticas, creadas por directores transgénero, que representan a personas transgénero o a personas consideradas importantes dentro de la cultura transgénero. @es
broader: LGBTQ+ erotic films
broader: Transgender erotic art
related: Transgender porn films
has top concept: Subcultures
issued: 2023-04-12
modified: 2025-02-23
type: Concept
in scheme: v3
change note: Version 4.1.0

Queer erotic films
preferred label: Películas eróticas queer @es
comment: Erotic films or movies, created by queer directors, depicting queer people, or that are regarded as important within queer culture.
comment: Filmes o películas eróticas, creadas por directores queer, que representan a personas queer o a personas consideradas importantes dentro de la cultura queer. @es
broader: LGBTQ+ erotic films
broader: Queer erotic art
related: Queer porn films
has top concept: Subcultures
issued: 2023-04-12
modified: 2025-02-23
type: Concept
in scheme: v3
change note: Version 4.1.0

Intersex erotic films
preferred label: Películas eróticas intersex @es
comment: Erotic films or movies, created by intersex directors, depicting intersex people, or that are regarded as important within intersex culture.
comment: Filmes o películas eróticas, creadas por directores intersex, que representan a personas intersex o a personas consideradas importantes dentro de la cultura intersex. @es
broader: LGBTQ+ erotic films
broader: Intersex erotic art
related: Intersex porn films
has top concept: Subcultures
issued: 2023-04-12
modified: 2025-02-23
type: Concept
in scheme: v3
change note: Version 4.1.0

Aromantic erotic films
preferred label: Películas eróticas arrománticas @es
comment: Erotic films or movies, created by aromantic directors, depicting aromantic people, or that are regarded as important within aromantic culture.
comment: Filmes o películas eróticas, creadas por directores arrománticos, que representan a personas arrománticas o a personas consideradas importantes dentro de la cultura arromántica. @es
broader: LGBTQ+ erotic films
broader: Aromantic erotic art
related: Aromantic porn films
has top concept: Subcultures
issued: 2023-04-12
modified: 2025-02-23
type: Concept
in scheme: v3
change note: Version 4.1.0

Asexual erotic films
preferred label: Películas eróticas asexuales @es
comment: Erotic films or movies, created by asexual directors, depicting asexual people, or that are regarded as important within asexual culture.
comment: Filmes o películas eróticas, creadas por directores asexuales, que representan a personas asexuales o a personas consideradas importantes dentro de la cultura asexual. @es
broader: LGBTQ+ erotic films
broader: Asexual erotic art
related: Asexual porn films
has top concept: Subcultures
issued: 2023-04-12
modified: 2025-02-23
type: Concept
in scheme: v3
change note: Version 4.1.0

Demisexual erotic films
preferred label: Películas eróticas demisexuales @es
comment: Erotic films or movies, created by demisexual directors, depicting demisexual people, or that are regarded as important within demisexual culture.
comment: Filmes o películas eróticas, creadas por directores demisexuales, que representan a personas demisexuales o a personas consideradas importantes dentro de la cultura demisexual. @es
broader: LGBTQ+ erotic films
broader: Demisexual erotic art
related: Demisexual porn films
has top concept: Subcultures
issued: 2023-04-12
modified: 2025-02-23
type: Concept
in scheme: v3
change note: Version 4.1.0

Two-Spirit porn films
preferred label: Películas porno dos espíritus @es
alternative label: 2S porn films
alternative label: Two Spirit porn films
alternative label: Two spirited porn films
alternative label: Películas pornográficas dos espíritus @es
comment: Erotic or sexually explicit films featuring Two-Spirit people.
comment: Películas eróticas o sexualmente explícitas protagonizadas por personas dos espíritus. @es
broader: Two-Spirit erotic films
related: LGBTQ+ porn films
has top concept: Two-Spirit films
issued: 2023-04-12
modified: 2025-02-23
type: Concept
in scheme: v3
change note: Version 4.1.0

Intersex porn films
preferred label: Películas pornográficas intersex @es
comment: Erotic or sexually explicit films featuring intersex people.
comment: Películas eróticas o sexualmente explícitas protagonizadas por personas intersex. @es
broader: Intersex erotic art
related: Intersex erotic films
has top concept: Subcultures
issued: 2023-04-12
modified: 2025-02-23
type: Concept
in scheme: v3
change note: Version 4.1.0

Aromantic porn films
preferred label: Películas pornográficas arrománticas @es
comment: Erotic or sexually explicit films featuring aromantic people.
comment: Películas eróticas o sexualmente explícitas protagonizadas por personas arrománticas. @es
broader: Aromantic erotic art
related: Aromantic erotic films
has top concept: Subcultures
issued: 2023-04-12
modified: 2025-02-23
type: Concept
in scheme: v3
change note: Version 4.1.0

Asexual porn films
preferred label: Películas pornográficas asexuales @es
comment: Erotic or sexually explicit films featuring asexual people.
comment: Películas eróticas o sexualmente explícitas protagonizadas por personas asexuales. @es
broader: Asexual erotic art
related: Asexual erotic films
has top concept: Subcultures
issued: 2023-04-12
modified: 2025-02-23
type: Concept
in scheme: v3
change note: Version 4.1.0

Demisexual porn films
preferred label: Pornografía demisexual @es
comment: Erotic or sexually explicit films featuring demisexual people.
comment: Películas eróticas o sexualmente explícitas protagonizadas por personas demisexuales. @es
broader: LGBTQ+ porn films
broader: Demisexual erotic art
related: Demisexual erotic films
has top concept: Subcultures
issued: 2023-04-12
modified: 2025-02-23
type: Concept
in scheme: v3
change note: Version 4.1.0

Two-Spirit films
preferred label: Películas dos espíritus @es
alternative label: 2S films
alternative label: Two Spirit films
alternative label: Two Spirited films
alternative label: Two-Spirited films
comment: Motion pictures, or movies, created by Two-Spirit directors, depicting Two-Spirit people, or that are regarded as important within Two-Spirit culture.
comment: Películas o filmes creados por directores dos espíritus, que representan a personas dos espíritus o que se consideran importantes dentro de la cultura dos espíritus. @es
narrower: Two-Spirit erotic films
narrower: Two-Spirit documentaries
related: LGBTQ+ films
issued: 2023-04-12
modified: 2025-02-23
type: Concept
in scheme: v3
change note: Version 4.1.0

Intersex films
preferred label: Películas intersex @es
comment: Motion pictures, or movies, created by intersex directors, depicting intersex people, or that are regarded as important within intersex culture.
comment: Películas creadas por directores intersex, que representen a personas intersex, o personas consideradas importantes dentro de la cultura intersex. @es
broader: LGBTQ+ films
has top concept: Subcultures
issued: 2023-04-12
modified: 2025-02-23
type: Concept
in scheme: v3
change note: Version 4.1.0

Aromantic films
preferred label: Películas arrománticas @es
comment: Motion pictures, or movies, created by aromantic directors, depicting aromantic people, or that are regarded as important within aromantic culture.
comment: Películas o películas creadas por directores arrománticos, que representan a personas arrománticas o que se consideran importantes dentro de la cultura arromántica. @es
broader: LGBTQ+ films
has top concept: Subcultures
issued: 2023-04-12
modified: 2025-02-23
type: Concept
in scheme: v3
change note: Version 4.1.0

Asexual films
preferred label: Películas asexuales @es
comment: Motion pictures, or movies, created by asexual directors, depicting asexual people, or that are regarded as important within asexual culture.
comment: Películas o filmes creados por directores asexuales, que representan a personas asexuales o que se consideran importantes dentro de la cultura asexual. @es
broader: LGBTQ+ films
has top concept: Subcultures
issued: 2023-04-12
modified: 2025-02-23
type: Concept
in scheme: v3
change note: Version 4.1.0

Demisexual films
preferred label: Películas demisexuales @es
comment: Motion pictures, or movies, created by demisexual directors, depicting demisexual people, or that are regarded as important within demisexual culture.
comment: Películas creadas por directores demisexuales, que representan a personas demisexuales o a personas consideradas importantes dentro de la cultura demisexual. @es
broader: LGBTQ+ films
has top concept: Subcultures
issued: 2023-04-12
modified: 2025-02-23
type: Concept
in scheme: v3
change note: Version 4.1.0

Non-binary fiction
preferred label: Ficción no binaria @es
comment: Written works describing imagined events or people; use in reference to fictional works focusing on non-binary characters or themes.
comment: Obras escritas que describen eventos o personas imaginadas; utilícese en referencia a obras de ficción que se centran en personajes o temas no binarios. @es
broader: LGBTQ+ fiction
narrower: Non-binary romance fiction
narrower: Non-binary mystery and detective fiction
narrower: Non-binary horror fiction
narrower: Non-binary science fiction
narrower: Non-binary fantasy fiction
has top concept: Subcultures
issued: 2023-04-12
modified: 2026-02-23
type: Concept
in scheme: v3
change note: Version 4.1.0

Non-binary romance fiction
preferred label: Ficción romántica no binaria @es
comment: Written works of fiction revolving around romantic and/or sexual relationships between the main characters; use in reference to romance fiction focusing on non-binary characters.
comment: Obras escritas de ficción que giran en torno a relaciones románticas y/o sexuales entre los personajes principales; utilícese en referencia a la ficción romántica centrada en personajes no binarios. @es
broader: LGBTQ+ romance fiction
broader: Non-binary fiction
has top concept: Subcultures
issued: 2023-04-12
modified: 2025-02-23
type: Concept
in scheme: v3
change note: Version 4.1.0

Non-binary mystery and detective fiction
preferred label: Ficción no binaria de misterio y de detetectives @es
comment: Written literary works about the investigation of crime or the work of detectives; use in reference to mystery and detective fiction focusing on non-binary characters or themes.
comment: Obras literarias escritas sobre la investigación de crímenes o el trabajo de detectives; utilícese en referencia a la ficción de misterio y de detectives centrada en personajes y temas no binarios. @es
broader: LGBTQ+ mystery and detective fiction
broader: Non-binary fiction
has top concept: Subcultures
issued: 2023-04-12
modified: 2025-02-23
type: Concept
in scheme: v3
change note: Version 4.1.0

Non-binary horror fiction
preferred label: Ficción de horror no binaria @es
comment: Written works of fiction intended to frighten, scare, or disgust; use in reference to horror fiction focusing on non-binary characters or themes.
comment: Obras de ficción escritas con la intención de asustar, atemorizar o provocar disgusto; utilícese en referencia a la ficción de horror centrada en personajes o temas no binarios. @es
broader: LGBTQ+ horror fiction
broader: Non-binary fiction
has top concept: Subcultures
issued: 2023-04-12
modified: 2025-02-23
type: Concept
in scheme: v3
change note: Version 4.1.0

Non-binary graphic novels
preferred label: Novelas gráficas no binarias @es
comment: Works consisting of sequential images often accompanied by text that generally contain stand-alone stories; used in reference to graphic novels focusing on non-binary characters or themes.
comment: Obras que consisten en imágenes secuenciales, a menudo acompañadas de texto, que generalmente contienen historias independientes; utilícese en referencia a novelas gráficas que se centran en personajes o temas no binarios. @es
broader: LGBTQ+ graphic novels
has top concept: Subcultures
issued: 2023-04-12
modified: 2025-02-23
type: Concept
in scheme: v3
change note: Version 4.1.0

Non-binary science fiction
preferred label: Ciencia ficción no binaria @es
comment: Written literary work about imaginative or futuristic concepts incorporating science, technology, space, time travel, and other speculative elements; use in reference to science fiction focusing on non-binary characters or themes.
comment: Obras literarias escritas sobre conceptos imaginativos o futuristas que incorporan la ciencia, la tecnología, el espacio, los viajes en el tiempo y otros elementos especulativos; utilícese en referencia a la ciencia ficción que se centra en personajes o temas no binarios. @es
broader: LGBTQ+ science fiction
broader: Non-binary fiction
has top concept: Subcultures
issued: 2023-04-12
modified: 2025-02-23
type: Concept
in scheme: v3
change note: Version 4.1.0

Non-binary fantasy fiction
preferred label: Ficción fantástica no binaria @es
comment: Genre that uses magic and other supernatural phenomena as a primary element of plot, theme, and/or setting; use for fantasy fiction focusing on non-binary characters or themes.
comment: Género que utiliza la magia y otros fenómenos sobrenaturales como elemento principal de la trama, el tema y/o el escenario; utilícese para la ficción fantástica que se centre en personajes o temas no binarios. @es
broader: LGBTQ+ fantasy fiction
broader: Non-binary fiction
has top concept: Subcultures
issued: 2023-04-12
modified: 2025-02-23
type: Concept
in scheme: v3
change note: Version 4.1.0

Non-binary erotic literature
preferred label: Literatura erótica no binaria @es
comment: Literary works that have erotic or sexual elements; use in reference to erotic literature focusing on non-binary characters or themes.
comment: Obras literarias que tengan elementos eróticos o sexuales; utilícese en referencia a la literatura erótica que se centra en personajes o temas no binarios. @es
broader: LGBTQ+ erotic literature
has top concept: Erotica
issued: 2023-04-12
modified: 2025-02-23
type: Concept
in scheme: v3
change note: Version 4.1.0

Non-binary porn films
preferred label: Películas porno no binaria @es
alternative label: Películas pornografícas no binarias @es
comment: Erotic or sexually explicit films featuring non-binary people.
comment: Películas eróticas o sexualmente explícitas protagonizadas por personas no binarias. @es
broader: LGBTQ+ porn films
has top concept: Subcultures
issued: 2023-04-12
modified: 2025-02-23
type: Concept
in scheme: v3
change note: Version 4.1.0

Non-binary short stories
preferred label: Cuentos cortos no binarios @es
alternative label: Relatos no binarios @es
comment: Written literary works that are short in length and detail a self-contained incident or concept; use in reference to short stories focusing on non-binary characters or themes.
comment: Obras literarias escritas que son breves y detallan un incidente o concepto autónomo; utilícese en referencia a cuentos cortos que se centren en personajes o temas no binarios. @es
broader: LGBTQ+ short stories
has top concept: Subcultures
issued: 2023-04-12
modified: 2025-02-23
type: Concept
in scheme: v3
change note: Version 4.1.0

Non-binary comics
preferred label: Cómics no binarios @es
alternative label: Historietas no binarias @es
comment: Works consisting of sequential images often accompanied by text; use in reference to comics focusing on non-binary characters or themes.
comment: Obras que consisten en imágenes secuenciales, a menudo acompañadas de texto; utilícese en referencia a cómics que se centran en personajes o temas no binarios. @es
broader: LGBTQ+ comics
has top concept: Subcultures
issued: 2023-04-12
modified: 2025-02-23
type: Concept
in scheme: v3
change note: Version 4.1.0

Non-binary poetry
preferred label: Poesía no binaria @es
comment: Literary work, typically written in verse, that focuses on non-binary characters, themes, or identity.
comment: Obras literarias, normalmente escritas en verso, que se centran en personajes, temas o identidades no binarias. @es
broader: LGBTQ+ poetry
has top concept: Subcultures
issued: 2023-04-12
modified: 2025-02-23
type: Concept
in scheme: v3
change note: Version 4.1.0

Queercrip
alternative label: Cripqueer
comment: A portmanteau of two reclaimed terms (queer and crip) used to indicate that a person or a thing belongs to both queer and crip communities, often used to indicate unity or shared struggles. This term may also appear as "cripqueer" to emphasize the crip identity before the queer one.
comment: La unión de dos términos reclamados ("queer" y "crip") utilizados para indicar que una persona o cosa pertenece tanto a comunidades queer como crip, a menudo utilizado para indicar unidad o luchas compartidas. Este término también puede aparecer como "cripqueer" para enfatizar la identidad crip antes que la queer. @es
broader: Reclaimed terms
related: Queer (Verb)
related: Queer people
related: LGBTQ+ disabled people
related: LGBTQ+ people with chronic illnesses
related: Crip
has top concept: LGBTQ+ slang
issued: 2023-04-12
modified: 2025-02-23
type: Concept
in scheme: v3
change note: Version 4.1.0

69ing
preferred label: Hacer el 69 @es
alternative label: 69'ing
alternative label: 69-ing
alternative label: 69
alternative label: Sixty-Nining
alternative label: Posición 69 @es
comment: 69ing refers to an act of shared oral sex between two people simultaneously giving and receiving oral sex, said to look similar to the number 69.
comment: 69ing se refiere a un acto de sexo oral compartido entre dos personas, una encima de la otra, que dan y reciben sexo oral simultáneamente. Se dice que la posición se parece al número 69. @es
broader: Oral sex
related: Fellatio
related: Cunnilingus
has top concept: Sex (Act)
issued: 2023-04-12
modified: 2025-02-23
type: Concept
in scheme: v3
change note: Version 4.1.0

LGBTQ+ erotic art
preferred label: Arte erótico LGBTQ+ @es
comment: Umbrella term for different forms of creative activity dealing with or engaging with erotic themes, including visual, material, and performing art, by LGBTQ+ artists or about LGBTQ+ topics and communities. Use a more specific term if possible.
comment: Término general para diferentes formas de actividad creativa que tratan o interactúan con temas eróticos, incluido el arte visual, material y escénico, por parte de artistas LGBTQ+ o sobre temas y comunidades LGBTQ+. Utilícese un término más específico de ser posible. @es
broader: LGBTQ+ arts
narrower: LGBTQ+ porn films
narrower: Lesbian erotic art
narrower: Gay erotic art
narrower: Bisexual erotic art
narrower: Transgender erotic art
narrower: Queer erotic art
narrower: Intersex erotic art
narrower: Aromantic erotic art
narrower: Asexual erotic art
narrower: Demisexual erotic art
related: Nude art
related: LGBTQ+ erotic films
related: Two-Spirit erotic art
has top concept: Subcultures
issued: 2023-04-12
modified: 2025-02-23
type: Concept
in scheme: v3
change note: Version 4.1.0

Appropriation of Indigenous identity
preferred label: Apropiación de identidades indígenas @es
alternative label: Pretendians
comment: A form of cultural appropriation and race shifting involving false claims of citizenship, belonging, and/or descent from Indigenous people in North America. Not to be confused with disconnected or reconnecting descendants.
comment: Una forma de apropiación cultural y cambio racial que implica afirmaciones falsas de ciudadanía, pertenencia y/o ascendencia de pueblos indígenas de Norteamérica. No se debe confundir con descendientes desconectados o reconectados. @es
broader: Appropriation of marginalized identities
narrower: Appropriation of Two-Spirit identity
has top concept: Appropriation of marginalized identities
issued: 2023-04-14
modified: 2025-02-23
type: Concept
in scheme: v3
change note: Version 4.1.0

Appropriation of Two-Spirit identity
preferred label: Apropiación de identidades dos espíritus @es
comment: A form of cultural appropriation involving identification with Two-Spirit identity by people who cannot claim citizenship, belonging, and/or descent from Indigenous people in North America.
comment: Una forma de apropiación cultural que implica la identificación con la identidad Dos Espíritus por parte de personas que no pueden reclamar ciudadanía, pertenencia y/o descendencia de pueblos indígenas de Norteamérica. @es
broader: Appropriation of Indigenous identity
related: Two-Spirit identity
has top concept: Appropriation of marginalized identities
issued: 2023-04-14
modified: 2025-02-23
type: Concept
in scheme: v3
change note: Version 4.1.0

Appropriation of marginalized identities
preferred label: Apropiación de identidades marginadas @es
comment: Falsely claiming belonging to a marginalized group (including, but not limited to: disability, ethnicity, race, and sexuality).
comment: Afirmar falsamente pertenecer a un grupo marginado (incluyendo, pero no limitado a: la discapacidad, el origen étnico, la raza y la sexualidad). @es
narrower: Appropriation of Indigenous identity
issued: 2023-04-14
modified: 2025-02-23
type: Concept
in scheme: v3
change note: Version 4.1.0

Queerspawn
comment: People with one or more queer parent or caregiver, usually for self-identification. Queerspawn is believed to have been coined in 1995 or 1996 by Stefan Lynch for use in zine published by COLAGE, a U.S. based organization dedicated to supporting people with one or more LGBTQ+ caregiver.
comment: Personas con uno o más padres o cuidadores queer, generalmente utilizado para autoidentificarse. Se cree que Queerspawn fue acuñado en 1995 o 1996 por Stefan Lynch para utilizarlo en un zine publicado por COLAGE, una organización con sede en EE. UU. dedicada a apoyar a las personas con uno o más cuidadores LGBTQ+. @es
broader: Children of LGBTQ+ people
broader: LGBTQ+ slang
related: Children of queer people
related: Queer families
related: Queer parents
has top concept: Family members
issued: 2023-04-14
modified: 2025-02-23
type: Concept
in scheme: v3
change note: Version 4.1.0

Bothies
comment: People who have two or more LGBTQ+ parents or caregivers. Includes individuals born to or adopted by people in a heterosexual relationship who later came out as LGBTQ+, as well as individuals born to or adopted by LGBTQ+ people who came together to create their own families, such as lesbian couples who choose to conceive with friends who are gay men. For use in a Canadian and United States context.
comment: Personas que tienen dos o más padres o cuidadores LGBTQ+. Incluye a personas nacidas o adoptadas por personas en una relación heterosexual que luego se declararon LGBTQ+, así como personas nacidas o adoptadas por personas LGBTQ+ que se unieron para crear sus propias familias, como parejas de lesbianas que eligen concebir con amigos que son hombres gay. Utilícese en contextos canadienses y estadounidenses. @es
broader: Children of LGBTQ+ people
broader: LGBTQ+ slang
related: LGBTQ+ families
related: LGBTQ+ parents
has top concept: Family members
issued: 2023-04-14
modified: 2025-02-23
type: Concept
in scheme: v3
change note: Version 4.1.0

LGBTQ+ children of LGBTQ+ parents
preferred label: Hijos LGBTQ+ de padres y madres LGBTQ+ @es
alternative label: Second generation (LGBTQ+ families)
alternative label: Segunda generación (familias LGBTQ+) @es
comment: Term used to describe people who are LGBTQ+ and have at least one LGBTQ+ parent or caregiver.
comment: Término utilizado para describir a las personas que son LGBTQ+ y que tienen al menos un padre o cuidador LGBTQ+. @es
broader: Children of LGBTQ+ people
broader: LGBTQ+ people
related: LGBTQ+ families
related: Lesbian parents
has top concept: Family members
issued: 2023-04-14
modified: 2025-02-23
type: Concept
in scheme: v3
change note: Version 4.1.0

LGBTQ+ family generations
preferred label: Generaciones familiares LGBTQ+ @es
comment: Refers to families with LGBTQ+ individuals in multiple generations.
comment: Se refiere a familias con personas LGBTQ+ en varias generaciones. @es
broader: LGBTQ+ families
related: Children of LGBTQ+ people
related: LGBTQ+ parents
related: Transgender parents
related: LGBTQ+ grandparents
has top concept: LGBTQ+ families
issued: 2023-04-14
modified: 2025-02-23
type: Concept
in scheme: v3
change note: Version 4.1.0

People with transgender parents
preferred label: Personas con padres transgénero @es
alternative label: KOT (Kids of Trans)
alternative label: Kids of Trans
alternative label: PTP
alternative label: People with trans parents
alternative label: Transpawn
alternative label: Hijos de personas transgénero @es
alternative label: Hijas de personas transgénero @es
alternative label: Hijxs de personas transgénero @es
alternative label: Hijos de personas trans @es
alternative label: Hijas de personas trans @es
alternative label: Hijxs de personas trans @es
alternative label: Personas con padres trans @es
comment: People who have one or more transgender parent or caregiver.
comment: Personas que tienen uno o más padres o cuidadores transgénero. @es
broader: Children of transgender people
related: Transgender families
related: Transgender parents
has top concept: Family members
issued: 2023-04-14
modified: 2025-02-23
type: Concept
in scheme: v3
change note: Version 4.1.0

Culturally queer
preferred label: Culturalmente queer @es
comment: Term used to describe the feeling shared by many people with queer parents or caregivers that they grew up immersed in queer culture, including queer traditions, celebrations, media, and language.
comment: Término utilizado para describir el sentimiento compartido por muchas personas con padres o cuidadores queer de que crecieron inmersos en una cultura queer, incluidas las tradiciones, las celebraciones, los medios y el lenguaje queer. @es
broader: Queer culture
related: Children of queer people
related: Queer families
related: Queer people
has top concept: Subcultures
issued: 2023-04-14
modified: 2025-02-23
type: Concept
in scheme: v3
change note: Version 4.1.0

Gender role stereotypes
preferred label: Estereotipos de rol de género @es
alternative label: Gender stereotypes
alternative label: Estereotipos de género @es
comment: Widely held but oversimplified and often offensive ideas regarding gender roles, which are socially-determined rules or standards for gendered behaviors. Use the term "Gender roles" to describe gender roles as a whole, rather than stereotypes related to them.
comment: Ideas generalizadas pero demasiado simplificadas y a menudo ofensivas sobre los roles de género, que son reglas o estándares socialmente determinados para comportamientos de género. Utilice el término "Roles de género" para describir los roles de género como un todo, en lugar de estereotipos relacionados a ellos. @es
broader: Gender roles
related: Gender binaries
related: Gender expression
related: Gender relations
has top concept: Role behavior
issued: 2023-04-14
modified: 2025-02-23
type: Concept
in scheme: v3
change note: Version 4.1.0

Internalized oppression
preferred label: Opresión internalizada @es
comment: The phenomenon in which someone in a marginalized group internalizes or adopts oppressive beliefs (i.e., negative perceptions of and intolerance toward any marginalized identities they hold) as a result of being raised or socialized within an oppressive environment or culture.
comment: El fenómeno a través del cual una persona de un grupo marginado internaliza o adopta creencias opresivas (es decir, percepciones negativas e intolerancia hacia cualquier identidad marginada que habite) como resultado de haber sido criada o socializada dentro de un entorno o una cultura opresiva. @es
narrower: Internalized homophobia
narrower: Internalized lesbophobia
narrower: Internalized biphobia
narrower: Internalized transphobia
narrower: Internalized queerphobia
narrower: Internalized intersexphobia
related: Denial of sexual orientation
related: LGBTQ+ phobia
related: LGBTQ+ self-repression
related: Lateral oppression
issued: 2023-04-14
modified: 2025-02-23
type: Concept
in scheme: v3
change note: Version 4.1.0

Internalized lesbophobia
preferred label: Lesbofobia internalizada @es
comment: The phenomenon in which lesbians internalize or adopt lesbophobic beliefs (i.e., negative perceptions of and intolerance toward lesbians and lesbianism) as a result of being raised or socialized within a lesbophobic environment or culture.
comment: El fenómeno a través del cual las lesbianas internalizan o adoptan creencias lesbofóbicas (es decir, percepciones negativas e intolerancia hacia las lesbianas y el lesbianismo) como resultado de haber sido criadas o socializadas dentro de un entorno o una cultura lesbofóbica. @es
broader: Lesbophobia
broader: Internalized oppression
narrower: Lateral lesbophobia
has top concept: LGBTQ+ phobia
issued: 2023-04-14
modified: 2025-02-23
type: Concept
in scheme: v3
change note: Version 4.1.0

Internalized biphobia
preferred label: Bifobia internalizada @es
comment: The phenomenon in which bisexual people internalize or adopt biphobic beliefs (i.e., negative perceptions of and intolerance toward bisexual people and bisexuality) as a result of being raised or socialized within a biphobic environment or culture.
comment: El fenómeno a través del cual las personas bisexuales internalizan o adoptan creencias bifóbicas (es decir, percepciones negativas e intolerancia hacia las personas bisexuales y la bisexualidad) como resultado de haber sido criadas o socializadas dentro de un entorno o una cultura bifóbica. @es
broader: Biphobia
broader: Internalized oppression
narrower: Lateral biphobia
has top concept: LGBTQ+ phobia
issued: 2023-04-14
modified: 2025-02-23
type: Concept
in scheme: v3
change note: Version 4.1.0

Internalized transphobia
preferred label: Transfobia internalizada @es
comment: The phenomenon in which transgender people internalize or adopt transphobic beliefs (i.e., negative perceptions of and intolerance toward transgender people and trans identities) as a result of being raised or socialized within a transphobic environment or culture.
comment: El fenómeno a través del cual las personas transgénero internalizan o adoptan creencias transfóbicas (es decir, percepciones negativas e intolerancia hacia las personas transgénero y las identidades trans) como resultado de haber sido criadas o socializadas dentro de un entorno o una cultura transfóbica. @es
broader: Transphobia
broader: Internalized oppression
narrower: Lateral transphobia
has top concept: LGBTQ+ phobia
issued: 2023-04-14
modified: 2025-02-23
type: Concept
in scheme: v3
change note: Version 4.1.0

Internalized queerphobia
preferred label: Queerfobia internalizada @es
comment: The phenomenon in which queer people internalize or adopt queerphobic beliefs (i.e., negative perceptions of and intolerance toward queer people and queerness) as a result of being raised or socialized within a queerphobic environment or culture.
comment: El fenómeno a través del cual personas queer internalizan o adoptan creencias queerfóbicas (es decir, percepciones negativas e intolerancia hacia las personas queer y la identidad queer) como resultado de haber sido criadas o socializadas dentro de un entorno o una cultura lesbofóbica. @es
broader: Queerphobia
broader: Internalized oppression
narrower: Lateral queerphobia
has top concept: LGBTQ+ phobia
issued: 2023-04-14
modified: 2025-02-23
type: Concept
in scheme: v3
change note: Version 4.1.0

Internalized intersexphobia
preferred label: Intersexfobia internalizada @es
alternative label: Internalized interphobia
alternative label: Interfobia internalizada @es
comment: The phenomenon in which intersex people internalize or adopt intersexphobic beliefs (i.e., negative perceptions of and intolerance toward intersex people and intersex variations) as a result of being raised or socialized within a intersexphobic environment or culture.
comment: El fenómeno a través del cual las personas intersexuales internalizan o adoptan creencias intersexfóbicas (es decir, percepciones negativas e intolerancia hacia las personas intersex y variaciones intersex) como resultado de haber sido criadas o socializadas dentro de un entorno o una cultura intersexfóbica. @es
broader: Intersexphobia
broader: Internalized oppression
narrower: Lateral intersexphobia
has top concept: LGBTQ+ phobia
issued: 2023-04-14
modified: 2025-02-23
type: Concept
in scheme: v3
change note: Version 4.1.0

Transgender art
preferred label: Arte transgénero @es
comment: Term for different forms of creative activity, including visual, material, and performing arts, by transgender artists or about transgender topics and communities.
comment: Término para diferentes formas de actividad creativa, incluidas las artes visuales, materiales y escénicas, realizadas por artistas transgénero o sobre temas y comunidades transgénero. @es
broader: LGBTQ+ arts
related: Transgender erotic art
related: Transgender people in visual art
has top concept: Subcultures
issued: 2023-04-14
modified: 2025-04-23
type: Concept
in scheme: v3
change note: Version 4.1.0

Two-Spirit art
preferred label: Arte dos espíritus @es
alternative label: 2S art
alternative label: Two Spirit art
alternative label: Two Spirited art
alternative label: Two-Spirited art
comment: Term for different forms of creative activity, including visual, material, and performing arts, by Two-Sprit artists or about Two-Spirit topics and communities.
comment: Término para diferentes formas de actividad creativa, incluidas las artes visuales, materiales y escénicas, realizadas por artistas dos espíritus o sobre temas y comunidades dos espíritus. @es
narrower: Two-Spirit erotic art
related: LGBTQ+ arts
related: Two-Spirit people in visual art
issued: 2023-04-14
modified: 2025-04-23
type: Concept
in scheme: v3
change note: Version 4.1.0

Gay art
preferred label: Arte gay @es
comment: Umbrella term for different forms of creative activity, including visual, material, and performing arts, by gay artists or about gay topics and communities. Use a more specific term if possible.
comment: Término general para diferentes formas de actividad creativa, incluidas las artes visuales, materiales y escénicas, realizadas por artistas gay o sobre temas y comunidades gay. Utilícese un término más específico si es posible. @es
broader: LGBTQ+ arts
related: Gay erotic art
related: Gay men in visual art
has top concept: Subcultures
issued: 2023-04-14
modified: 2025-04-23
type: Concept
in scheme: v3
change note: Version 4.1.0

Lesbian art
preferred label: Arte lésbico @es
comment: Term for different forms of creative activity, including visual, material, and performing arts, by lesbian artists or about lesbian topics and communities.
comment: Término para diferentes formas de actividad creativa, incluidas las artes visuales, materiales y escénicas, realizadas por artistas lesbianas o sobre temas y comunidades lésbicas. @es
broader: LGBTQ+ arts
related: Lesbian erotic art
related: Lesbians in visual art
has top concept: Subcultures
issued: 2023-04-14
modified: 2025-04-23
type: Concept
in scheme: v3
change note: Version 4.1.0

Bisexual art
preferred label: Arte bisexual @es
comment: Term for different forms of creative activity, including visual, material, and performing arts, by bisexual artists or about bisexual topics and communities.
comment: Término para diferentes formas de actividad creativa, incluidas las artes visuales, materiales y escénicas, de artistas bisexuales o sobre temas y comunidades bisexuales. @es
broader: LGBTQ+ arts
related: Bisexual erotic art
related: Bisexual people in visual art
has top concept: Subcultures
issued: 2023-04-14
modified: 2025-04-23
type: Concept
in scheme: v3
change note: Version 4.1.0

Queer art
preferred label: Arte queer @es
comment: Term for different forms of creative activity, including visual, material, and performing arts, by queer artists or about queer topics and communities.
comment: Término para diferentes formas de actividad creativa, incluidas las artes visuales, materiales y escénicas, realizadas por artistas queer o sobre temas y comunidades queer. @es
broader: LGBTQ+ arts
narrower: Queer architecture
related: Queer erotic art
related: Queer people in visual art
has top concept: Subcultures
issued: 2023-04-14
modified: 2025-04-23
type: Concept
in scheme: v3
change note: Version 4.1.0

Intersex art
preferred label: Arte intersex @es
comment: Term for different forms of creative activity, including visual, material, and performing arts, by intersex artists or about intersex topics and communities.
comment: Término para diferentes formas de actividad creativa, incluidas las artes visuales, materiales y escénicas, realizadas por artistas intersex o sobre temas y comunidades intersex. @es
broader: LGBTQ+ arts
related: Intersex erotic art
related: Intersex people in visual art
has top concept: Subcultures
issued: 2023-04-14
modified: 2025-04-23
type: Concept
in scheme: v3
change note: Version 4.1.0

Aromantic art
preferred label: Arte arromántico @es
comment: Term for different forms of creative activity, including visual, material, and performing arts, by aromantic artists or about aromantic topics and communities.
comment: Término para diferentes formas de actividad creativa, incluidas las artes visuales, materiales y escénicas, realizadas por artistas arrománticos o sobre temas y comunidades arrománticos. @es
broader: LGBTQ+ arts
related: Aromantic erotic art
has top concept: Subcultures
issued: 2023-04-14
modified: 2025-02-23
type: Concept
in scheme: v3
change note: Version 4.1.0

Asexual art
preferred label: Arte asexual @es
comment: Term for different forms of creative activity, including visual, material, and performing arts, by asexual artists or about asexual topics and communities.
comment: Término para diferentes formas de actividad creativa, incluidas las artes visuales, materiales y escénicas, de artistas asexuales o sobre temas y comunidades asexuales. @es
broader: LGBTQ+ arts
related: Asexual erotic art
has top concept: Subcultures
issued: 2023-04-14
modified: 2025-02-23
type: Concept
in scheme: v3
change note: Version 4.1.0

Demisexual art
preferred label: Arte demisexual @es
comment: Term for different forms of creative activity, including visual, material, and performing arts, by demisexual artists or about demisexual topics and communities.
comment: Término para diferentes formas de actividad creativa, incluidas las artes visuales, materiales y escénicas, por artistas demisexuales o sobre temas y comunidades demisexuales. @es
broader: LGBTQ+ arts
related: Demisexual erotic art
has top concept: Subcultures
issued: 2023-04-14
modified: 2025-02-23
type: Concept
in scheme: v3
change note: Version 4.1.0

Two-Spirit erotic art
preferred label: Arte erótico dos espíritus @es
alternative label: 2S erotic art
alternative label: Two Spirit erotic art
alternative label: Two Spirited erotic art
alternative label: Two-Spirited erotic art
comment: Erotic art, created by Two-Spirit artists, depicting Two-Spirit people, or that are regarded as important within Two-Spirit culture.
comment: Arte erótico, creado por artistas dos espíritus, que representa a personas dos espíritus o que se considera importante dentro de la cultura dos espíritus. @es
broader: Two-Spirit art
related: LGBTQ+ erotic art
has top concept: Two-Spirit art
issued: 2023-04-14
modified: 2025-02-23
type: Concept
in scheme: v3
change note: Version 4.1.0

Lesbian erotic art
preferred label: Arte erótico lésbico @es
comment: Erotic art, created by lesbian artists, depicting lesbian people, or that are regarded as important within lesbian culture.
comment: Arte erótico, creado por artistas lesbianas, que representa a lesbianas o a personas consideradas importantes dentro de la cultura lésbica. @es
broader: LGBTQ+ erotic art
narrower: Lesbian porn films
narrower: Lesbian erotic films
related: Lesbian art
has top concept: Subcultures
issued: 2023-04-14
modified: 2025-02-23
type: Concept
in scheme: v3
change note: Version 4.1.0

Gay erotic art
preferred label: Arte erótico gay @es
comment: Erotic art, created by gay artists, depicting gay people, or that are regarded as important within gay culture.
comment: Arte erótico, creado por artistas gay, que representa a hombres gay o a personas consideradas importantes dentro de la cultura gay. @es
broader: LGBTQ+ erotic art
narrower: Gay porn films
narrower: Gay erotic films
related: Gay art
has top concept: Subcultures
issued: 2023-04-14
modified: 2025-02-23
type: Concept
in scheme: v3
change note: Version 4.1.0

Bisexual erotic art
preferred label: Empleo bisexual @es
comment: Erotic art, created by bisexual artists, depicting bisexual people, or that are regarded as important within bisexual culture.
comment: El acto de emplear a personas bisexuales. @es
broader: LGBTQ+ erotic art
narrower: Bisexual porn films
narrower: Bisexual erotic films
related: Bisexual art
has top concept: Subcultures
issued: 2023-04-14
modified: 2025-02-23
type: Concept
in scheme: v3
change note: Version 4.1.0

Transgender erotic art
preferred label: Arte erótico transgénero @es
comment: Erotic art, created by transgender artists, depicting transgender people, or that are regarded as important within transgender culture.
comment: Arte erótico, creado por artistas transgénero, que representa a personas transgénero, o personas consideradas importantes dentro de la cultura transgénero. @es
broader: LGBTQ+ erotic art
narrower: Transgender porn films
narrower: Transgender erotic films
related: Transgender art
has top concept: Subcultures
issued: 2023-04-14
modified: 2025-02-23
type: Concept
in scheme: v3
change note: Version 4.1.0

Queer erotic art
preferred label: Arte erótico queer @es
comment: Erotic art, created by queer artists, depicting queer people, or that are regarded as important within queer culture.
comment: Arte erótico, creado por artistas queer, que representa a personas queer, o personas consideradas importantes dentro de la cultura queer. @es
broader: LGBTQ+ erotic art
narrower: Queer porn films
narrower: Queer erotic films
related: Queer art
has top concept: Subcultures
issued: 2023-04-14
modified: 2025-02-23
type: Concept
in scheme: v3
change note: Version 4.1.0

Intersex erotic art
preferred label: Arte erótico intersex @es
comment: Erotic art, created by intersex artists, depicting intersex people, or that are regarded as important within intersex culture.
comment: Arte erótico, creado por artistas intersex, que representa a personas intersex, o personas consideradas importantes dentro de la cultura intersex. @es
broader: LGBTQ+ erotic art
narrower: Intersex erotic films
narrower: Intersex porn films
related: Intersex art
has top concept: Subcultures
issued: 2023-04-14
modified: 2025-02-23
type: Concept
in scheme: v3
change note: Version 4.1.0

Aromantic erotic art
preferred label: Arte erótico arromántico @es
comment: Erotic art, created by aromantic artists, depicting aromantic people, or that are regarded as important within aromantic culture.
comment: Arte erótico, creado por artistas arrománticos, que representa a personas arrománticas, o que se consideran importantes dentro de la cultura arromántica. @es
broader: LGBTQ+ erotic art
narrower: Aromantic erotic films
narrower: Aromantic porn films
related: Aromantic art
has top concept: Subcultures
issued: 2023-04-14
modified: 2025-02-23
type: Concept
in scheme: v3
change note: Version 4.1.0

Asexual erotic art
preferred label: Arte erótico asexual @es
comment: Erotic art, created by asexual artists, depicting asexual people, or that are regarded as important within asexual culture.
comment: Arte erótico, creado por artistas asexuales, que representa a personas asexuales o que se considera importante dentro de la cultura asexual. @es
broader: LGBTQ+ erotic art
narrower: Asexual erotic films
narrower: Asexual porn films
related: Asexual art
has top concept: Subcultures
issued: 2023-04-14
modified: 2025-02-23
type: Concept
in scheme: v3
change note: Version 4.1.0

Demisexual erotic art
preferred label: Arte erótico demisexual @es
comment: Erotic art, created by demisexual artists, depicting demisexual people, or that are regarded as important within demisexual culture.
comment: Arte erótico, creado por artistas demisexuales, que representa a personas demisexuales, o a personas consideradas importantes dentro de la cultura demisexual. @es
broader: LGBTQ+ erotic art
narrower: Demisexual erotic films
narrower: Demisexual porn films
related: Demisexual art
has top concept: Subcultures
issued: 2023-04-14
modified: 2025-02-23
type: Concept
in scheme: v3
change note: Version 4.1.0

Anonymous donors (Reproduction)
preferred label: Donantes anónimos (reproducción) @es
comment: People who donated their gametes with the understanding that their identity would remain unknown by any potential offspring.
comment: Personas que donaron sus gametos con el entendimiento de que su identidad permanecería oculta de cualquier posible descendiente. @es
broader: Donors
related: Assisted reproduction
has top concept: Donors
issued: 2023-04-14
modified: 2025-02-23
type: Concept
in scheme: v3
change note: Version 4.1.0

Artificial insemination
preferred label: Inseminación artificial @es
comment: The introduction of semen into the cervical opening, uterus, or fallopian tube using assistance from reproductive technology. Some choose not to use this term due to the implications of the word "artificial."
comment: La introducción de semen en la apertura cervical, el útero o las trompas de Falopio con la ayuda de tecnología reproductiva. Algunos optan por no utilizar este término por las implicaciones de la palabra "artificial". @es
broader: Insemination
broader: Assisted reproduction
related: Sperm donors
related: Turkey baster babies
has top concept: LGBTQ+ family planning
issued: 2023-04-14
modified: 2025-02-23
type: Concept
in scheme: v3
change note: Version 4.1.0

Assisted reproduction
preferred label: Reproducción asistida @es
comment: The process by which a fetus is conceived through donor insemination, egg donation, surrogacy, IVF, and/or other reproductive technologies.
comment: Proceso por el que se concibe un feto mediante ila nseminación de un donante, la donación de óvulos, la gestación subrogada, la FIV y/u otras tecnologías reproductivas. @es
broader: Assisted reproductive technology
narrower: In vitro fertilization
narrower: Self-insemination
narrower: Surrogacy
narrower: Artificial insemination
narrower: Donor insemination
narrower: Egg donation
narrower: Sperm donation
related: Insemination
related: Anonymous donors (Reproduction)
has top concept: Assisted reproductive technology
issued: 2023-04-14
modified: 2025-02-23
type: Concept
in scheme: v3
change note: Version 4.1.0

Assisted reproductive technology
preferred label: Tecnología de reproducción asistida @es
alternative label: ART
alternative label: Assisted reproductive technologies
alternative label: TRA @es
alternative label: Tecnología asistida de reproducción @es
comment: An umbrella term used to describe all methods of conception beyond sexual intercourse, including but not limited to donor insemination, artificial insemination, surrogacy, egg donation, and IVF.
comment: Término general utilizado para describir todos los métodos de concepción más allá de las relaciones sexuales, incluidos, pero no limitados a, la inseminación de une donante, la inseminación artificial, la maternidad subrogada, la donación de óvulos y la FIV. @es
narrower: Assisted reproduction
issued: 2023-04-14
modified: 2025-02-23
type: Concept
in scheme: v3
change note: Version 4.1.0

Donor insemination
preferred label: Inseminación de donante @es
comment: The process by which donated sperm is placed inside a person with a uterus to induce pregnancy.
comment: El proceso mediante el cual se coloca esperma donado dentro de una persona con útero para inducir el embarazo. @es
broader: Insemination
broader: Assisted reproduction
narrower: Sperm donors
related: Sperm donation
has top concept: LGBTQ+ family planning
issued: 2023-04-14
modified: 2025-02-23
type: Concept
in scheme: v3
change note: Version 4.1.0

Donor siblings
preferred label: Hermanos de donación @es
comment: People who are biologically related to one another through a shared donor.
comment: Personas que están relacionadas biológicamente entre sí a través de un donante compartido. @es
broader: Siblings
related: Biological parenthood
related: Donors
related: Genetic parenthood
has top concept: Family members
issued: 2023-04-14
modified: 2025-02-23
type: Concept
in scheme: v3
change note: Version 4.1.0

Egg donation
preferred label: Donación de óvulos @es
comment: The process by which a person donates their eggs for reproduction.
comment: El proceso mediante el cual una persona dona sus óvulos para la reproducción. @es
broader: Assisted reproduction
related: Gestational surrogacy
has top concept: Assisted reproductive technology
issued: 2023-04-14
modified: 2025-02-23
type: Concept
in scheme: v3
change note: Version 4.1.0

Half-siblings
preferred label: Medios hermanos @es
alternative label: Half siblings
comment: Siblings who are biologically related through one but not all of their parents.
comment: Hermanos que están relacionados biológicamente a través de uno, pero no todos, sus padres. @es
broader: Siblings
related: Biological parenthood
related: Genetic parenthood
related: LGBTQ+ siblings
has top concept: Family members
issued: 2023-04-14
modified: 2025-02-23
type: Concept
in scheme: v3
change note: Version 4.1.0

Known donors (Reproduction)
preferred label: Donantes conocidos (reproducción) @es
comment: Donors whose identities are known by the people to whom they donated gametes and/or the offspring born of that donation.
comment: Donantes cuyas identidades son conocidas por las personas a quienes donaron gametos y/o por la descendencia nacida de esa donación. @es
broader: Donors
has top concept: Donors
issued: 2023-04-14
modified: 2025-02-23
type: Concept
in scheme: v3
change note: Version 4.1.0

Open identity donors (Reproduction)
preferred label: Donantes de identidad abierta (Reproducción) @es
alternative label: Identity release donors
alternative label: Willing-to-be-known donors
alternative label: Donantes con identidad revelada @es
comment: Donors who donated their gametes with the understanding that their identity and/or contact information would be released to any offspring born of that donation. The age at which the offspring receives this information varies, following the donor's preference.
comment: Donantes que donaron sus gametos con el entendimiento de que su identidad y/o información de contacto se divulgarían a cualquier descendiente nacido de esa donación. La edad a la que el descendiente recibe esta información varía según la preferencia del donante. @es
broader: Donors
has top concept: Donors
issued: 2023-04-14
modified: 2025-02-23
type: Concept
in scheme: v3
change note: Version 4.1.0

Sperm donation
preferred label: Donación de esperma @es
comment: The process by which a person donates their sperm for reproduction.
comment: El proceso mediante el cual una persona dona su esperma para la reproducción. @es
broader: Assisted reproduction
related: Sperm donors
related: Donor insemination
has top concept: Assisted reproductive technology
issued: 2023-04-14
modified: 2025-02-23
type: Concept
in scheme: v3
change note: Version 4.1.0

Gestational surrogacy
preferred label: Subrogación gestacional @es
alternative label: Subrogancia gestacional @es
comment: The process by which a person becomes pregnant using a donated egg.
comment: El proceso por el cual una persona queda embarazada a partir de un óvulo donado. @es
broader: Surrogacy
related: Egg donors
related: Gestational parenthood
related: Egg donation
related: Surro babies
has top concept: LGBTQ+ families
issued: 2023-04-14
modified: 2025-02-23
type: Concept
in scheme: v3
change note: Version 4.1.0

Surro babies
preferred label: Bebés de subrogacion @es
alternative label: Surro baby
alternative label: Surrogate babies
comment: People born through surrogacy.
comment: Personas nacidas mediante la gestación subrogada. @es
broader: Children
related: Gestational parenthood
related: Gestational surrogacy
has top concept: Family members
issued: 2023-04-14
modified: 2025-02-23
type: Concept
in scheme: v3
change note: Version 4.1.0

Test tube babies
preferred label: Bebés probeta @es
alternative label: Test tube baby
comment: People who were conceived through IVF, or in vitro fertilization.
comment: Personas que fueron concebidas mediante FIV o fertilización in vitro. @es
broader: Children
related: In vitro fertilization
has top concept: Family members
issued: 2023-04-14
modified: 2025-02-23
type: Concept
in scheme: v3
change note: Version 4.1.0

Māhū poetry
preferred label: Poesía māhū @es
alternative label: Mahu poetry @haw
comment: Literary work, typically written in verse, that focuses on Māhū characters, themes, or identity.
comment: Obras literarias, normalmente escritas en verso, que se centran en personajes, temas o identidades māhū. @es
related: LGBTQ+ poetry
issued: 2023-06-23
modified: 2025-02-23
type: Concept
in scheme: v3
change note: Version 4.1.0

Māhū comics
preferred label: Cómics māhū @es
alternative label: Mahu comics @haw
comment: Works consisting of sequential images often accompanied by text; use in reference to comics focusing on Māhū characters or themes.
comment: Obras que consisten de imágenes secuenciales, a menudo acompañadas de texto; utilícese en referencia a cómics que se centran en personajes o temas māhū. @es
related: LGBTQ+ comics
issued: 2023-06-23
modified: 2025-02-23
type: Concept
in scheme: v3
change note: Version 4.1.0

Māhū fiction
preferred label: Ficción māhū @es
alternative label: Mahu fiction @haw
comment: Written works describing imagined events or people; use in reference to fictional works focusing on Māhū characters or themes.
comment: Obras escritas que describen eventos o personas imaginadas; utilícese en referencia a obras de ficción que se centran en personajes o temas māhū. @es
related: LGBTQ+ fiction
issued: 2023-06-23
modified: 2026-02-23
type: Concept
in scheme: v3
change note: Version 4.1.0

Māhū short stories
preferred label: Cuentos cortos māhū @es
alternative label: Mahu short stories @haw
comment: Written literary works that are short in length and detail a self-contained incident or concept; use in reference to short stories focusing on Māhū characters or themes.
comment: Obras literarias escritas de corta extensión que detallan un incidente o concepto autocontenido; utilícese en referencia a relatos cortos centrados en personajes o temas māhū. @es
related: LGBTQ+ short stories
issued: 2023-06-23
modified: 2025-02-23
type: Concept
in scheme: v3
change note: Version 4.1.0

Māhū porn films
preferred label: Películas porno māhū @es
alternative label: Mahu porn films @haw
alternative label: Películas pornográficas māhū @es
comment: Erotic or sexually explicit films featuring Māhū people.
comment: Películas eróticas o sexualmente explícitas protagonizadas por personas māhū. @es
related: LGBTQ+ porn films
issued: 2023-06-23
modified: 2025-02-23
type: Concept
in scheme: v3
change note: Version 4.1.0

Māhū erotic literature
preferred label: Literatura erótica māhū @es
alternative label: Mahu erotic literature @haw
comment: Literary works that have erotic or sexual elements; use in reference to erotic literature focusing on Māhū characters or themes.
comment: Obras literarias con elementos eróticos o sexuales; utilícese en referencia a la literatura erótica centrada en personajes o temas māhū. @es
related: LGBTQ+ erotic literature
issued: 2023-06-23
modified: 2025-02-23
type: Concept
in scheme: v3
change note: Version 4.1.0

Māhū fantasy fiction
preferred label: Ficción fantástica māhū @es
alternative label: Mahu fantasy fiction @haw
comment: Genre that uses magic and other supernatural phenomena as a primary element of plot, theme, and/or setting; use for fantasy fiction focusing on Māhū characters or themes.
comment: Género que utiliza la magia y otros fenómenos sobrenaturales como elemento principal de la trama, el tema y/o el escenario; utilícese para la ficción fantástica centrada en personajes o temas māhū. @es
related: LGBTQ+ fiction
related: LGBTQ+ fantasy fiction
issued: 2023-06-23
modified: 2025-10-31
type: Concept
in scheme: v3
change note: Version 4.1.0

Māhū science fiction
preferred label: Ciencia ficción māhū @es
alternative label: Mahu science fiction @haw
comment: Written literary work about imaginative or futuristic concepts incorporating science, technology, space, time travel, and other speculative elements; use in reference to science fiction focusing on Māhū characters or themes.
comment: Obras literarias escritas sobre conceptos imaginativos o futuristas que incorporan la ciencia, la tecnología, el espacio, los viajes en el tiempo y otros elementos especulativos; utilícese en referencia a la ciencia ficción centrada en personajes o temas māhū. @es
related: LGBTQ+ fiction
related: LGBTQ+ science fiction
issued: 2023-06-23
modified: 2025-10-31
type: Concept
in scheme: v3
change note: Version 4.1.0

Māhū graphic novels
preferred label: Novelas gráficas māhū @es
alternative label: Mahu graphic novels @haw
comment: Works consisting of sequential images often accompanied by text that generally contain stand-alone stories; used in reference to graphic novels focusing on Māhū characters or themes.
comment: Obras que consisten de imágenes secuenciales, a menudo acompañadas de texto, que suelen contener historias independientes; utilícese en referencia a las novelas gráficas centradas en personajes o temas māhū. @es
related: LGBTQ+ graphic novels
issued: 2023-06-23
modified: 2025-02-23
type: Concept
in scheme: v3
change note: Version 4.1.0

Māhū horror fiction
preferred label: Ficción de horror māhū @es
alternative label: Mahu horror fiction @haw
comment: Written works of fiction intended to frighten, scare, or disgust; use in reference to horror fiction focusing on Māhū characters or themes.
comment: Obras de ficción escritas con la intención de asustar, atemorizar o provocar disgusto; utilícese en referencia a la ficción de horror centrada en personajes o temas māhū. @es
related: LGBTQ+ fiction
related: LGBTQ+ horror fiction
issued: 2023-06-23
modified: 2025-10-31
type: Concept
in scheme: v3
change note: Version 4.1.0

Māhū mystery and detective fiction
preferred label: Ficción māhū de misterio y de detectives @es
alternative label: Mahu mystery and detective fiction @haw
comment: Written literary works about the investigation of crime or the work of detectives; use in reference to mystery and detective fiction focusing on Māhū characters and themes.
comment: Obras literarias escritas sobre la investigación de crímenes o el trabajo de detectives; utilícese en referencia a la ficción de misterio y de detectives centrada en personajes y temas māhū. @es
related: LGBTQ+ fiction
related: LGBTQ+ mystery and detective fiction
issued: 2023-06-23
modified: 2025-10-31
type: Concept
in scheme: v3
change note: Version 4.1.0

Māhū romance fiction
preferred label: Ficción romántica māhū @es
alternative label: Mahu romance fiction @haw
comment: Works of fiction revolving around romantic and/or sexual relationships between the main characters; use in reference to romance fiction focusing on Māhū characters.
comment: Obras de ficción que giran en torno a las relaciones románticas y/o sexuales entre los personajes principales; utilícese en referencia a la ficción romántica centrada en personajes māhū. @es
related: LGBTQ+ fiction
related: LGBTQ+ romance fiction
issued: 2023-06-23
modified: 2025-10-31
type: Concept
in scheme: v3
change note: Version 4.1.0

Two-Spirit poetry
preferred label: Poesía dos espíritus @es
alternative label: 2S poetry
alternative label: Two Spirit poetry
alternative label: Two Spirited poetry
alternative label: Two-Spirited poetry
comment: Literary work, typically written in verse, that focuses on Two-Spirit characters, themes, or identity.
comment: Obras literarias, normalmente escritas en verso, que se centran en personajes, temas o en la identidad dos espíritus. @es
related: LGBTQ+ poetry
issued: 2023-06-23
modified: 2025-02-23
type: Concept
in scheme: v3
change note: Version 4.1.0

Two-Spirit comics
preferred label: Cómics dos espíritus @es
alternative label: 2S comics
alternative label: Two Spirit comics
alternative label: Two Spirited comics
alternative label: Two-Spirited comics
alternative label: Historietas dos espíritus @es
comment: Works consisting of sequential images often accompanied by text; use in reference to comics focusing on Two-Spirit characters or themes.
comment: Obras que consisten de imágenes secuenciales, a menudo acompañadas de texto; utilícese en referencia a los cómics centrados en personajes o temas dos espíritus. @es
related: LGBTQ+ comics
issued: 2023-06-23
modified: 2025-02-23
type: Concept
in scheme: v3
change note: Version 4.1.0

Two-Spirit erotic literature
preferred label: Literatura erótica dos espíritus @es
alternative label: 2S erotic literature
alternative label: Two Spirit erotic literature
alternative label: Two Spirited erotic literature
alternative label: Two-Spirited erotic literature
comment: Literary works that have erotic or sexual elements; use in reference to erotic literature focusing on Two-Spirit characters or themes.
comment: Obras literarias que tienen elementos eróticos o sexuales; utilícese en referencia a la literatura erótica centrada en personajes o temas dos espíritus. @es
related: LGBTQ+ erotic literature
issued: 2023-06-25
modified: 2025-02-23
type: Concept
in scheme: v3
change note: Version 4.1.0

Two-Spirit fantasy fiction
preferred label: Ficción fantástica dos espíritus @es
alternative label: 2S fantasy fiction
alternative label: Two Spirit fantasy fiction
alternative label: Two Spirited fantasy fiction
alternative label: Two-Spirited fantasy fiction
comment: Genre that uses magic and other supernatural phenomena as a primary element of plot, theme, and/or setting; use for fantasy fiction focusing on Two-Spirit characters or themes.
comment: Género que utiliza la magia y otros fenómenos sobrenaturales como elemento principal de la trama, el tema y/o el escenario; utilícese para la ficción fantástica centrada en personajes o temas dos espíritus. @es
related: LGBTQ+ fiction
related: LGBTQ+ fantasy fiction
issued: 2023-06-26
modified: 2025-10-31
type: Concept
in scheme: v3
change note: Version 4.1.0

Two-Spirit science fiction
preferred label: Ciencia ficción dos espíritus @es
alternative label: 2S science fiction
alternative label: Two Spirit science fiction
alternative label: Two Spirited science fiction
alternative label: Two-Spirited science fiction
comment: Written literary work about imaginative or futuristic concepts incorporating science, technology, space, time travel, and other speculative elements; use in reference to science fiction focusing on Two-Spirit characters or themes.
comment: Obra literaria escrita sobre conceptos imaginativos o futuristas que incorporan la ciencia, la tecnología, el espacio, los viajes en el tiempo y otros elementos especulativos; utilícese en referencia a la ciencia ficción que se centra en personajes o temas dos espíritus. @es
related: LGBTQ+ fiction
related: LGBTQ+ science fiction
issued: 2023-06-26
modified: 2025-10-03
type: Concept
in scheme: v3
change note: Version 4.1.0

Two-Spirit graphic novels
preferred label: Novelas gráficas dos espíritus @es
alternative label: 2S graphic novels
alternative label: Two Spirit graphic novels
alternative label: Two Spirited graphic novels
alternative label: Two-Spirited graphic novels
comment: Works consisting of sequential images often accompanied by text that generally contain stand-alone stories; used in reference to graphic novels focusing on Two-Spirit characters or themes.
comment: Obras que consisten en imágenes secuenciales, a menudo acompañadas de texto, que generalmente contienen historias independientes; utilícese en referencia a novelas gráficas que se centran en personajes o temas dos espíritus. @es
related: LGBTQ+ graphic novels
issued: 2023-06-26
modified: 2025-02-23
type: Concept
in scheme: v3
change note: Version 4.1.0

Two-Spirit horror fiction
preferred label: Ficción de horror dos espíritus @es
alternative label: 2S horror fiction
alternative label: Two Spirit horror fiction
alternative label: Two Spirited horror fiction
alternative label: Two-Spirited horror fiction
comment: Written works of fiction intended to frighten, scare, or disgust; use in reference to horror fiction focusing on Two-Spirit characters or themes.
comment: Obras de ficción escritas con la intención de asustar, atemorizar o provocar disgusto; utilícese en referencia a la ficción de horror centrada en personajes o temas dos espíritus. @es
related: LGBTQ+ fiction
related: LGBTQ+ horror fiction
issued: 2023-06-26
modified: 2025-10-03
type: Concept
in scheme: v3
change note: Version 4.1.0

Two-Spirit mystery and detective fiction
preferred label: Ficción dos espíritus de misterio y de detectives @es
alternative label: 2S mystery and detective fiction
alternative label: Two Spirit mystery and detective fiction
alternative label: Two Spirited mystery and detective fiction
alternative label: Two-Spirited mystery and detective fiction
comment: Written literary works about the investigation of crime or the work of detectives; use in reference to mystery and detective fiction focusing on Two-Spirit characters and themes.
comment: Obras literarias escritas sobre la investigación de crímenes o el trabajo de detectives; utilícese en referencia a la ficción de misterio y de detectives centrada en personajes y temas dos espíritus. @es
related: LGBTQ+ fiction
related: LGBTQ+ mystery and detective fiction
issued: 2023-06-26
modified: 2025-10-03
type: Concept
in scheme: v3
change note: Version 4.1.0

Two-Spirit romance fiction
preferred label: Ficción de romance dos espíritus @es
alternative label: 2S romance fiction
alternative label: Two Spirit romance fiction
alternative label: Two Spirited romance fiction
alternative label: Two-Spirited romance fiction
comment: Works of fiction revolving around romantic and/or sexual relationships between the main characters; use in reference to romance fiction focusing on Two-Spirit characters.
comment: Obras de ficción que giran en torno a relaciones románticas y/o sexuales entre los personajes principales; utilícese en referencia a la ficción romántica centrada en personajes dos espíritus. @es
related: LGBTQ+ fiction
related: LGBTQ+ romance fiction
issued: 2023-06-26
modified: 2025-10-03
type: Concept
in scheme: v3
change note: Version 4.1.0

Non-binary disabled people
preferred label: Personas no binarias discapacitadas @es
alternative label: Disabled non-binary people
alternative label: Non-binary people with disabilities
alternative label: Personas discapacidades no binarias @es
alternative label: Personas no binarias con discapacidades @es
comment: Non-binary people who are disabled.
comment: Personas no binarias con discapacidad. @es
broader: LGBTQ+ disabled people
narrower: Non-binary neurodivergent people
narrower: Non-binary blind people
narrower: Non-binary hard of hearing people
narrower: Non-binary Deaf people
narrower: Non-binary wheelchair users
related: Non-binary people with chronic illnesses
has top concept: LGBTQ+ people
issued: 2023-06-26
modified: 2025-02-23
type: Concept
in scheme: v3
change note: Version 4.1.0

MVPFAFF+
comment: Acronym used to describe Pasifika/Pacific Islander gender diverse identities as a group. The acronym includes Māhū (Hawai'i and Tahiti), Vaka sa lewa lewa (Fiji), Palopa (Papua New Guinea), Fa’afafine (Samoa), Akava’ine (Rarotonga), Fakaleitī (Tonga), Fakafifine (Niue), and more.
comment: Acrónimo utilizado para describir las diversas identidades de género de los pasifika/isleños del Pacífico como grupo. El acrónimo incluye māhū (Hawái y Tahití), vaka sa lewa lewa (Fiyi), palopa (Papúa Nueva Guinea), va'afafine (Samoa), akava'ine (Rarotonga), fakaleitī (Tonga), fakafifine (Niue), etc. @es
broader: Non-Euro-American gender and sexual identities
narrower: Akava'ine
narrower: Fa'afafine
narrower: Fakaleitī
narrower: Māhū
narrower: Whakatane
narrower: Whakawāhine
has top concept: Gender
issued: 2023-06-26
modified: 2025-02-23
type: Concept
in scheme: v3
change note: Version 4.1.0

Māhūkāne
alternative label: Mahukane @haw
comment: A term coined by the Kānaka Maoli (Native Hawaiian) queer community in the early 2000s that blends the term Māhū (for third gender indigenous people of Hawai'i and Tahiti who blend genders and often hold spiritual roles) and kāne (man).
comment: Término acuñado por la comunidad queer kānaka maoli (nativos hawaianos) a principios de la década del 2000 que mezcla el término "māhū" (para las personas indígenas del tercer género de Hawái y Tahití que mezclan géneros y a menudo desempeñan funciones espirituales) y "kāne" (hombre). @es
broader: Māhū
has top concept: Gender
issued: 2023-06-26
modified: 2025-02-23
type: Concept
in scheme: v3
change note: Version 4.1.0

Māhūwahine
alternative label: Mahuwahine @haw
comment: A term coined by the Kānaka Maoli (Native Hawaiian) queer community in the early 2000s that blends the term Māhū (for third gender indigenous people of Hawai'i and Tahiti who blend genders and often hold spiritual roles) and wahine (woman).
comment: Término acuñado por la comunidad queer kānaka maoli (nativos hawaianos) a principios de la década del 2000 que mezcla el término "māhū" (para las personas indígenas del tercer género de Hawái y Tahití que mezclan géneros y a menudo desempeñan funciones espirituales) y "wahine" (mujer). @es
broader: Māhū
has top concept: Gender
issued: 2023-06-26
modified: 2025-02-23
type: Concept
in scheme: v3
change note: Version 4.1.0

Two-Spirit activism
preferred label: Activismo dos espíritus @es
alternative label: 2S activism
alternative label: Two Spirit activism
alternative label: Two Spiritied activism
alternative label: Two-Spirited activism
comment: Direct action and organizing to achieve political or social change and acceptance for Two-Spirit people.
comment: Acción directa y organización para lograr cambio político o social y la aceptación de las personas dos espíritus. @es
narrower: Two-Spirit demonstrations
related: LGBTQ+ activism
related: Two-Spirit political activists
related: Two-Spirit political groups
issued: 2023-06-26
modified: 2025-04-23
type: Concept
in scheme: v3
change note: Version 4.1.0

Two-Spirit political activists
preferred label: Activistas políticos dos espíritus @es
alternative label: 2S political activists
alternative label: Two Spirit political activists
alternative label: Two Spirited political activists
alternative label: Two-Spirited political activists
comment: Two-Spirit people working to bring about political or social change through public organizing.
comment: Personas dos espíritus que trabajan para lograr cambios políticos o sociales mediante la organización pública. @es
related: LGBTQ+ political activists
related: Two-Spirit activism
issued: 2023-06-26
modified: 2025-02-23
type: Concept
in scheme: v3
change note: Version 4.1.0

LGBTQ+ neurodivergent people
preferred label: Personas LGBTQ+ neurodivergentes @es
comment: LGBTQ+ people whose brains process, learn, and/or behave differently from what is considered typical by society. Some of these neurological differences can present as learning disabilities, medical disorders, and other conditions.
comment: Personas LGBTQ+ cuyos cerebros procesan, aprenden y/o se comportan de manera diferente a lo que la sociedad considera típico. Algunas de estas diferencias neurológicas pueden presentarse como problemas de aprendizaje, trastornos médicos y otras condiciones. @es
broader: LGBTQ+ disabled people
narrower: Gay neurodivergent men
narrower: Lesbian neurodivergent people
narrower: Bisexual neurodivergent people
narrower: Transgender neurodivergent people
narrower: Queer neurodivergent people
narrower: Asexual neurodivergent people
narrower: Intersex neurodivergent people
narrower: LGBTQ+ autistic people
related: Two-Spirit neurodivergent people
related: Neurogender
has top concept: LGBTQ+ people
issued: 2023-06-26
modified: 2026-03-05
type: Concept
in scheme: v3
change note: Version 4.1.0

Gay neurodivergent men
preferred label: Ficción gay de misterio y de detectives @es
alternative label: Neurodivergent gay people
alternative label: Neurodivergent gay men
alternative label: Gay neurodivergent people
comment: Gay men whose brains process, learn, and/or behave differently from what is considered typical by society. Some of these neurological differences can present as learning disabilities, medical disorders, and other conditions.
comment: Obras literarias escritas sobre la investigación de crímenes o el trabajo de detectives; utilícese en referencia a la ficción de misterio y de detectives centrada en personajes y temas gay. @es
broader: LGBTQ+ neurodivergent people
has top concept: LGBTQ+ people
issued: 2023-06-26
modified: 2026-03-03
type: Concept
in scheme: v3
change note: Version 4.1.0

Lesbian neurodivergent people
preferred label: Lesbianas neurodivergentes @es
comment: Lesbians whose brains process, learn, and/or behave differently from what is considered typical by society. Some of these neurological differences can present as learning disabilities, medical disorders, and other conditions.
comment: Lesbianas cuyos cerebros procesan, aprenden y/o se comportan de manera diferente a lo que la sociedad considera típico. Algunas de estas diferencias neurológicas pueden presentarse como problemas de aprendizaje, trastornos médicos y otras condiciones. @es
broader: LGBTQ+ neurodivergent people
has top concept: LGBTQ+ people
issued: 2023-06-26
modified: 2026-03-05
type: Concept
in scheme: v3
change note: Version 4.1.0

Bisexual neurodivergent people
preferred label: Musulmanes bisexuales @es
comment: Bisexual people whose brains process, learn, and/or behave differently from what is considered typical by society. Some of these neurological differences can present as learning disabilities, medical disorders, and other conditions.
comment: Personas bisexuales que son musulmanas. @es
broader: LGBTQ+ neurodivergent people
has top concept: LGBTQ+ people
issued: 2023-06-26
modified: 2026-03-03
type: Concept
in scheme: v3
change note: Version 4.1.0

Transgender neurodivergent people
preferred label: Personas transgénero neurodivergentes @es
alternative label: Neurodivergent transgender people
alternative label: Personas neurodivergentes transgénero @es
comment: Transgender people whose brains process, learn, and/or behave differently from what is considered typical by society. Some of these neurological differences can present as learning disabilities, medical disorders, and other conditions.
comment: Personas transgénero cuyos cerebros procesan, aprenden y/o se comportan de manera diferente a lo que la sociedad considera típico. Algunas de estas diferencias neurológicas pueden presentarse como problemas de aprendizaje, trastornos médicos y otras condiciones. @es
broader: LGBTQ+ neurodivergent people
has top concept: LGBTQ+ people
issued: 2023-06-26
modified: 2026-03-05
type: Concept
in scheme: v3
change note: Version 4.1.0

Queer neurodivergent people
preferred label: Personas queer neurodivergentes @es
alternative label: Neurodivergent queer people
alternative label: Personas neurodivergentes queer @es
comment: Queer people whose brains process, learn, and/or behave differently from what is considered typical by society. Some of these neurological differences can present as learning disabilities, medical disorders, and other conditions.
comment: Personas queer cuyos cerebros procesan, aprenden y/o se comportan de manera diferente a lo que la sociedad considera típico. Algunas de estas diferencias neurológicas pueden presentarse como problemas de aprendizaje, trastornos médicos y otras condiciones. @es
broader: LGBTQ+ neurodivergent people
has top concept: LGBTQ+ people
issued: 2023-06-26
modified: 2026-03-05
type: Concept
in scheme: v3
change note: Version 4.1.0

Asexual neurodivergent people
preferred label: Personas asexuales neurodivergentes @es
comment: Asexual people whose brains process, learn, and/or behave differently from what is considered typical by society. Some of these neurological differences can present as learning disabilities, medical disorders, and other conditions.
comment: Personas asexuales cuyos cerebros procesan, aprenden y/o se comportan de forma diferente a lo que la sociedad considera típico. Algunas de estas diferencias neurológicas pueden presentarse como dificultades de aprendizaje, trastornos médicos y otras condiciones. @es
broader: LGBTQ+ neurodivergent people
broader: Asexual disabled people
has top concept: LGBTQ+ people
issued: 2023-06-26
modified: 2026-03-03
type: Concept
in scheme: v3
change note: Version 4.1.0

Intersex neurodivergent people
preferred label: Personas intersex neurodivergentes @es
alternative label: Neurodivergent Intersex people
comment: Intersex people whose brains process, learn, and/or behave differently from what is considered typical by society. Some of these neurological differences can present as learning disabilities, medical disorders, and other conditions.
comment: Personas intersex cuyos cerebros procesan, aprenden y/o se comportan de manera diferente a lo que la sociedad considera típico. Algunas de estas diferencias neurológicas pueden presentarse como problemas de aprendizaje, trastornos médicos y otras condiciones. @es
broader: LGBTQ+ neurodivergent people
narrower: Intersex autistic people
has top concept: LGBTQ+ people
issued: 2023-06-26
modified: 2026-03-03
type: Concept
in scheme: v3
change note: Version 4.1.0

Two-Spirit neurodivergent people
preferred label: Personas dos espíritus neurodivergentes @es
alternative label: 2S neurodivergent people
alternative label: Two Spirit neurodivergent people
alternative label: Two Spirited neurodivergent people
alternative label: Two-Spirited neurodivergent people
comment: Two-Spirit people whose brains process, learn, and/or behave differently from what is considered typical by society. Some of these neurological differences can present as learning disabilities, medical disorders, and other conditions.
comment: Personas dos espíritus cuyos cerebros procesan, aprenden y/o se comportan de forma diferente a lo que la sociedad considera típico. Algunas de estas diferencias neurológicas pueden presentarse como dificultades de aprendizaje, trastornos médicos y otras condiciones. @es
broader: Two-Spirit people
narrower: Two-Spirit autistic people
related: LGBTQ+ neurodivergent people
has top concept: Gender
issued: 2023-06-26
modified: 2026-03-03
type: Concept
in scheme: v3
change note: Version 4.1.0

LGBTQ+ autistic people
preferred label: Personas LGBTQ+ autistas @es
alternative label: LGBTQ+ people with autism
alternative label: Personas LGBTQ+ con autismo @es
alternative label: Personas autistas LGBTQ+ @es
comment: LGBTQ+ people who are autistic.
comment: Personas LGBTQ+ que son autistas. @es
broader: LGBTQ+ neurodivergent people
narrower: Lesbian autistic people
narrower: Gay autistic men
narrower: Bisexual autistic people
narrower: Transgender autistic people
narrower: Queer autistic people
narrower: Non-binary autistic people
narrower: Intersex autistic people
narrower: Asexual autistic people
related: Two-Spirit autistic people
related: Autigender
has top concept: LGBTQ+ people
issued: 2023-06-26
modified: 2025-02-23
type: Concept
in scheme: v3
change note: Version 4.1.0

Lesbian autistic people
preferred label: Personas lesbianas autistas @es
alternative label: Lesbians with autism
alternative label: Lesbianas con autismo @es
alternative label: Autistas lesbianas @es
comment: Lesbians who are autistic.
comment: Lesbianas que son autistas. @es
broader: LGBTQ+ autistic people
has top concept: LGBTQ+ people
issued: 2023-06-26
modified: 2025-02-23
type: Concept
in scheme: v3
change note: Version 4.1.0

Gay autistic men
preferred label: Hombres gay autistas @es
alternative label: Gay men with autism
alternative label: Gay autistic people
alternative label: Gay people with autistic
alternative label: Gay autists
alternative label: Autistic gay men
alternative label: Autistic gay people
alternative label: Hombres autistas gay @es
alternative label: Hombres gay con autismo @es
comment: Gay men who are autistic.
comment: Hombres gay que son autistas. @es
broader: LGBTQ+ autistic people
has top concept: LGBTQ+ people
issued: 2023-06-26
modified: 2026-03-03
type: Concept
in scheme: v3
change note: Version 4.1.0

Bisexual autistic people
preferred label: Personas bisexuales autistas @es
alternative label: Bisexual people with autism
alternative label: Personas bisexuales con autismo @es
alternative label: Personas autistas bisexuales @es
comment: Bisexual people who are autistic.
comment: Personas bisexuales que son autistas. @es
broader: LGBTQ+ autistic people
has top concept: LGBTQ+ people
issued: 2023-06-26
modified: 2026-03-03
type: Concept
in scheme: v3
change note: Version 4.1.0

Transgender autistic people
preferred label: Personas transgénero autistas @es
alternative label: Transgender people with autism
alternative label: Personas autistas transgénero @es
alternative label: Personas transgénero con autismo @es
comment: Transgender people who are autistic.
comment: Personas transgénero que son autistas. @es
broader: LGBTQ+ autistic people
has top concept: LGBTQ+ people
issued: 2023-06-26
modified: 2026-02-23
type: Concept
in scheme: v3
change note: Version 4.1.0

Queer autistic people
preferred label: Personas queer autistas @es
alternative label: Autistic queer people
alternative label: Queer people with autism
alternative label: Personas autistas queer @es
alternative label: Personas queer con autismo @es
comment: Queer people who are autistic.
comment: Personas queer que son autistas. @es
broader: LGBTQ+ autistic people
has top concept: LGBTQ+ people
issued: 2023-06-26
modified: 2026-02-23
type: Concept
in scheme: v3
change note: Version 4.1.0

Non-binary autistic people
preferred label: Personas no binarias autistas @es
alternative label: Autistic non-binary people
alternative label: Non-binary people with autism
alternative label: Personas autistas no binarias @es
alternative label: Personas no binarias con autismo @es
comment: Non-binary people who are autistic.
comment: Personas no binarias que son autistas. @es
broader: LGBTQ+ autistic people
broader: Non-binary neurodivergent people
has top concept: LGBTQ+ people
issued: 2023-06-26
modified: 2025-02-23
type: Concept
in scheme: v3
change note: Version 4.1.0

Intersex autistic people
preferred label: Personas intersex autistas @es
alternative label: Autistic intersex people
alternative label: Intersex people with autism
alternative label: Personas autistas intersex @es
alternative label: Personas intersex con autismo @es
comment: Intersex people who are autistic.
comment: Personas intersex que son autistas. @es
broader: Intersex neurodivergent people
broader: LGBTQ+ autistic people
has top concept: LGBTQ+ people
issued: 2023-06-26
modified: 2025-02-23
type: Concept
in scheme: v3
change note: Version 4.1.0

Asexual autistic people
preferred label: Personas autistas asexuales @es
alternative label: Asexual people with autism
alternative label: Autistic asexual people
alternative label: Personas asexuales con autismo @es
alternative label: Autistas asexuales @es
comment: Asexual people who are autistic.
comment: Personas asexuales que son autistas. @es
broader: LGBTQ+ autistic people
has top concept: LGBTQ+ people
issued: 2023-06-26
modified: 2026-03-03
type: Concept
in scheme: v3
change note: Version 4.1.0

Two-Spirit autistic people
preferred label: Personas dos espíritus autistas @es
alternative label: 2S autistic people
alternative label: 2S people with autism
alternative label: Two Spirit autistic people
alternative label: Two Spirit people with autism
alternative label: Two Spirited autistic people
alternative label: Two Spirited people with autism
alternative label: Two-Spirited autistic people
alternative label: Two-Spirited people with autism
alternative label: Personas dos espíritus con autismo @es
alternative label: Personas autistas dos espíritus @es
comment: Two-Spirit people who are autistic.
comment: Personas dos espíritus que son autistas. @es
broader: Two-Spirit neurodivergent people
broader: Two-Spirit disabled people
related: LGBTQ+ autistic people
has top concept: Gender
issued: 2023-06-26
modified: 2025-02-23
type: Concept
in scheme: v3
change note: Version 4.1.0

Two-Spirit archives
preferred label: Archivos dos espíritus @es
alternative label: 2S archives
alternative label: Two Spirit archives
alternative label: Two Spirited archives
alternative label: Two-Spirited archives
comment: Collections of records and materials relating to Two-Spirit people or Two-Spirit communities; can include a variety of organizations and institutions from community to government archives.
comment: Colecciones de registros y materiales relacionados con personas dos espíritus o comunidades dos espíritus; pueden incluir una variedad de organizaciones e instituciones, desde archivos comunitarios hasta gubernamentales. @es
related: LGBTQ+ archives
issued: 2023-06-26
modified: 2026-02-23
type: Concept
in scheme: v3
change note: Version 4.1.0

Two-Spirit artists
preferred label: Artistas dos espíritus @es
alternative label: 2S artists
alternative label: Two Spirit artists
alternative label: Two Spirited artists
alternative label: Two-Spirited artists
comment: Two-Spirit people who practice any of various creative arts.
comment: Artistas que son dos espíritus. @es
broader: Two-Spirit people
narrower: Two-Spirit painters
narrower: Two-Spirit photographers
narrower: Two-Spirit cartoonists
narrower: Two-Spirit makeup artists
related: LGBTQ+ artists
has top concept: Gender
issued: 2023-06-26
modified: 2025-04-23
type: Concept
in scheme: v3
change note: Version 4.1.0

Two-Spirit autobiographies
preferred label: Autobiografías dos espíritus @es
alternative label: 2S autobiographies
alternative label: 2S autobios
alternative label: 2S memoirs
alternative label: Two Spirit autobiographies
alternative label: Two Spirit autobios
alternative label: Two Spirit memoirs
alternative label: Two Spirited autobiographies
alternative label: Two Spirited autobios
alternative label: Two Spirited memoirs
alternative label: Two-Spirited authobiographies
alternative label: Two-Spirited autobios
alternative label: Two-Spirited memoirs
alternative label: Memorias dos espíritus @es
comment: Accounts of Two-Spirit peoples' lives written by those people. For written accounts of Two-Spirit people's lives that were not written by the subject, use "Two-Spirit biographies."
comment: Relatos de vida de personas escritos por esas mismas personas; utilícese para autobiografías escritas por autores dos espíritus. @es
related: LGBTQ+ autobiographies
related: Two-Spirit authors
related: Two-Spirit biographies
issued: 2023-06-26
modified: 2025-02-23
type: Concept
in scheme: v3
change note: Version 4.1.0

Two-Spirit biographies
preferred label: Biografías dos espíritus @es
alternative label: 2S biographies
alternative label: Two Spirit biographies
alternative label: Two Spirited biographies
alternative label: Two-Spirited biographies
comment: Written accounts of the lives of Two-Spirit people. For written accounts of Two-Spirit people's lives written by the subject, use "Two-Spirit autobiographies."
comment: Relatos escritos de la vida de personas conocidas por ser dos espíritus. @es
related: LGBTQ+ biographies
related: Two-Spirit autobiographies
related: Two-Spirit authors
issued: 2023-06-26
modified: 2025-02-23
type: Concept
in scheme: v3
change note: Version 4.1.0

Two-Spirit bookshops
preferred label: Librerias dos espíritus @es
alternative label: 2S bookshops
alternative label: Two Spirit bookshops
alternative label: Two Spirited bookshops
alternative label: Two-Spirited bookshops
comment: Bookshops that sell materials intended for use by Two-Spirit people or addressing topics related to Two-Spirit experiences.
comment: Librerías que venden materiales destinados al uso de personas dos espíritus o que abordan temas relacionados con las comunidades dos espíritus. @es
related: LGBTQ+ bookshops
issued: 2023-06-26
modified: 2025-02-23
type: Concept
in scheme: v3
change note: Version 4.1.0

Two-Spirit disabled people
preferred label: Personas dos espíritus discapacitadas @es
alternative label: 2S disabled people
alternative label: Disabled 2S people
alternative label: Disabled Two Spirit people
alternative label: Disabled Two-Spirited people
alternative label: Two Spirit disabled people
alternative label: Two Spirited disabled people
alternative label: Two-Spirited disabled people
alternative label: Personas dos espíritus con discapacidades @es
alternative label: Discapacitados dos espíritus @es
alternative label: Personas discapacitadas dos espíritus @es
comment: Two-Spirit people who are disabled
comment: Personas dos espíritus con discapacidad. @es
broader: Two-Spirit people
narrower: Two-Spirit autistic people
narrower: Two-Spirit blind people
narrower: Two-Spirit Deaf people
narrower: Two-Spirit hard of hearing people
narrower: Two-Spirit wheelchair users
related: LGBTQ+ disabled people
related: Two-Spirit people with chronic illnesses
related: Two-Spirit people who use substances for medical purposes
has top concept: Gender
issued: 2023-06-26
modified: 2025-04-24
type: Concept
in scheme: v3
change note: Version 4.1.0

Two-Spirit blind people
preferred label: Personas dos espíritus ciegas @es
alternative label: 2S blind people
alternative label: Blind 2S people
alternative label: Blind Two Spirit people
alternative label: Blind Two Spirited people
alternative label: Blind Two-Spirited people
alternative label: Two Spirit blind people
alternative label: Two Spirited blind people
alternative label: Two-Spirited blind people
alternative label: Personas ciegas dos espíritus @es
alternative label: Ciegos dos espíritus @es
comment: Two-Spirit people with significant or total loss of vision.
comment: Personas dos espíritus con pérdida significativa o total de visión. @es
broader: Two-Spirit disabled people
related: LGBTQ+ blind people
has top concept: Gender
issued: 2023-06-26
modified: 2025-02-23
type: Concept
in scheme: v3
change note: Version 4.1.0

Two-Spirit Deaf people
preferred label: Personas dos espíritus sordas @es
alternative label: 2S Deaf people
alternative label: Deaf 2S people
alternative label: Deaf Two Spirit people
alternative label: Deaf Two Spirited people
alternative label: Deaf Two-Spirited people
alternative label: Two Spirit Deaf people
alternative label: Two Spirited Deaf people
alternative label: Two-Spirited Deaf people
alternative label: Peronas sordas dos espíritus @es
comment: Two-Spirit people with significant or total hearing loss. Some but not all Deaf people prefer to capitalize Deaf in recognition of the cultural and linguistic identity they share with other Deaf people.
comment: Personas dos espíritus con pérdida auditiva significativa o total. Algunas personas sordas, pero no todas, prefieren escribir “Sorda/o” con mayúscula en reconocimiento de la identidad cultural y lingüística que comparten con otras personas sordas. @es
broader: Two-Spirit disabled people
related: LGBTQ+ Deaf people
has top concept: Gender
issued: 2023-06-26
modified: 2025-02-23
type: Concept
in scheme: v3
change note: Version 4.1.0

Two-Spirit short stories
preferred label: Cuentos cortos dos espíritus @es
alternative label: 2S short stories
alternative label: Two Spirit short stories
alternative label: Two spirited short stories
comment: Written literary works that are short in length and detail a self-contained incident or concept; use in reference to short stories focusing on Two-Spirit characters or themes.
comment: Obras literarias escritas que son breves y detallan un incidente o concepto autónomo; utilícese en referencia a historias cortas que se centren en personajes o temas dos espíritus. @es
related: LGBTQ+ short stories
issued: 2023-06-26
modified: 2025-02-23
type: Concept
in scheme: v3
change note: Version 4.1.0

Two-Spirit characters
preferred label: Personajes dos espíritus @es
alternative label: 2S characters
alternative label: Two Spirit characters
alternative label: Two Spirited characters
alternative label: Two-Spirited characters
comment: Characters in creative works who are Two-Spirit
comment: Personajes de obras creativas que son dos espíritus. @es
related: LGBTQ+ characters
issued: 2023-06-26
modified: 2025-02-23
type: Concept
in scheme: v3
change note: Version 4.1.0

Two-Spirit children
alternative label: 2S children
alternative label: Two Spirit children
alternative label: Two Spirited children
alternative label: Two-Spirited children
comment: Two-Spirit people who have not yet reached the age of adolescence.
broader: Children
related: LGBTQ+ children
has top concept: Family members
issued: 2023-06-26
issued: 2024-06-10
modified: 2025-02-23
modified: 2025-01-28
type: Concept
in scheme: v3
change note: Version 4.1.0
narrower: Two-Spirit daughters
narrower: Two-Spirit sons
is replaced by: homoit0002688

Two-Spirit community centers
preferred label: Centros comunitarios dos espíritus @es
alternative label: 2S community centers
alternative label: Two Spirit community centers
alternative label: Two Spirited community centers
alternative label: Two-Spirit community centres
alternative label: Two-Spirited community centers
comment: Spaces in which people from Two-Spirit communities meet for social, education, recreational, or organizing activities.
comment: Espacios donde las personas de comunidades dos espíritus se reúnen para actividades sociales, educativas, recreativas u organizativas. @es
related: LGBTQ+ community centers
related: Two-Spirit people
related: Two-Spirit community
issued: 2023-06-26
modified: 2025-02-23
type: Concept
in scheme: v3
change note: Version 4.1.0

Two-Spirit couples
preferred label: Parejas dos espíritus @es
alternative label: 2S couples
alternative label: Two Spirit couples
alternative label: Two Spirited couples
alternative label: Two-Spirited couples
comment: Partnerships in which both people are Two-Spirit
comment: Relaciones de pareja donde las dos personas son dos espíritus. @es
related: LGBTQ+ couples
issued: 2023-06-26
modified: 2025-02-23
type: Concept
in scheme: v3
change note: Version 4.1.0

Two-Spirit drama
preferred label: Drama dos espíritus @es
alternative label: 2S drama
alternative label: Two Spirit drama
alternative label: Two Spirited drama
alternative label: Two-Spirited drama
comment: Works of fiction written to be performed; use in reference to dramatic works focusing on Two-Spirit characters or themes.
comment: Obras de ficción escritas para ser puestas en escena; utilícese en referencia a obras dramáticas que se centran en personajes o temas dos espíritus. @es
related: LGBTQ+ drama
issued: 2023-06-26
modified: 2025-02-23
type: Concept
in scheme: v3
change note: Version 4.1.0

Two-Spirit employment
preferred label: Empleo dos espíritus @es
alternative label: 2S employment
alternative label: Two Spirit employment
alternative label: Two Spirited employment
alternative label: Two-Spirited employment
comment: Employment of Two-Spirit people
comment: Empleo de personas dos espíritus. @es
related: LGBTQ+ employment
issued: 2023-06-26
modified: 2025-02-23
type: Concept
in scheme: v3
change note: Version 4.1.0

Two-Spirit hard of hearing people
preferred label: Personas dos espíritus con problemas de audición @es
alternative label: 2S hard of hearing people
alternative label: Two Spirit hard of hearing people
alternative label: Two Spirited hard of hearing people
alternative label: Two-Spirited hard of hearing people
alternative label: Personas dos espíritus con dificultades de audición @es
alternative label: Personas dos espíritus con dificultades auditivas @es
comment: Two-Spirit people with significant or total hearing loss who may or may not consider themselves d/Deaf.
comment: Personas dos espíritus con pérdida de audición significativa o total, que pueden o no considerarse S/sordas. @es
broader: Two-Spirit disabled people
related: LGBTQ+ hard of hearing people
has top concept: Gender
issued: 2023-06-26
modified: 2025-02-23
type: Concept
in scheme: v3
change note: Version 4.1.0

Two-Spirit people with chronic illnesses
preferred label: Personas dos espíritus con enfermedades crónicas @es
alternative label: 2S people with chronic illnesses
alternative label: Chronically ill 2S people
alternative label: Chronically ill Two Spirit people
alternative label: Chronically ill Two Spirited people
alternative label: Chronically ill Two-Spirited people
alternative label: Two Spirit people with chronic illnesses
alternative label: Two Spirited people with chronic illnesses
alternative label: Two-Spirited people with chronic illnesses
alternative label: Personas con enfermedades crónicas dos espíritus @es
alternative label: Enfermos crónicos dos espíritus @es
comment: Two-Spirit people who have long-term health conditions that require continued medical attention and/or significantly impact or limit daily life; some but not all people with chronic illnesses consider themselves disabled.
comment: Personas dos espíritus que padecen de condiciones de salud a largo plazo que requieren atención médica continua y/o que impactan o limitan significativamente sus vidas diarias; algunas, pero no todas, las personas con enfermedades crónicas se consideran discapacitadas. @es
related: LGBTQ+ people with chronic illnesses
related: Two-Spirit disabled people
related: Two-Spirit people who use substances for medical purposes
issued: 2023-06-26
modified: 2025-04-24
type: Concept
in scheme: v3
change note: Version 4.1.0

Two-Spirit wheelchair users
preferred label: Usarios dos espíritus de sillas de ruedas @es
alternative label: 2S wheelchair users
alternative label: Two Spirit wheelchair users
alternative label: Two Spirited wheelchair users
alternative label: Two-Spirited wheelchair users
comment: Two-Spirit people who use wheelchairs.
comment: Personas dos espíritus que utilizan sillas de ruedas. @es
broader: Two-Spirit disabled people
related: LGBTQ+ wheelchair users
has top concept: Gender
issued: 2023-06-26
modified: 2025-02-23
type: Concept
in scheme: v3
change note: Version 4.1.0

Two-Spirit information centers
preferred label: Centros de información dos espíritus @es
alternative label: 2S information centers
alternative label: Two Spirit information centers
alternative label: Two Spirited information centers
alternative label: Two-Spirit information centres
alternative label: Two-Spirited information centers
alternative label: Centros dos espíritus de información @es
comment: Institutions providing education, support, and information about Two-Spirit issues and Two-Spirit communities to Two-Spirit people.
comment: Instituciones que brindan educación, apoyo e información sobre temas dos espíritus y comunidades dos espíritus a personas dos espíritus. @es
related: LGBTQ+ information centers
issued: 2023-06-26
modified: 2025-02-23
type: Concept
in scheme: v3
change note: Version 4.1.0

Two-Spirit libraries
preferred label: Bibliotecas dos espíritus @es
alternative label: 2S libraries
alternative label: Two Spirit libraries
alternative label: Two Spirited libraries
alternative label: Two-Spirited libraries
comment: Libraries that hold materials primarily pertaining to Two-Spirit people or intended for use by Two-Spirit people.
comment: Bibliotecas que contienen materiales principalmente relacionados con personas dos espíritus o destinados a ser utilizados por personas dos espíritus. @es
related: LGBTQ+ libraries
issued: 2023-06-26
modified: 2026-02-23
type: Concept
in scheme: v3
change note: Version 4.1.0

Two-Spirit literary criticism
preferred label: Critica literaria dos espíritus @es
alternative label: 2S literary criticism
alternative label: Two Spirit literary criticism
alternative label: Two Spirited literary criticism
alternative label: Two-Spirited literary criticism
comment: The study, evaluation, and interpretation of literary works focusing on Two-Spirit characters or themes; can also include interpretation of literature through the lens and frameworks of Two-Spirit studies.
comment: El estudio, la evaluación y la interpretación de obras literarias centradas en personajes o temas dos espíritus; también puede incluir la interpretación de la literatura a través del lente y los marcos teóricos de los estudios dos espíritus. @es
related: LGBTQ+ literary criticism
issued: 2023-06-26
modified: 2025-02-23
type: Concept
in scheme: v3
change note: Version 4.1.0

Gender dysphoria in children
preferred label: Disforia de género en niños @es
comment: A psychological diagnosis (replacing the outdated and offensive "gender identity disorder") used to describe the sense of unease or dissatisfaction an individual feels as a result of incongruence between their gender identity and their assigned gender, gender expression, and/or the way their gender is perceived by others. This term is also used colloquially by individuals to describe the discomfort and distress they experience as a result of this incongruence. Though gender dysphoria is often associated with trans people, people of any identity may experience gender dysphoria when they do not feel "right" in their body or the way their gender is being expressed. Use this particular term for works about children who experience or have experienced gender dysphoria.
comment: Un diagnóstico psicológico (que reemplaza al término anticuado y ofensivo de "trastorno de identidad de género") utilizado para describir la sensación de malestar o insatisfacción que siente una persona como resultado de la incongruencia entre su identidad de género y su género asignado, su expresión de género y/o la forma en que su género es percibido por otras personas. Este término también se utiliza coloquialmente por personas para describir el malestar y la angustia que experimentan como resultado de esta incongruencia. Aunque la disforia de género a menudo se asocia con las personas trans, las personas de cualquier identidad pueden experimentar disforia de género cuando no se sienten "bien" con su cuerpo o con la forma en que se expresan su género. Utilícese este término particular para trabajos sobre niños que experimentan o han experimentado disforia de género. @es
broader: Gender dysphoria
related: LGBTQ+ children
related: Gender expression
related: Gender identity
related: Gender euphoria
has top concept: Gender dysphoria
issued: 2023-06-27
modified: 2025-02-23
type: Concept
in scheme: v3
change note: Version 4.1.0

Gender dysphoria in youth
preferred label: Disforia de género en jóvenes @es
alternative label: Gender dysphoria in adolescence
alternative label: Gender dysphoria in adolescents
alternative label: Disforia de género en la adolescencia @es
alternative label: Disforia de género en los adolescentes @es
comment: A psychological diagnosis (replacing the outdated and offensive "gender identity disorder") used to describe the sense of unease or dissatisfaction an individual feels as a result of incongruence between their gender identity and their assigned gender, gender expression, and/or the way their gender is perceived by others. This term is also used colloquially by individuals to describe the discomfort and distress they experience as a result of this incongruence. Though gender dysphoria is often associated with trans people, people of any identity may experience gender dysphoria when they do not feel "right" in their body or the way their gender is being expressed. Use this particular term for works about adolescents (people between the ages of childhood and adulthood) who experience or have experience gender dysphoria.
comment: Un diagnóstico psicológico (que reemplaza al término anticuado y ofensivo de "trastorno de identidad de género") utilizado para describir la sensación de malestar o insatisfacción que siente una persona como resultado de la incongruencia entre su identidad de género y su género asignado, su expresión de género y/o la forma en que su género es percibido por otras personas. Este término también se utiliza coloquialmente por personas para describir el malestar y la angustia que experimentan como resultado de esta incongruencia. Aunque la disforia de género a menudo se asocia con las personas trans, las personas de cualquier identidad pueden experimentar disforia de género cuando no se sienten "bien" con su cuerpo o con la forma en que se expresan su género. Utilícese este término particular para trabajos sobre adolescentes (personas entre la niñez y la edad adulta) que experimentan o han experimentado disforia de género @es
broader: Gender dysphoria
related: Gender expression
related: Gender identity
related: LGBTQ+ youth
related: Gender euphoria
has top concept: Gender dysphoria
issued: 2023-06-27
modified: 2025-02-23
type: Concept
in scheme: v3
change note: Version 4.1.0

LGBTQ+ comedians
preferred label: Comediantes LGBTQ+ @es
alternative label: LGBTQ+ comics (Persons)
alternative label: Comediantes (LGBTQ) @es
alternative label: Cómicos LGBTQ+ @es
alternative label: Cómicos LGBTQ @es
comment: LGBTQ+ people who seek to entertain an audience by making them laugh, through jokes, slapstick, employing prop comedy, or other amusing means.
comment: Personas LGBTQ+ que buscan entretener a una audiencia haciéndola reír, a través de bromas, payasadas, empleando comedia de utilería u otros medios divertidos. @es
narrower: Gay comedians
narrower: Lesbian comedians
narrower: Bisexual comedians
narrower: Transgender comedians
narrower: Queer comedians
narrower: Intersex comedians
narrower: Asexual comedians
related: Two-Spirit comedians
issued: 2023-06-27
modified: 2025-02-23
type: Concept
in scheme: v3
change note: Version 4.1.0

Gay comedians
preferred label: Comediantes gay @es
alternative label: Gay comics (Persons)
alternative label: Cómicos gay @es
comment: Gay people who seek to entertain an audience by making them laugh, through jokes, slapstick, employing prop comedy, or other amusing means.
comment: Hombres gay que buscan entretener a la audiencia haciéndolas reír, mediante bromas, payasadas, empleando comedia de utilería u otros medios divertidos. @es
broader: LGBTQ+ comedians
has top concept: LGBTQ+ comedians
issued: 2023-06-27
modified: 2025-02-23
type: Concept
in scheme: v3
change note: Version 4.1.0

Lesbian comedians
preferred label: Comediantes lesbianas @es
alternative label: Lesbian comics (Persons)
alternative label: Cómicas lesbianas (personas) @es
comment: Lesbians who seek to entertain an audience by making them laugh, through jokes, slapstick, employing prop comedy, or other amusing means.
comment: Lesbianas que buscan entretener a la audiencia haciéndola reír, mediante bromas, payasadas, empleando comedia de utilería u otros medios divertidos. @es
broader: LGBTQ+ comedians
has top concept: LGBTQ+ comedians
issued: 2023-06-27
modified: 2025-02-23
type: Concept
in scheme: v3
change note: Version 4.1.0

Bisexual comedians
preferred label: Comediantes bisexuales @es
alternative label: Bisexual comics (Persons)
alternative label: Cómicos bisexuales @es
alternative label: Cómicas bisexuales @es
comment: Bisexual people who seek to entertain an audience by making them laugh, through jokes, slapstick, employing prop comedy, or other amusing means.
comment: Personas bisexuales que buscan entretener a una audiencia haciéndolas reír, mediante bromas, payasadas, empleando comedia de utilería u otros medios de entretenimiento. @es
broader: LGBTQ+ comedians
has top concept: LGBTQ+ comedians
issued: 2023-06-27
modified: 2025-02-23
type: Concept
in scheme: v3
change note: Version 4.1.0

Transgender comedians
preferred label: Comediantes transgénero @es
alternative label: Transgender comics (Persons)
alternative label: Cómicos transgénero @es
comment: Transgender people who seek to entertain an audience by making them laugh, through jokes, slapstick, employing prop comedy, or other amusing means.
comment: Personas transgénero que buscan entretener a una audiencia haciéndola reír, a través de bromas, payasadas, empleando comedia de utilería u otros medios divertidos. @es
broader: LGBTQ+ comedians
has top concept: LGBTQ+ comedians
issued: 2023-06-27
modified: 2025-02-23
type: Concept
in scheme: v3
change note: Version 4.1.0

Queer comedians
preferred label: Comediantes queer @es
alternative label: Queer comics (Persons)
alternative label: Cómicos queer @es
comment: Queer people who seek to entertain an audience by making them laugh, through jokes, slapstick, employing prop comedy, or other amusing means.
comment: Personas queer que buscan entretener a una audiencia haciéndola reír, a través de bromas, payasadas, empleando comedia de utilería u otros medios divertidos. @es
broader: LGBTQ+ comedians
has top concept: LGBTQ+ comedians
issued: 2023-06-27
modified: 2025-02-23
type: Concept
in scheme: v3
change note: Version 4.1.0

Intersex comedians
preferred label: Comediantes intersex @es
alternative label: Intersex comics (Persons)
alternative label: Cómicos intersex @es
comment: Intersex people who seek to entertain an audience by making them laugh, through jokes, slapstick, employing prop comedy, or other amusing means.
comment: Personas intersex que buscan entretener a la audiencia haciéndolas reír, mediante bromas, payasadas, empleando comedia de utilería u otros medios divertidos. @es
broader: LGBTQ+ comedians
has top concept: LGBTQ+ comedians
issued: 2023-06-27
modified: 2025-02-23
type: Concept
in scheme: v3
change note: Version 4.1.0

Asexual comedians
preferred label: Comediantes asexuales @es
alternative label: Asexual comics (Persons)
alternative label: Cómicos asexuales @es
alternative label: Cómicas asexuales @es
comment: Asexual people who seek to entertain an audience by making them laugh, through jokes, slapstick, employing prop comedy, or other amusing means.
comment: Personas asexuales que buscan entretener a un público haciéndole reír, mediante chistes, payasadas, empleando comedia de atrezo u otros medios divertidos. @es
broader: LGBTQ+ comedians
has top concept: LGBTQ+ comedians
issued: 2023-06-27
modified: 2025-02-23
type: Concept
in scheme: v3
change note: Version 4.1.0

Two-Spirit comedians
preferred label: Comediantes dos espíritus @es
alternative label: 2S comedians
alternative label: 2S comics (Persons)
alternative label: Two Spirited comedians
alternative label: Two Spirited comics (Persons)
alternative label: Two-Spirited comedians
alternative label: Two-Spirited comics (Persons)
alternative label: Cómicos dos espíritus @es
comment: Two-Spirit people who seek to entertain an audience by making them laugh, through jokes, slapstick, employing prop comedy, or other amusing means.
comment: Personas dos espíritus que buscan entretener a la audiencia haciéndolas reír, mediante bromas, payasadas, empleando comedia de utilería u otros medios divertidos. @es
broader: Two-Spirit people
related: LGBTQ+ comedians
has top concept: Gender
issued: 2023-06-27
modified: 2025-02-23
type: Concept
in scheme: v3
change note: Version 4.1.0

Two-Spirit literature
preferred label: Literatura dos espíritus @es
alternative label: 2S literature
alternative label: Two Spirit literature
alternative label: Two Spirited literature
alternative label: Two-Spirited literature
comment: Written literary works about Two-Spirit characters or themes.
comment: Obras literarias escritas sobre la identidad dos espíritus, personajes dos espíritus o temas dos espíritus. @es
narrower: Two-Spirit fiction
narrower: Two-Spirit youth literature
narrower: Two-Spirit children's literature
narrower: Two-Spirit people's writings
narrower: Two-Spirit survival guides
related: LGBTQ+ literature
related: Two-Spirit authors
related: Two-Spirit people in literature
issued: 2023-06-27
modified: 2025-04-23
type: Concept
in scheme: v3
change note: Version 4.1.0

Two-Spirit youth
preferred label: Juventud dos espíritus @es
alternative label: 2S adolescents
alternative label: 2S teenagers
alternative label: 2S teens
alternative label: 2S youth
alternative label: Two Spirit adolescents
alternative label: Two Spirit teenagers
alternative label: Two Spirit teens
alternative label: Two Spirit youth
alternative label: Two Spirited adolescents
alternative label: Two Spirited teenagers
alternative label: Two Spirited teens
alternative label: Two Spirited youth
alternative label: Two-Spirited adolescents
alternative label: Two-Spirited teenagers
alternative label: Two-Spirited teens
alternative label: Two-Spirited youth
alternative label: Adolescentes dos espíritus @es
alternative label: Jóvenes dos espíritus @es
comment: Two-Spirit people who are between the ages of childhood and adulthood.
comment: Personas dos espíritus que se encuentran entre la infancia y la adultez. @es
broader: Youth
narrower: Two-Spirit youth survivors of bullying
narrower: Two-Spirit youth victims of bullying
related: LGBTQ+ youth
related: Two-Spirit youth literature
has top concept: Youth
issued: 2023-06-27
modified: 2025-02-23
type: Concept
in scheme: v3
change note: Version 4.1.0

Two-Spirit youth literature
preferred label: Literatura juvenil dos espíritus @es
alternative label: 2S youth literature
alternative label: Two Spirit youth literature
alternative label: Two Spirited youth literature
alternative label: Two-Spirited youth literature
comment: Written literary works for an audience of readers from 12-18 years of age, also known as young adult literature or YA; use in reference to youth literature focusing on Two-Spirit characters or themes.
comment: Obras literarias escritas para una audiencia de lectores de 12 a 18 años de edad, también conocida como literatura para adultos jóvenes o YA; utilícese en referencia a la literatura juvenil que se centra en personajes o temas dos espíritus @es
broader: Two-Spirit literature
related: LGBTQ+ youth literature
related: Two-Spirit youth
has top concept: Two-Spirit literature
issued: 2023-06-27
modified: 2025-02-23
type: Concept
in scheme: v3
change note: Version 4.1.0

Two-Spirit movement
preferred label: Movimiento dos espíritus @es
alternative label: 2S movement
alternative label: Two Spirit movement
alternative label: Two Spirited movement
alternative label: Two-Spirited movement
comment: Umbrella term for activism focused on the rights of Two-Spirit people and issues faced by Two-Spirit communities.
comment: Término general para el activismo centrado en los derechos de las personas dos espíritus y los problemas a los que se enfrentan las comunidades dos espíritus. @es
related: LGBTQ+ movement
related: Two-Spirit demonstrations
issued: 2023-06-27
modified: 2025-04-23
type: Concept
in scheme: v3
change note: Version 4.1.0

Two-Spirit newsletters
preferred label: Boletines dos espíritus @es
alternative label: 2S newsletters
alternative label: Two Spirit newsletters
alternative label: Two Spirited newsletters
alternative label: Two-Spirited newsletters
comment: Serialized print or digital periodicals created by or for Two-Spirit people, often with the purpose of sharing news and information related to Two-Spirit communities and Two-Spirit issues.
comment: Publicaciones periódicas impresas o digitales serializadas creadas por o para personas dos espíritus, a menudo con el propósito de compartir noticias e información relacionada con comunidades dos espíritus y cuestiones dos espíritus. @es
broader: Two-Spirit press
related: LGBTQ+ newsletters
has top concept: Two-Spirit press
issued: 2023-06-27
modified: 2025-02-23
type: Concept
in scheme: v3
change note: Version 4.1.0

Two-Spirit newspapers
preferred label: Periódicos dos espíritus @es
alternative label: 2S newspapers
alternative label: Two Spirit newspapers
alternative label: Two Spirited newspapers
alternative label: Two-Spirited newspapers
alternative label: Diarios dos espíritus @es
comment: Serialized print or digital publications about transgender people or Two-Spirit issues (and typically produced by Two-Spirit people or Two-Spirit organizations) that contain news, articles, columns, correspondence, and advertisements.
comment: Publicaciones impresas o digitales seriadas sobre personas o temas dos espíritus (y normalmente producidas por personas dos espíritus u organizaciones dos espíritus) que contienen noticias, artículos, columnas, correspondencia y anuncios. @es
broader: Two-Spirit press
related: LGBTQ+ newspapers
has top concept: Two-Spirit press
issued: 2023-06-27
modified: 2026-01-08
type: Concept
in scheme: v3
change note: Version 4.1.0

Two-Spirit museums
preferred label: Museos dos espíritus @es
alternative label: 2S museums
alternative label: Two Spirit museums
alternative label: Two Spirited museums
alternative label: Two-Spirited museums
comment: Institutions dedicated to the storage, exhibition, conservation, and preservation of materials relating to Two-Spirit people and Two-Spirit history.
comment: Instituciones dedicadas al almacenamiento, la exposición, la conservación y la preservación de materiales relacionados con las personas dos espíritus y la historia dos espíritus. @es
related: LGBTQ+ museums
issued: 2023-06-27
modified: 2026-02-23
type: Concept
in scheme: v3
change note: Version 4.1.0

Two-Spirit partners
preferred label: Parejas dos espíritus @es
alternative label: 2S partners
alternative label: Two Spirit partners
alternative label: Two Spirited partners
alternative label: Two-Spirited partners
comment: Two-Spirit people who are the romantic, sexual, or play partners of another person or people.
comment: Personas dos espíritus que son la pareja romántica, sexual o de juegos de otra persona o personas. @es
broader: Two-Spirit people
broader: Partners
has top concept: Gender
issued: 2023-06-27
modified: 2025-02-23
type: Concept
in scheme: v3
change note: Version 4.1.0

Two-Spirit people in the military
preferred label: Personas dos espíritus en el ejército @es
alternative label: 2S people in the military
alternative label: Two Spirit people in the military
alternative label: Two Spirited people in the military
alternative label: Two-Spirited people in the military
alternative label: Personas dos espíritus en las fuerzas armadas @es
comment: Two-Spirit people serving in state and national armed forces.
comment: Personas dos espíritus que sirven en las fuerzas armadas estatales y nacionales. @es
related: LGBTQ+ people in the military
issued: 2023-06-27
modified: 2025-02-23
type: Concept
in scheme: v3
change note: Version 4.1.0

Two-Spirit press
preferred label: Prensa dos espíritus @es
alternative label: 2S press
alternative label: Two Spirit press
alternative label: Two Spirited press
alternative label: Two-Spirited press
comment: Newspapers, magazines, or other publishing outlets aimed at Two-Spirit audiences and/or operated by Two-Spirit people.
comment: Periódicos, revistas u otros medios editoriales dirigidos a audiencias dos espíritus y/o operados por personas dos espíritus. @es
narrower: Two-Spirit newsletters
narrower: Two-Spirit newspapers
narrower: Two-Spirit zines
related: LGBTQ+ press
issued: 2023-06-27
modified: 2025-02-23
type: Concept
in scheme: v3
change note: Version 4.1.0

Two-Spirit publishers
preferred label: Editoriales dos espíritus @es
alternative label: 2S publishers
alternative label: Two Spirit publishers
alternative label: Two Spirited publishers
alternative label: Two-Spirited publishers
comment: Companies and organizations that publish materials for Two-Spirit communities or addressing Two-Spirit issues.
comment: Empresas y organizaciones que publican materiales para comunidades dos espíritus o que abordan asuntos dos espíritus. @es
related: LGBTQ+ publishers
issued: 2023-06-27
modified: 2025-02-23
type: Concept
in scheme: v3
change note: Version 4.1.0

Two-Spirit radio
preferred label: Radio dos espíritus @es
alternative label: 2S radio
alternative label: Two Spirit radio
alternative label: Two Spirited radio
alternative label: Two-Spirited radio
comment: Auditory content broadcast on the radio (analog or digital) about Two-Spirit people and Two-Spirit issues.
comment: Contenido auditivo emitido por radio (análoga o digital) sobre personas dos espíritus y asuntos dos espíritus. @es
related: LGBTQ+ radio
issued: 2023-06-27
modified: 2026-02-23
type: Concept
in scheme: v3
change note: Version 4.1.0

Two-Spirit relationships
preferred label: Relaciones dos espíritus @es
alternative label: 2S relationships
alternative label: Two Spirit relationships
alternative label: Two Spirited relationships
alternative label: Two-Spirited relationships
comment: Ongoing connections (romantic, sexual, or platonic) between two or more Two-Spirit people.
comment: Conexiones continuas (románticas, sexuales o platónicas) entre dos o más personas dos espíritus. @es
related: Relationship satisfaction
issued: 2023-06-27
modified: 2025-02-23
type: Concept
in scheme: v3
change note: Version 4.1.0

Two-Spirit rights
preferred label: Derechos dos espíritus @es
alternative label: 2S rights
alternative label: Two Spirit rights
alternative label: Two Spirited rights
alternative label: Two-Spirited rights
comment: Legal, social, or ethical principles of freedom or entitlement held by Two-Spirit people.
comment: Principios legales, sociales o éticos de la libertad o del derecho que tienen las personas dos espíritus. @es
related: LGBTQ+ civil rights
issued: 2023-06-27
modified: 2025-02-23
type: Concept
in scheme: v3
change note: Version 4.1.0

Two-Spirit slang
preferred label: Jerga dos espíritus @es
alternative label: 2S slang
alternative label: Two Spirit slang
alternative label: Two Spirited slang
alternative label: Two-Spirited slang
comment: Colloquial or informal language related to Two-Spirit identity or used by Two-Spirit people.
comment: Lenguaje coloquial o informal en relación a la identidad dos espíritus o utilizado por personas dos espíritus. @es
related: LGBTQ+ slang
issued: 2023-06-27
modified: 2025-02-23
type: Concept
in scheme: v3
change note: Version 4.1.0

Two-Spirit studies
preferred label: Estudios dos espíritus @es
alternative label: 2S studies
alternative label: Two Spirit studies
alternative label: Two Spirited studies
alternative label: Two-Spirited studies
comment: Academic field of research and study about Two-Spirit people, Two-Spirit identity, and Two-Spirit communities.
comment: Campo académico de investigación y estudio sobre las personas dos espíritus, la identidad dos espíritus y las comunidades dos espíritus. @es
related: Gender studies
related: Queer studies
issued: 2023-06-27
modified: 2026-02-24
type: Concept
in scheme: v3
change note: Version 4.1.0

Two-Spirit survivors of hate crimes
preferred label: Sobrevivientes dos espíritus de crímenes de odio @es
alternative label: 2S survivors of hate crimes
alternative label: Two Spirit survivors of hate crimes
alternative label: Two Spirited survivors of hate crimes
alternative label: Two-Spirited survivors of hate crimes
comment: Two-Spirit people who have experienced and survived hate crimes; follow the individual's preference for "victims" or "survivors" whenever possible.
comment: Personas dos espíritus que han sufrido y sobrevivido a crímenes de odio; siga la preferencia de la persona sobre el uso de "víctimas" o "sobrevivientes" siempre que sea posible. @es
related: LGBTQ+ survivors of hate crimes
issued: 2023-06-27
modified: 2025-02-23
type: Concept
in scheme: v3
change note: Version 4.1.0

Two-Spirit survivors of rape
preferred label: Sobrevivientes dos espíritus de violación @es
alternative label: 2S survivors of rape
alternative label: Two Spirit survivors of rape
alternative label: Two Spirited survivors of rape
alternative label: Two-Spirited survivors of rape
comment: Two-Spirit people who have experienced and survived rape; follow the individual's preference for "victims" or "survivors" whenever possible.
comment: Personas dos espíritus que han sufrido y sobrevivido a una violación; siga la preferencia de la persona sobre el uso de "víctimas" o "sobrevivientes" siempre que sea posible. @es
related: LGBTQ+ survivors of rape
issued: 2023-06-27
modified: 2025-02-23
type: Concept
in scheme: v3
change note: Version 4.1.0

Two-Spirit survivors of sexual abuse
preferred label: Sobreviventes dos espíritus de abuso sexual @es
alternative label: 2S survivors of sexual abuse
alternative label: Two Spirit survivors of sexual abuse
alternative label: Two Spirited survivors of sexual abuse
alternative label: Two-Spirited survivors of sexual abuse
comment: Two-Spirit people who have experienced and survived sexual abuse; follow the individual's preference for "victims" or "survivors" whenever possible.
comment: Personas dos espíritus que han sufrido y sobrevivido a abusos sexuales; siga la preferencia de la persona sobre el uso de "víctimas" o "sobrevivientes" siempre que sea posible. @es
related: LGBTQ+ survivors of sexual abuse
issued: 2023-06-27
modified: 2025-02-23
type: Concept
in scheme: v3
change note: Version 4.1.0

Two-Spirit survivors of war
preferred label: Sobrevivientes dos espíritus de guerra @es
alternative label: 2S survivors of war
alternative label: Two Spirit survivors of war
alternative label: Two Spirited survivors of war
alternative label: Two-Spirited survivors of war
comment: Two-Spirit people who have experienced and survived war; follow the individual's preference for "victims" or "survivors" whenever possible.
comment: Personas dos espíritus que han sufrido y sobrevivido a la guerra; siga la preferencia de la persona sobre el uso de "víctimas" o "sobrevivientes" siempre que sea posible. @es
related: LGBTQ+ survivors of war
issued: 2023-06-27
modified: 2025-02-23
type: Concept
in scheme: v3
change note: Version 4.1.0

Two-Spirit television
preferred label: Televisión dos espíritus @es
alternative label: 2S television
alternative label: Two Spirit television
alternative label: Two Spirited television
alternative label: Two-Spirited television
comment: Television shows featuring Two-Spirit characters or themes.
comment: Programas de televisión con personajes o temas dos espíritus. @es
related: LGBTQ+ television
issued: 2023-06-27
modified: 2025-02-23
type: Concept
in scheme: v3
change note: Version 4.1.0

Two-Spirit theater
preferred label: Teatro dos espíritus @es
preferred label: 2S theatre
preferred label: Two Spirited theatre
preferred label: Two-Spirit theatre
preferred label: Two-Spirited theatre
alternative label: 2S theater
alternative label: Two Spirit theater
alternative label: Two Spirited theater
alternative label: Two-Spirited theater
comment: Works in the performance arts that focus on Two-Spirit characters or themes.
comment: Obras de artes escénicas que se centran en personajes, comunidades o cuestiones dos espíritus. @es
related: LGBTQ+ theater
issued: 2023-06-27
modified: 2025-02-23
type: Concept
in scheme: v3
change note: Version 4.1.0

Two-Spirit victims of hate crimes
preferred label: Víctimas dos espíritus de crímenes de odio @es
alternative label: 2S victims of hate crimes
alternative label: Two Spirit victims of hate crimes
alternative label: Two Spirited victims of hate crimes
alternative label: Two-Spirited victims of hate crimes
comment: Two-Spirit people who have experienced hate crimes and may or may not have survived; follow the individual's preference for "victims" or "survivors" whenever possible.
comment: Personas dos espíritus que han sufrido crímenes de odio y pueden haber sobrevivido o no; siga la preferencia de la persona sobre el uso de "víctimas" o "sobrevivientes" siempre que sea posible. @es
broader: Two-Spirit victims of crime
related: LGBTQ+ victims of hate crimes
has top concept: Gender
issued: 2023-06-27
modified: 2025-02-23
type: Concept
in scheme: v3
change note: Version 4.1.0

Two-Spirit victims of rape
preferred label: Víctimas dos espíritus de violación @es
alternative label: 2S victims of rape
alternative label: Two Spirit victims of rape
alternative label: Two Spirited victims of rape
alternative label: Two-Spirited victims of rape
comment: Two-Spirit people who have experienced rape and may or may not have survived; follow the individual's preference for "victims" or "survivors" whenever possible.
comment: Personas dos espíritus que han sufrido una violación y pueden haber sobrevivido o no; siga la preferencia de la persona sobre el uso de "víctimas" o "sobrevivientes" siempre que sea posible. @es
broader: Two-Spirit victims of crime
related: LGBTQ+ victims of rape
has top concept: Gender
issued: 2023-06-27
modified: 2025-02-23
type: Concept
in scheme: v3
change note: Version 4.1.0

Two-Spirit victims of sexual abuse
preferred label: Víctimas dos espiritus de abuso sexual @es
alternative label: 2S victims of sexual abuse
alternative label: Two Spirit victims of sexual abuse
alternative label: Two Spirited victims of sexual abuse
alternative label: Two-Spirited victims of sexual abuse
comment: Two-Spirit people who have experienced sexual abuse and may or may not have survived; follow the individual's preference for "victims" or "survivors" whenever possible.
comment: Personas dos espíritus que han sufrido abuso sexual y pueden haber sobrevivido o no; siga la preferencia de la persona sobre el uso de "víctimas" o "sobrevivientes" siempre que sea posible. @es
broader: Two-Spirit people
broader: Two-Spirit victims of crime
related: LGBTQ+ victims of sexual abuse
has top concept: Gender
issued: 2023-06-27
modified: 2025-02-23
type: Concept
in scheme: v3
change note: Version 4.1.0

Two-Spirit victims of war
preferred label: Víctimas dos espíritus de guerra @es
alternative label: 2S victims of war
alternative label: Two Spirit victims of war
alternative label: Two Spirited victims of war
alternative label: Two-Spirited victims of war
comment: Two-Spirit people who have experienced war and may or may not have survived; follow the individual's preference for "victims" or "survivors" whenever possible.
comment: Personas dos espíritus que han sufrido la guerra y que pueden haber sobrevivido o no; siga la preferencia de la persona sobre el uso de "víctimas" o "sobrevivientes" siempre que sea posible. @es
broader: Two-Spirit victims of crime
related: LGBTQ+ victims of war
has top concept: Gender
issued: 2023-06-27
modified: 2025-02-23
type: Concept
in scheme: v3
change note: Version 4.1.0

Two-Spirit victims' rights
preferred label: Derechos de las víctimas dos espiritus @es
alternative label: 2S victims' rights
alternative label: Two Spirit victims' rights
alternative label: Two Spirited victims' rights
alternative label: Two-Spirited victims' rights
comment: Two-Spirit people’s legal rights to be informed, present, and heard within the criminal justice system after having been harmed or injured as the result of of a crime, accident, or other event.
comment: Los derechos legales de las personas dos espíritus a estar informadas, estar presentes y ser escuchadas dentro del sistema de justicia penal después de haber sido perjudicadas o lesionadas como resultado de un delito, una accidente u otro evento. @es
related: LGBTQ+ victims' rights
issued: 2023-06-27
modified: 2025-02-23
type: Concept
in scheme: v3
change note: Version 4.1.0

Two-Spirit-focused businesses
preferred label: Negocios orientados a personas dos espíritus @es
alternative label: 2S-focused businesses
alternative label: Two Spirit-focused businesses
alternative label: Two Spirited-focused businesses
alternative label: Two-Spirited-focused businesses
alternative label: Empresas orientadas a personas dos espíritus @es
alternative label: Compañías orientadas a personas dos espíritus @es
comment: Businesses focusing on Two-Spirit clientele and products related to Two-Spirit communities.
comment: Empresas enfocadas en clientela dos espíritus y productos relacionados con las comunidades dos espíritus. @es
related: LGBTQ+-focused businesses
issued: 2023-06-27
modified: 2025-02-23
type: Concept
in scheme: v3
change note: Version 4.1.0

Two-Spirit-owned businesses
preferred label: Empresas propiedad de personas dos espíritus @es
alternative label: 2S-owned businesses
alternative label: Two Spirit-owned businesses
alternative label: Two Spirited-owned businesses
alternative label: Two-Spirited-owned businesses
alternative label: Negocios de dueños dos espíritus @es
alternative label: Compañías de dueños dos espíritus @es
comment: Businesses owned by Two-Spirit people.
comment: Empresas pertenecientes a personas dos espíritus. @es
related: LGBTQ+-owned businesses
issued: 2023-06-27
modified: 2025-02-23
type: Concept
in scheme: v3
change note: Version 4.1.0

Intersex drama
preferred label: Drama intersex @es
comment: Works of fiction written to be performed; use in reference to dramatic works focusing on intersex characters or themes.
comment: Obras de ficción escritas para ser puestas en escena; utilícese en referencia a obras dramáticas que se centran en personajes o temas intersex. @es
broader: LGBTQ+ drama
has top concept: Subcultures
issued: 2023-06-27
modified: 2025-02-23
type: Concept
in scheme: v3
change note: Version 4.1.0

Intersex employment
preferred label: Empleo intersex @es
comment: Employment of intersex people.
comment: Empleo de personas intersex. @es
broader: LGBTQ+ employment
has top concept: LGBTQ+ employment
issued: 2023-06-27
modified: 2025-02-23
type: Concept
in scheme: v3
change note: Version 4.1.0

Intersex fathers
preferred label: Padres intersex @es
alternative label: Papás intersex @es
comment: Intersex people who are fathers. Only use for people who identify as fathers.
comment: Personas intersex que son padres. Utilícese únicamente para personas que se autoidentifiquen como padres. @es
broader: LGBTQ+ fathers
related: Intersex parents
has top concept: Family members
issued: 2023-06-27
modified: 2025-02-23
type: Concept
in scheme: v3
change note: Version 4.1.0

Parents of intersex people
preferred label: Madres y padres de personas intersexuales @es
alternative label: Intersex people's parents
alternative label: Padres de intersexuales @es
alternative label: Padres de personas intersex @es
comment: People who act as parents to one or more intersex person. For parents who are themselves intersex, use the term "intersex parents."
comment: Personas que actúan como padres de una o más personas intersexuales. Para padres que son intersexuales, utilice el término "madres y padres intersexuales". @es
broader: Parents of LGBTQ+ people
has top concept: Family members
issued: 2023-06-27
modified: 2025-02-23
type: Concept
in scheme: v3
change note: Version 4.1.0

Partners of intersex people
preferred label: Parejas de personas intersexuales @es
alternative label: Parejas de personas intersex @es
comment: People whose sexual, romantic, or play partner is intersex.
comment: Personas cuya pareja sexual, romántica o de juego es intersexual. @es
broader: Partners of LGBTQ+ people
has top concept: Partners
issued: 2023-06-27
modified: 2025-02-23
type: Concept
in scheme: v3
change note: Version 4.1.0

Persecution of intersex people
preferred label: Persecución de personas intersexuales @es
alternative label: Persecución de personas intersex @es
comment: Systematic mistreatment of intersex people on the basis of their sex or gender identity.
comment: Maltrato sistemático a personas intersexuales por razón de su sexo o identidad de género. @es
broader: LGBTQ+ persecutions
related: Intersex people
has top concept: LGBTQ+ persecutions
issued: 2023-06-27
modified: 2025-02-23
type: Concept
in scheme: v3
change note: Version 4.1.0

Sons of intersex people
preferred label: Hijos de personas intersexuales @es
alternative label: Hijos de personas intersex @es
comment: Sons who have one or more intersex parent. For sons who are themselves intersex, use the term "Intersex sons."
comment: Hijos que tienen uno o más padres intersexuales. Para los hijos que son intersexuales, utilice el término "hijos intersexuales". @es
broader: Sons of LGBTQ+ people
related: Children of intersex people
has top concept: Family members
issued: 2023-06-27
modified: 2025-02-23
type: Concept
in scheme: v3
change note: Version 4.1.0

White intersex people
preferred label: Personas intersexuales blancas @es
alternative label: Intersex Caucasian people
alternative label: Intersex white people
alternative label: Personas caucásicas intersex @es
alternative label: Personas intersex blancas @es
comment: Intersex people who are white.
comment: Personas intersexuales que son blancas. @es
broader: White LGBTQ+ people
has top concept: White LGBTQ+ people
issued: 2023-06-27
modified: 2025-02-23
type: Concept
in scheme: v3
change note: Version 4.1.0

Intersex information centers
preferred label: Centros de información intersex @es
alternative label: Intersex information centres
comment: Institutions providing education, support, and information about intersex issues and intersex communities to intersex people.
comment: Instituciones que brindan educación, apoyo e información sobre cuestiones intersex y comunidades intersex a personas intersex. @es
broader: LGBTQ+ information centers
has top concept: LGBTQ+ centers
issued: 2023-06-27
modified: 2025-02-23
type: Concept
in scheme: v3
change note: Version 4.1.0

Intersex libraries
preferred label: Bibliotecas intersex @es
comment: Libraries that hold materials primarily pertaining to intersex people or intended for use by intersex people.
comment: Bibliotecas que contienen materiales principalmente relacionados con personas intersex o destinados a ser utilizados por personas intersex. @es
broader: LGBTQ+ libraries
has top concept: LGBTQ+ cultural heritage institutions
issued: 2023-06-27
modified: 2025-02-23
type: Concept
in scheme: v3
change note: Version 4.1.0

Intersex literary criticism
preferred label: Crítica literaria intersex @es
comment: The study, evaluation, and interpretation of literary works focusing on intersex characters or themes; can also include interpretation of literature through the lens and frameworks of intersex studies.
comment: El estudio, la evaluación y la interpretación de obras literarias centradas en personajes o temas intersex; también puede incluir la interpretación de la literatura a través del lente y los marcos teóricos de los estudios intersex. @es
broader: LGBTQ+ literary criticism
has top concept: LGBTQ+ literary criticism
issued: 2023-06-27
modified: 2025-02-23
type: Concept
in scheme: v3
change note: Version 4.1.0

Intersex literature
preferred label: Literatura intersex @es
comment: Written literary works about intersex characters or themes.
comment: Obras literarias escritas sobre personajes o temas intersex. @es
broader: LGBTQ+ literature
narrower: Intersex youth literature
related: Intersex authors
related: Intersex people in literature
has top concept: Subcultures
issued: 2023-06-27
modified: 2025-04-23
type: Concept
in scheme: v3
change note: Version 4.1.0

Intersex activism
preferred label: Activismo intersex @es
comment: Direct action and organizing to achieve political or social change, bodily autonomy, and acceptance for intersex people.
comment: Acción directa y organización para lograr cambios políticos o sociales, autonomía corporal y aceptación de las personas intersex. @es
broader: LGBTQ+ activism
narrower: Intersex political activists
has top concept: LGBTQ+ activism
issued: 2023-06-27
modified: 2025-02-23
type: Concept
in scheme: v3
change note: Version 4.1.0

Intersex people of color
preferred label: Personas intersex de color @es
alternative label: Intersex people of colour
comment: Primarily used in the United States, this term refers to intersex people who are not white and who identify as people of color.
comment: Personas intersex que no son blancas y que se autoidentifican como personas de color. @es
broader: LGBTQ+ people of color
has top concept: LGBTQ+ people
issued: 2023-06-27
modified: 2025-02-23
type: Concept
in scheme: v3
change note: Version 4.1.0

Asian American intersex people
preferred label: Personas intersexuales asiático-americanas @es
alternative label: Intersex Asian American people
alternative label: Intersex Asian Americans
alternative label: Personas asiático-americanas intersex @es
alternative label: Asiático-americanos intersex @es
alternative label: Asiático-americanas intersex Personas intersex asiático-americanas @es
comment: Intersex people of Asian heritage or descent born in the United States or born in Asian countries who live in or have a strong connection to the United States. Only use for individuals who self-identify as Asian American.
comment: Personas intersexuales de herencia o ascendencia asiática nacidas en los Estados Unidos o nacidas en países asiáticos que viven en o tienen una conexión fuerte con los Estados Unidos. Utilícese para personas que se autoidentifiquen como asiático-americanas. @es
broader: Asian American LGBTQ+ people
related: Asian intersex people
has top concept: LGBTQ+ people
issued: 2023-06-27
modified: 2025-02-23
type: Concept
in scheme: v3
change note: Version 4.1.0

Asian intersex people
preferred label: Personas intersexuales asiáticas @es
alternative label: Intersex Asian people
alternative label: Intersex Asians
alternative label: Personas asiáticas intersex @es
alternative label: Asiáticos intersex @es
alternative label: Asiáticas intersex @es
alternative label: Personas intersex asiáticas @es
comment: Intersex individuals of Asian heritage or descent, living in Asia or part of the Asian diaspora. Only use for people who self-identify as Asian.
comment: Personas intersexuales de herencia o ascendencia asiática, que viven en Asia o forman parte de la diáspora asiática. Utilícese únicamente para personas que se identifican como asiáticas. @es
broader: Asian LGBTQ+ people
related: Asian American intersex people
has top concept: LGBTQ+ people
issued: 2023-06-27
modified: 2025-02-23
type: Concept
in scheme: v3
change note: Version 4.1.0

Asexual activism
preferred label: Activismo asexual @es
comment: Direct action and organizing to achieve political or social change and acceptance for asexual people.
comment: Acción directa y organización para lograr el cambio político o social y la aceptación de las personas asexuales. @es
broader: LGBTQ+ activism
narrower: Asexual political activists
has top concept: LGBTQ+ activism
issued: 2023-06-27
modified: 2025-02-23
type: Concept
in scheme: v3
change note: Version 4.1.0

Asexual archives
preferred label: Archivos asexuales @es
comment: Collections of records and materials relating to asexual people or asexual communities; can include a variety of organizations and institutions from community to government archives.
comment: Colecciones de registros y materiales relacionados con personas asexuales o comunidades asexuales; puede incluir a una variedad de organizaciones e instituciones, desde archivos comunitarios hasta gubernamentales. @es
broader: LGBTQ+ archives
has top concept: LGBTQ+ cultural heritage institutions
issued: 2023-06-27
modified: 2025-02-23
type: Concept
in scheme: v3
change note: Version 4.1.0

Asexual artists
preferred label: Artistas asexuales @es
comment: Asexual people who practice any of various creative arts.
comment: Artistas conocidos por ser asexuales. @es
broader: LGBTQ+ artists
has top concept: LGBTQ+ people
issued: 2023-06-27
modified: 2025-02-23
type: Concept
in scheme: v3
change note: Version 4.1.0

Asexual athletes
preferred label: Atletas asexuales @es
alternative label: Asexual sports players
alternative label: Asexual sportspeople
alternative label: Asexual sportspersons
alternative label: Jugadores de deportes asexuales @es
alternative label: Jugadoras de deportes asexuales @es
alternative label: Deportistas asexuales @es
comment: Professional or recreational sports players who self-identify as asexual.
comment: Deportistas profesionales o recreativos que se autoidentifican como asexuales. @es
broader: Asexual people
has top concept: Sexual minorities
issued: 2023-06-27
modified: 2026-02-24
type: Concept
in scheme: v3
change note: Version 4.1.0

Asexual bookshops
preferred label: Librerías asexuales @es
comment: Bookshops that sell materials intended for use by asexual people or addressing topics related to asexual experiences.
comment: Librerías que venden materiales dirigidos a personas asexuales o que abordan temas relacionados con experiencias asexuales. @es
broader: LGBTQ+ bookshops
has top concept: LGBTQ+ bookshops
issued: 2023-06-27
modified: 2025-02-23
type: Concept
in scheme: v3
change note: Version 4.1.0

Black intersex people
preferred label: Personas intersexuales negras @es
alternative label: Intersex Black people
alternative label: Personas negras intersex @es
alternative label: Personas intersex negras @es
comment: Black people who are intersex. Use only for individuals who self-identity as Black. Follow the individual’s preference for African American or Black whenever possible.
comment: Personas negras que son intersexuales. Utilícese únicamente para personas que seautoidentificancomo negras. Siga la preferencia del individuo para el uso de afroamericanos o negros siempre que sea posible. @es
broader: Black LGBTQ+ people
narrower: Afro-Canadian intersex people
narrower: Afro-Caribbean intersex people
narrower: Afro-European intersex people
narrower: Afro-Latin American intersex people
has top concept: LGBTQ+ people
issued: 2023-06-27
modified: 2025-02-23
type: Concept
in scheme: v3
change note: Version 4.1.0

Daughters of intersex people
preferred label: Hijas de personas intersexuales @es
alternative label: Hijas de personas intersex @es
comment: Daughters who have one or more intersex parent.
comment: Hijas que tienen uno o más padres intersexuales. @es
broader: Daughters of LGBTQ+ people
has top concept: Family members
issued: 2023-06-27
modified: 2025-02-23
type: Concept
in scheme: v3
change note: Version 4.1.0

Fathers of intersex people
preferred label: Padres de personas intersexuales @es
alternative label: Padres de personas intersex @es
alternative label: Papás de personas intersexuales @es
alternative label: Papás de personas intersex @es
comment: People who assume the role of father to intersex people. Only use to describe individuals who identify as fathers.
comment: Personas que asumen el rol de padre de personas intersexuales. Utilícese únicamente para describir a personas que se autoidentifiquen como padres. @es
broader: Fathers of LGBTQ+ people
has top concept: Family members
issued: 2023-06-27
modified: 2025-02-23
type: Concept
in scheme: v3
change note: Version 4.1.0

Jewish intersex people
preferred label: Personas intersexuales judías @es
alternative label: Intersex Jews
alternative label: Judíos intersex @es
alternative label: Personas intersex judías @es
comment: Intersex people who are Jewish.
comment: Personas intersexuales que son judías. @es
broader: Jewish LGBTQ+ people
has top concept: LGBTQ+ people
issued: 2023-06-27
modified: 2025-02-23
type: Concept
in scheme: v3
change note: Version 4.1.0

Latino/a/x intersex people
preferred label: Personas intersexuales Latinx @es
alternative label: Intersex Latinas
alternative label: Intersex Latine people
alternative label: Intersex Latinos
alternative label: Intersex Latinx people
alternative label: Latina intersex people
alternative label: Latine intersex people
alternative label: Latino intersex people
alternative label: Latinx intersex people
alternative label: Personas intersex Latinx @es
comment: Latin American people who are intersex; only use to describe individuals who self-identify as Latino, Latina, or Latinx. Do not conflate with Chicano/a/x or Hispanic.
comment: Personas latinoamericanas que son intersexuales; utilícese únicamente para describir a personas que se autoidentifican como latinos, latinas o latinxs. No debe confundirse con chicano/a/x o hispano/a/x. @es
broader: Latino/a/x LGBTQ+ people
narrower: Afro-Latin American intersex people
has top concept: LGBTQ+ people
issued: 2023-06-27
modified: 2025-02-23
type: Concept
in scheme: v3
change note: Version 4.1.0

Asexual characters
preferred label: Personajes asexuales @es
comment: Characters in creative works who are asexual.
comment: Personajes asexuales en obras creativas. @es
broader: LGBTQ+ characters
has top concept: LGBTQ+ characters
issued: 2023-06-27
modified: 2025-02-23
type: Concept
in scheme: v3
change note: Version 4.1.0

Asexual chefs
preferred label: Cocineros asexuales @es
comment: Asexual people who are trained, professional cooks, typically holding a leadership role in the kitchen in which they are employed.
comment: Personas asexuales que son cocineros profesionales con entrenamiento, que suelen desempeñar un papel de liderazgo en la cocina en la que trabajan. @es
broader: LGBTQ+ chefs
related: Lesbian chefs
related: Gay chefs
related: Bisexual chefs
related: Transgender chefs
related: Queer chefs
related: Intersex chefs
has top concept: LGBTQ+ people
issued: 2023-06-27
modified: 2025-02-23
type: Concept
in scheme: v3
change note: Version 4.1.0

Asexual children
preferred label: Niños asexuales @es
comment: Asexual people who have not yet reached the age of adolescence.
comment: Niños menores de 18 años que se autoidentifican como asexuales. @es
broader: Children
broader: LGBTQ+ children
has top concept: Family members
issued: 2023-06-27
modified: 2025-02-23
type: Concept
in scheme: v3
change note: Version 4.1.0

Asexual community
preferred label: Comunidad asexual @es
comment: Groups of people who share the experience of being asexual.
comment: Grupos de personas que comparten la experiencia de la asexualidad. @es
broader: LGBTQ+ communities
has top concept: LGBTQ+ communities
issued: 2023-06-27
modified: 2025-02-23
type: Concept
in scheme: v3
change note: Version 4.1.0

Asexual community centers
preferred label: Centros comunitarios asexuales @es
preferred label: Asexual community centres
comment: Spaces in which people from asexual communities meet for social, education, recreational, or organizing activities.
comment: Espacios donde las personas de comunidades asexuales se reúnen para actividades sociales, educativas, recreativas u organizativas. @es
broader: LGBTQ+ community centers
has top concept: LGBTQ+ centers
issued: 2023-06-27
modified: 2025-02-23
type: Concept
in scheme: v3
change note: Version 4.1.0

Intersex archives
preferred label: Archivos intersex @es
comment: Collections of records and materials relating to intersex people or intersex communities; can include a variety of organizations and institutions from community to government archives.
comment: Colecciones de registros y materiales relacionados con personas intersex o comunidades intersex; puede incluir una variedad de organizaciones e instituciones, desde archivos comunitarios hasta gubernamentales. @es
broader: LGBTQ+ archives
has top concept: LGBTQ+ cultural heritage institutions
issued: 2023-06-27
modified: 2025-02-23
type: Concept
in scheme: v3
change note: Version 4.1.0

Intersex artists
preferred label: Artistas intersex @es
comment: Intersex people who practice any of various creative arts.
comment: Artistas que son intersex. @es
broader: LGBTQ+ artists
has top concept: LGBTQ+ people
issued: 2023-06-27
modified: 2025-02-23
type: Concept
in scheme: v3
change note: Version 4.1.0

Intersex autobiographies
preferred label: Autobiografías intersex @es
alternative label: Intersex memoirs
alternative label: Memorias intersex @es
comment: Accounts of intersex peoples' lives written by those people. For written accounts of intersex people's lives that were not written by the subject, use "Intersex biographies."
comment: Relatos de vida de personas escritos por esas mismas personas; utilícese para autobiografías escritas por autores intersex. @es
broader: LGBTQ+ autobiographies
related: Intersex biographies
has top concept: LGBTQ+ autobiographies
issued: 2023-06-27
modified: 2025-02-23
type: Concept
in scheme: v3
change note: Version 4.1.0

Intersex biographies
preferred label: Biografías intersex @es
comment: Written accounts of the lives of intersex people. For written accounts of intersex people's lives written by the subject, use "Intersex autobiographies."
comment: Relatos escritos de las vidas de personas conocidas por ser intersex. @es
broader: LGBTQ+ biographies
related: Intersex authors
related: Intersex autobiographies
has top concept: LGBTQ+ biographies
issued: 2023-06-27
modified: 2025-02-23
type: Concept
in scheme: v3
change note: Version 4.1.0

Asexual couples
preferred label: Parejas asexuales @es
comment: Partnerships in which both people are asexual.
comment: Relaciones de pareja donde las dos personas son asexuales. @es
broader: LGBTQ+ couples
has top concept: Relationship satisfaction
issued: 2023-06-27
modified: 2025-02-23
type: Concept
in scheme: v3
change note: Version 4.1.0

Asexual daughters
preferred label: Hijas asexuales @es
comment: Daughters who identify as asexual.
comment: Hijas que se autoidentifican como asexuales. @es
broader: LGBTQ+ daughters
has top concept: LGBTQ+ people
issued: 2023-06-27
modified: 2025-02-23
type: Concept
in scheme: v3
change note: Version 4.1.0

Asexual disabled people
preferred label: Personas asexuales discapacitadas @es
alternative label: Asexual people with disabilities
alternative label: Disabled asexual people
alternative label: Personas asexuales con discapacidades @es
alternative label: Discapacitados asexuales @es
alternative label: Discapacitadas asexuales @es
alternative label: Personas discapacitadas asexuales @es
comment: Asexual people who are disabled.
comment: Personas asexuales con discapacidad. @es
broader: LGBTQ+ disabled people
narrower: Asexual neurodivergent people
narrower: Asexual blind people
narrower: Asexual Deaf people
narrower: Asexual hard of hearing people
narrower: Asexual wheelchair users
related: Asexual people with chronic illnesses
has top concept: LGBTQ+ people
issued: 2023-06-28
modified: 2025-02-23
type: Concept
in scheme: v3
change note: Version 4.1.0

Asexual blind people
preferred label: Personas asexuales ciegas @es
alternative label: Blind asexual people
alternative label: Personas ciegas asexuales @es
alternative label: Ciegos asexuales @es
alternative label: Ciegas asexuales @es
comment: Asexual people with significant or total loss of vision.
comment: Personas asexuales con pérdida significativa o total de visión. @es
broader: LGBTQ+ blind people
broader: Asexual disabled people
has top concept: LGBTQ+ people
issued: 2023-06-28
modified: 2025-02-23
type: Concept
in scheme: v3
change note: Version 4.1.0

Asexual Deaf people
preferred label: Personas asexuales sordas @es
alternative label: Deaf asexual people
alternative label: Personas sordas asexuales @es
comment: Asexual people with significant or total hearing loss. Some but not all Deaf people prefer to capitalize Deaf in recognition of the cultural and linguistic identity they share with other Deaf people.
comment: Personas asexuales con pérdida auditiva significativa o total. Algunas personas sordas, pero no todas, prefieren escribir “Sorda/o” con mayúscula en reconocimiento de la identidad cultural y lingüística que comparten con otras personas sordas. @es
broader: LGBTQ+ Deaf people
broader: Asexual disabled people
related: Asexual hard of hearing people
has top concept: LGBTQ+ people
issued: 2023-06-28
modified: 2025-02-23
type: Concept
in scheme: v3
change note: Version 4.1.0

Asexual hard of hearing people
preferred label: Personas asexuales con problemas de audición @es
alternative label: Personas asexuales con dificultades de audición @es
alternative label: Personas ace con dificultades de audición @es
alternative label: Personas asexuales con dificultades auditivas @es
alternative label: Personas ace con dificultades auditivas @es
comment: Asexual people with significant or total hearing loss who may or may not consider themselves d/Deaf.
comment: Personas asexuales con pérdida de audición significativa o total, que pueden o no considerarse S/sordas. @es
broader: LGBTQ+ hard of hearing people
broader: Asexual disabled people
related: Asexual Deaf people
has top concept: LGBTQ+ people
issued: 2023-06-28
modified: 2025-02-23
type: Concept
in scheme: v3
change note: Version 4.1.0

Asexual people with chronic illnesses
preferred label: Personas asexuales con enfermedades crónicas @es
alternative label: Chronically ill asexual people
alternative label: Personas con enfermedades crónicas asexuales @es
alternative label: Enfermos crónicos asexuales @es
alternative label: Enfermas crónicas asexuales @es
comment: Asexual people who have long-term health conditions that require continued medical attention and/or significantly impact or limit daily life; some but not all people with chronic illnesses consider themselves disabled.
comment: Personas asexuales que padecen de condiciones de salud a largo plazo que requieren atención médica continua y/o que impactan o limitan significativamente sus vidas diarias; algunas, pero no todas, las personas con enfermedades crónicas se consideran discapacitadas. @es
broader: LGBTQ+ people with chronic illnesses
related: Asexual disabled people
has top concept: LGBTQ+ people
issued: 2023-06-28
modified: 2025-02-23
type: Concept
in scheme: v3
change note: Version 4.1.0

Asexual wheelchair users
preferred label: Usuarios asexuales de sillas de ruedas @es
comment: Asexual people who use wheelchairs.
comment: Personas asexuales que utilizan sillas de ruedas. @es
broader: LGBTQ+ wheelchair users
broader: Asexual disabled people
has top concept: LGBTQ+ people
issued: 2023-06-28
modified: 2025-02-23
type: Concept
in scheme: v3
change note: Version 4.1.0

Asexual culture
preferred label: Cultura asexual @es
comment: Cultural experiences shared by members of asexual communities or products of asexual culture (e.g., art and media created by and for asexual people, activism focused on asexual issues, slang commonly used in asexual communities, etc.).
comment: Experiencias culturales compartidas por miembros de comunidades asexuales o productos de la cultura asexual (por ejemplo, arte y medios de comunicación creados por y para personas asexuales, activismo centrado en temas asexuales, jerga de uso común en comunidades asexuales, etc.). @es
broader: LGBTQ+ culture
related: Asexual slang
has top concept: Subcultures
issued: 2023-06-28
modified: 2025-02-23
type: Concept
in scheme: v3
change note: Version 4.1.0

Asexual slang
preferred label: Argot asexual @es
comment: Colloquial or informal language related to asexual identity or used by asexual people.
comment: Lenguaje coloquial o informal en relación a la identidad asexual o utilizado por personas asexuales. @es
broader: LGBTQ+ slang
related: Asexual culture
has top concept: LGBTQ+ slang
issued: 2023-06-28
modified: 2025-02-23
type: Concept
in scheme: v3
change note: Version 4.1.0

Asexual sons
preferred label: Hijos asexuales @es
comment: Asexual people who are sons.
comment: Personas asexuales que son hijos. @es
broader: LGBTQ+ sons
has top concept: LGBTQ+ people
issued: 2023-06-28
modified: 2025-02-23
type: Concept
in scheme: v3
change note: Version 4.1.0

Asexual employment
preferred label: Empleo asexual @es
comment: Employment of asexual people
comment: Empleo de personas asexuales. @es
broader: LGBTQ+ employment
has top concept: LGBTQ+ employment
issued: 2023-06-28
modified: 2025-02-23
type: Concept
in scheme: v3
change note: Version 4.1.0

Asexual fathers
preferred label: Padres asexuales @es
alternative label: Papás asexuales @es
comment: Asexual people who are fathers.
comment: Personas asexuales que son padres. @es
broader: LGBTQ+ fathers
has top concept: Family members
issued: 2023-06-28
modified: 2025-02-23
type: Concept
in scheme: v3
change note: Version 4.1.0

Asexual information centers
preferred label: Centros de información asexual @es
alternative label: Asexual information centres
alternative label: Centros asexuales de información @es
comment: Institutions providing education, support, and information about asexual issues and asexual communities to asexual people.
comment: Instituciones que brindan educación, apoyo e información sobre temas asexuales y comunidades asexuales a personas asexuales. @es
broader: LGBTQ+ information centers
has top concept: LGBTQ+ centers
issued: 2023-06-28
modified: 2025-02-23
type: Concept
in scheme: v3
change note: Version 4.1.0

Asexual libraries
preferred label: Bibliotecas asexuales @es
comment: Libraries that hold materials primarily pertaining to asexual people or intended for use by asexual people.
comment: Bibliotecas que contienen materiales principalmente relacionados con personas asexuales o destinados a ser utilizados por personas asexuales. @es
broader: LGBTQ+ libraries
has top concept: LGBTQ+ cultural heritage institutions
issued: 2023-06-28
modified: 2025-02-23
type: Concept
in scheme: v3
change note: Version 4.1.0

Asexual mothers
preferred label: Madres asexuales @es
alternative label: Mamás asexuales @es
comment: Asexual people who are mothers.
comment: Personas asexuales que son madres. @es
broader: Mothers
broader: Asexual parents
broader: LGBTQ+ mothers
has top concept: Family members
issued: 2023-06-28
modified: 2025-02-23
type: Concept
in scheme: v3
change note: Version 4.1.0

Asexual movement
preferred label: Movimiento asexual @es
comment: Umbrella term for activism focused on the rights of asexual people and issues faced by asexual communities.
comment: Término general para el activismo centrado en los derechos de las personas asexuales y los problemas a los que se enfrentan las comunidades asexuales. @es
broader: LGBTQ+ movement
has top concept: Social movements
issued: 2023-06-28
modified: 2025-02-23
type: Concept
in scheme: v3
change note: Version 4.1.0

Asexual newsletters
preferred label: Boletines asexuales @es
comment: Serialized print or digital periodicals created by or for asexual people, often with the purpose of sharing news and information related to asexual communities and asexual issues.
comment: Publicaciones periódicas impresas o digitales serializadas creadas por o para personas asexuales, a menudo con el propósito de compartir noticias e información relacionada con comunidades asexuales y cuestiones asexuales. @es
broader: LGBTQ+ newsletters
related: Asexual press
has top concept: LGBTQ+ press
issued: 2023-06-28
modified: 2025-02-23
type: Concept
in scheme: v3
change note: Version 4.1.0

Asexual newspapers
preferred label: Periódicos asexuales @es
alternative label: Diarios asexuales @es
comment: Serialized print or digital publications about asexual people or asexual issues (and typically produced by asexual people or asexual organizations) that contain news, articles, columns, correspondence, and advertisements.
comment: Publicaciones impresas o digitales seriadas sobre personas o temas asexuales (y normalmente producidas por personas asexuales u organizaciones asexuales) que contienen noticias, artículos, columnas, correspondencia y anuncios. @es
broader: LGBTQ+ newspapers
related: Asexual press
has top concept: LGBTQ+ press
issued: 2023-06-28
modified: 2025-02-23
type: Concept
in scheme: v3
change note: Version 4.1.0

Asexual museums
preferred label: Museos asexuales @es
comment: Institutions dedicated to the storage, exhibition, conservation, and preservation of materials relating to asexual people and asexual history.
comment: Instituciones dedicadas al almacenamiento, la exposición, la conservación y la preservación de materiales relacionados con las personas asexuales y la historia asexual. @es
broader: LGBTQ+ museums
has top concept: LGBTQ+ cultural heritage institutions
issued: 2023-06-28
modified: 2025-02-23
type: Concept
in scheme: v3
change note: Version 4.1.0

Asexual partners
preferred label: Parejas asexuales @es
comment: Asexual people who are the romantic, sexual, or play partners of another person or people.
comment: Personas asexuales que son la pareja romántica, sexual o de juegos de otra persona o personas. @es
broader: LGBTQ+ partners
has top concept: LGBTQ+ families
issued: 2023-06-28
modified: 2025-02-23
type: Concept
in scheme: v3
change note: Version 4.1.0

Asexual people in the military
preferred label: Personas asexuales en el ejército @es
alternative label: Personas asexuales en las fuerzas armadas @es
comment: Asexual people serving in state and national armed forces.
comment: Personas asexuales que sirven en las fuerzas armadas estatales y nacionales. @es
broader: LGBTQ+ people in the military
has top concept: Legal status
issued: 2023-06-28
modified: 2025-02-23
type: Concept
in scheme: v3
change note: Version 4.1.0

Asexual people of color
preferred label: Personas asexuales de color @es
alternative label: Asexual people of colour
comment: Primarily used in the United States, this term refers to asexual people who are not white and who identify as people of color.
comment: Personas asexuales que no son blancas y que se autoidentifican como personas de color. @es
broader: LGBTQ+ people of color
has top concept: LGBTQ+ people
issued: 2023-06-28
modified: 2025-02-23
type: Concept
in scheme: v3
change note: Version 4.1.0

Asexual political activists
preferred label: Activistas políticos asexuales @es
comment: Asexual people working to bring about political or social change through public organizing.
comment: Personas asexuales que trabajan para lograr cambios políticos o sociales mediante la organización pública. @es
broader: LGBTQ+ political activists
broader: Asexual activism
has top concept: LGBTQ+ people
issued: 2023-06-28
modified: 2025-02-23
type: Concept
in scheme: v3
change note: Version 4.1.0

Asexual press
preferred label: Prensa asexual @es
comment: Newspapers, magazines, or other publishing outlets aimed at asexual audiences and/or operated by asexual people.
comment: Periódicos, revistas u otros medios editoriales dirigidos a audiencias asexuales y/o operados por personas asexuales. @es
broader: LGBTQ+ press
narrower: Asexual zines
related: Asexual newsletters
related: Asexual newspapers
has top concept: LGBTQ+ press
issued: 2023-06-28
modified: 2025-02-23
type: Concept
in scheme: v3
change note: Version 4.1.0

Asexual publishers
preferred label: Editoriales asexuales @es
comment: Companies and organizations that publish materials for asexual communities or addressing asexual issues.
comment: Empresas y organizaciones que publican materiales para comunidades asexuales o que abordan asuntos asexuales. @es
broader: LGBTQ+ publishers
has top concept: LGBTQ+ publishers
issued: 2023-06-28
modified: 2025-02-23
type: Concept
in scheme: v3
change note: Version 4.1.0

Asexual radio
preferred label: Radio asexual @es
comment: Auditory content broadcast on the radio (analog or digital) about asexual people and asexual issues.
comment: Contenido auditivo emitido por radio (análoga o digital) sobre personas asexuales y asuntos asexuales. @es
broader: LGBTQ+ radio
has top concept: LGBTQ+ radio
issued: 2023-06-28
modified: 2026-02-23
type: Concept
in scheme: v3
change note: Version 4.1.0

Asexual relationships
preferred label: Relaciones asexuales @es
comment: Ongoing connections (romantic, sexual, or platonic) between two or more asexual people.
comment: Conexiones continuas (románticas, sexuales o platónicas) entre dos o más personas asexuales. @es
broader: Relationship satisfaction
has top concept: Relationship satisfaction
issued: 2023-06-28
modified: 2025-02-23
type: Concept
in scheme: v3
change note: Version 4.1.0

Asexual rights
preferred label: Derechos asexuales @es
comment: Legal, social, or ethical principles of freedom or entitlement held by asexual people.
comment: Principios legales, sociales o éticos de la libertad o del derecho que tienen las personas asexuales. @es
broader: LGBTQ+ civil rights
has top concept: Human rights
issued: 2023-06-28
modified: 2025-02-23
type: Concept
in scheme: v3
change note: Version 4.1.0

LGBTQ+ politicians
preferred label: Políticos LGBTQ+ @es
alternative label: LGBTQ+ public officials
alternative label: Oficiales públicos (LGBTQ) @es
comment: LGBTQ+ people who are candidates for public office, are currently holding public office, or have held political positions. Politicians can be elected by public election or otherwise appointed.
comment: Personas LGBTQ+ que son candidatas a cargos públicos, que actualmente ocupan cargos públicos o que han ocupado cargos políticos. Los políticos pueden ser elegidos mediante elección pública o designados de otro modo. @es
narrower: Gay politicians
narrower: Lesbian politicians
narrower: Bisexual politicians
narrower: Queer politicians
narrower: Transgender politicians
narrower: Intersex politicians
narrower: Asexual politicians
related: Two-Spirit politicians
issued: 2023-06-28
modified: 2025-02-23
type: Concept
in scheme: v3
change note: Version 4.1.0

Gay politicians
preferred label: Políticos gay @es
alternative label: Gay public officials
alternative label: Oficiales públicos gay @es
comment: Gay men or mascs who are candidates for public office, are currently holding public office, or have held political positions. Politicians can be elected by public election or otherwise appointed.
comment: Hombres o personas masc gay que son candidatos a cargos públicos, ejercen actualmente cargos públicos o han desempeñado cargos políticos. Los políticos pueden ser elegidos mediante elección pública o designados de otro modo. @es
broader: LGBTQ+ politicians
has top concept: LGBTQ+ politicians
issued: 2023-06-28
modified: 2026-02-24
type: Concept
in scheme: v3
change note: Version 4.1.0

Lesbian politicians
preferred label: Políticas lesbianas @es
alternative label: Lesbian public officials
alternative label: Oficiales públicas lesbianas @es
comment: Lesbians who are candidates for public office, are currently holding public office, or have held political positions. Politicians can be elected by public election or otherwise appointed.
comment: Lesbianas que sean candidatas a cargos públicos, ejerzan actualmente cargos públicos o hayan desempeñado cargos políticos. Las políticas pueden ser elegidas mediante elección pública o designadas de otro modo. @es
broader: LGBTQ+ politicians
has top concept: LGBTQ+ politicians
issued: 2023-06-28
modified: 2025-02-23
type: Concept
in scheme: v3
change note: Version 4.1.0

Bisexual politicians
preferred label: Poesía bisexual @es
alternative label: Bisexual public officials
comment: Bisexual people who are candidates for public office, are currently holding public office, or have held political positions. Politicians can be elected by public election or otherwise appointed.
comment: Obras literarias, normalmente escritas en verso, que se centran en personajes, temas o identidades bisexuales. @es
broader: LGBTQ+ politicians
has top concept: LGBTQ+ politicians
issued: 2023-06-28
modified: 2025-02-23
type: Concept
in scheme: v3
change note: Version 4.1.0

Queer politicians
preferred label: Políticos queer @es
alternative label: Queer public officials
alternative label: Oficiales públicos queer @es
comment: Queer people who are candidates for public office, are currently holding public office, or have held political positions. Politicians can be elected by public election or otherwise appointed.
comment: Personas queer que son candidatas a cargos públicos, ocupan actualmente cargos públicos o han ocupado cargos políticos. Los políticos pueden ser elegidos mediante elección pública o designados de otro modo. @es
broader: LGBTQ+ politicians
has top concept: LGBTQ+ politicians
issued: 2023-06-28
modified: 2025-02-23
type: Concept
in scheme: v3
change note: Version 4.1.0

Transgender politicians
preferred label: Políticos transgénero @es
alternative label: Transgender public officials
alternative label: Oficiales públicos transgénero @es
comment: Transgender people who are candidates for public office, are currently holding public office, or have held political positions. Politicians can be elected by public election or otherwise appointed.
comment: Personas transgénero que son candidatos a cargos públicos, ocupan actualmente cargos públicos o han ocupado cargos políticos. Los políticos pueden ser elegidos mediante elección pública o designados de otro modo. @es
broader: LGBTQ+ politicians
has top concept: LGBTQ+ politicians
issued: 2023-06-28
modified: 2025-02-23
type: Concept
in scheme: v3
change note: Version 4.1.0

Intersex politicians
preferred label: Políticos intersex @es
alternative label: Intersex public officials
alternative label: Oficiales públicos intersex @es
comment: Intersex people who are candidates for public office, are currently holding public office, or have held political positions. Politicians can be elected by public election or otherwise appointed.
comment: Personas intersex que son candidatas a cargos públicos, que actualmente ocupan cargos públicos o han ocupado cargos políticos. Los políticos pueden ser elegidos mediante elección pública o designados de otro modo. @es
broader: LGBTQ+ politicians
has top concept: LGBTQ+ politicians
issued: 2023-06-28
modified: 2025-02-23
type: Concept
in scheme: v3
change note: Version 4.1.0

Asexual politicians
preferred label: Políticos asexuales @es
alternative label: Asexual public officials
alternative label: Oficiales públicos asexuales @es
alternative label: Oficiales públicas asexuales @es
comment: Asexual people who are candidates for public office, are currently holding public office, or have held political positions. Politicians can be elected by public election or otherwise appointed.
comment: Personas asexuales que son candidatas a cargos públicos, ocupan actualmente cargos públicos o han ocupado cargos políticos. Los políticos pueden ser elegidos por sufragio público o designados de otro modo. @es
broader: LGBTQ+ politicians
has top concept: LGBTQ+ politicians
issued: 2023-06-28
modified: 2025-02-23
type: Concept
in scheme: v3
change note: Version 4.1.0

Two-Spirit politicians
preferred label: Políticos dos espíritus @es
alternative label: 2S politicians
alternative label: 2S public officials
alternative label: Two Spirited politicians
alternative label: Two Spirited public officials
alternative label: Two-Spirit public officials
alternative label: Two-Spirited public officials
alternative label: Two-Spiritied politicians
alternative label: Oficiales públicos dos espíritus @es
comment: Two-Spirit people who are candidates for public office, are currently holding public office, or have held political positions. Politicians can be elected by public election or otherwise appointed.
comment: Personas dos espíritus que son candidatas a cargos públicos, ocupan actualmente cargos públicos o han ocupado cargos políticos. Los políticos pueden ser elegidos por sufragio público o designados de otro modo. @es
broader: Two-Spirit people
related: LGBTQ+ politicians
has top concept: Gender
issued: 2023-06-28
modified: 2025-02-23
type: Concept
in scheme: v3
change note: Version 4.1.0

17-beta hydroxysteroid dehydrogenase 3 deficiency
preferred label: Deficiencia de 17-beta hidroxiesteroide deshidrogenasa 3 @es
alternative label: 17-beta
comment: People with 17-beta hydroxysteroid dehydrogenase 3 deficiency, abbreviated as "17-beta," have XY chromosomes and testes, but their bodies do not have one of the enzymes needed to synthesize testosterone. Most people with 17-beta are born with a vulva and vagina, and their testes are most often undescended. Some people with 17-beta will be born with genitals that do not clearly resemble a typical penis or a typical vulva. Some will have a penis that may be smaller than typical (known as a micropenis), and the urethra may open on the underside of the penis rather than at the tip (known as hypospadias). In adolescence, people with 17-beta will often develop some secondary sex characteristics associated with a typical testosterone puberty.
comment: Las personas con deficiencia de 17-beta hidroxiesteroide deshidrogenasa 3, abreviada como "17-beta", tienen cromosomas XY y testículos, pero su sus cuerpos carecen de una de las enzimas necesarias para sintetizar la testosterona. La mayoría de las personas con 17-beta nacen con vulva y vagina, y sus testículos no suelen descender. Algunas personas con 17-beta nacen con genitales que no se parecen claramente a un pene típico o a una vulva típica. Algunas tendrán un pene más pequeño de lo normal (lo que se conoce como micropene) y la uretra puede abrirse en la parte inferior del pene en lugar de en la punta (lo que se conoce como hipospadias). En la adolescencia, las personas con 17-beta a menudo desarrollarán algunas características sexuales secundarias asociadas a una pubertad típica con testosterona. @es
broader: Intersex variations
has top concept: Sex (Body)
issued: 2023-06-28
modified: 2025-02-23
type: Concept
in scheme: v3
change note: Version 4.1.0

Ambiguous genitalia
preferred label: Genitales ambiguos @es
comment: A term used to describe a birth variation in which the outer genitals do not have the typical appearance of those associated with either boys or girls. This is often the first sign many doctors and parents see that indicate their child has an intersex variation. Ambiguous genitalia can be caused by a variety of variations and rarely require immediate surgical intervention as long as the child is able to excrete and urinate without complications. Many intersex people find this term stigmatizing, so it should not be used unless the individual uses it to describe themselves.
comment: Término utilizado para describir una variación del nacimiento en la que los genitales externos no tienen la apariencia típica de los asociados con niños o niñas. Esta es a menudo la primera señal que ven muchos médicos y padres que indica que su hijo tiene una variación intersex. Los genitales ambiguos pueden deberse a una variedad de variaciones y rara vez requieren una intervención quirúrgica inmediata, siempre que el niño pueda excretar y orinar sin complicaciones. Muchas personas intersex encuentran este término estigmatizante, por lo que no debe usarse a menos que la persona lo use para describirse a sí misma. @es
broader: Intersex variations
has top concept: Sex (Body)
issued: 2023-06-28
modified: 2025-02-23
type: Concept
in scheme: v3
change note: Version 4.1.0

Androgens
preferred label: Andrógenos @es
comment: A term that encompasses testosterone, dihydrotestosterone, and other hormones primarily produced in the testes but also in the ovaries and adrenal glands.
comment: Un término que abarca a la testosterona, la dihidrotestosterona y otras hormonas producidas principalmente en los testículos, pero también en los ovarios y las glándulas suprarrenales. @es
broader: Hormones
related: Hormone therapy (Gender)
has top concept: Sex (Body)
issued: 2023-06-28
modified: 2025-02-23
type: Concept
in scheme: v3
change note: Version 4.1.0

Anorchia
preferred label: Anorquia @es
comment: A person with anorchia has 46 XY chromosomes and is born without testes. As a result, they do not produce typical levels of testosterone. Someone with anorchia will usually have a typical-appearing penis and scrotum because these organs are already formed by the stage of fetal development when the testes disappear.
comment: Una persona con anorquia tiene 46 cromosomas XY y nace sin testículos. Como resultado, no producen niveles típicos de testosterona. Alguien con anorquia generalmente tiene un pene y un escroto de apariencia típica porque estos órganos ya están formados en la etapa de desarrollo fetal en la que desaparecen los testículos. @es
broader: Intersex variations
has top concept: Sex (Body)
issued: 2023-06-28
modified: 2025-02-23
type: Concept
in scheme: v3
change note: Version 4.1.0

Aromatase deficiency
preferred label: Deficiencia de aromatasa @es
comment: People with aromatase deficiency do not have the enzyme responsible for converting androgens into estrogen. At birth, someone with aromatase deficiency and XX chromosomes may have a larger-than-typical clitoris and partially or completely fused labia (resembling the appearance of a scrotum). At puberty, they may not develop breasts, may not begin menstruating, and may develop some secondary sex characteristics associated with a typical testosterone puberty. They may also develop multiple cysts on their ovaries. People with XY chromosomes can also have aromatase deficiency, but they do not typically experience variations in their sex characteristics, though they may grow taller than is typical because estrogen is usually responsible for closing the bone growth plates.
comment: Las personas con deficiencia de aromatasa no tienen la enzima responsable de convertir los andrógenos en estrógeno. Al nacer, una persona con deficiencia de aromatasa y cromosomas XX puede tener un clítoris más grande de lo típico y labios vaginales parcial o completamente fusionados (que se asemejan a la apariencia de un escroto). En la pubertad, es posible que no desarrollen senos, que no comiencen a menstruar y que desarrollen algunas características sexuales secundarias asociadas con una pubertad típica de testosterona. También pueden desarrollar múltiples quistes en los ovarios. Las personas con cromosomas XY también pueden tener deficiencia de aromatasa, pero normalmente no experimentan variaciones en sus características sexuales, aunque pueden crecer más de lo normal porque el estrógeno suele ser responsable de cerrar las placas de crecimiento óseo. @es
broader: Intersex variations
has top concept: Sex (Body)
issued: 2023-06-28
modified: 2025-02-23
type: Concept
in scheme: v3
change note: Version 4.1.0

Aromatase excess syndrome
preferred label: Síndrome de exceso de la aromatasa @es
alternative label: Familial gynecomastia
alternative label: Hyperestrogenism
comment: People with aromatase excess have increased production of aromatase, which converts androgens (like testosterone) into estrogen. People with XY chromosomes and aromatase excess syndrome will therefore have more active estrogen in their bodies than is typical. As a result, they will often stop growing at a shorter height and/or develop breasts in adolescence along with features associated with a typical testosterone puberty. People with XX chromosomes can also have aromatase excess, but it doesn't usually cause their sex characteristics to vary from what is considered typical for those assigned female at birth, though they may also experience breast enlargement and short stature, along with menstrual irregularities.
comment: Las personas con exceso de aromatasa tienen una mayor producción de aromatasa, que convierte los andrógenos (como la testosterona) en estrógeno. Por lo tanto, las personas con cromosomas XY y síndrome de exceso de aromatasa tendrán estrógenos más activos en sus cuerpos de lo habitual. Como resultado, a menudo dejarán de crecer a una altura baja y/o desarrollarán senos en la adolescencia junto con características asociadas con una pubertad típica de testosterona. Las personas con cromosomas XX también pueden tener un exceso de aromatasa, pero esto no suele hacer que sus características sexuales varíen de lo que se considera típico para las personas asignadas al sexo femenino al nacer, aunque también pueden experimentar agrandamiento de los senos y baja estatura, junto con irregularidades menstruales. @es
broader: Intersex variations
has top concept: Sex (Body)
issued: 2023-06-28
modified: 2025-02-23
type: Concept
in scheme: v3
change note: Version 4.1.0

Bladder exstrophy
preferred label: Extrofia vesical @es
comment: People with bladder exstrophy are born with their urinary bladder exposed (through an open abdominal wall) or outside of the body. They may also have an open pelvis (resulting from the pubic bones not joining together), which causes genital differences. People with bladder exstrophy and XY chromosomes often have a shorter-than-typical penis with epispadias (meaning the urethra opens on the top surface of the penis instead of at the tip) and undescended testes. People with XX chromosomes and bladder exstrophy often have a urethra that is placed higher than usual, widely spaced labia (due to the wide spacing of their pubic bones), and a clitoris formed in two halves with a split in the middle.
comment: Las personas con extrofia vesical nacen con la vejiga urinaria expuesta (a través de una pared abdominal abierta) o fuera del cuerpo. También pueden tener la pelvis abierta (como resultado de que los huesos del pubis no se unieran), lo que provoca diferencias genitales. Las personas con extrofia vesical y cromosomas XY suelen tener un pene más corto de lo normal con epispadias (lo que significa que la uretra se abre en la superficie superior del pene en lugar de en la punta) y testículos no descendidos. Las personas con cromosomas XX y extrofia vesical a menudo tienen una uretra posicionada más alta de lo usual, labios vaginales muy espaciados (debido al gran espacio entre los huesos púbicos) y un clítoris formado en dos mitades con una división en el medio. @es
broader: Intersex variations
has top concept: Sex (Body)
issued: 2023-06-28
modified: 2025-02-23
type: Concept
in scheme: v3
change note: Version 4.1.0

Chimeras
preferred label: Quimeras @es
alternative label: Human chimeras
alternative label: Quimeras humanas @es
comment: Chimeras, or people with chimerism, have two different sets of DNA. This happens when a person is pregnant with fraternal twins, but the embryos combine into one fetus.
comment: Quimeras, o personas con quimerismo, tienen dos tipos de ADN. Esto ocurre cuando una persona está embarazada con gemelos fraternos, pero los embriones se combinan en un solo feto. @es
broader: Intersex people
has top concept: LGBTQ+ people
issued: 2023-06-28
modified: 2025-02-23
type: Concept
in scheme: v3
change note: Version 4.1.0

Chimerism
preferred label: Quimerismo @es
comment: Term used to describe the variation in which a person is born with two or more different sets of DNA. This can occur when multiple zygotes (such as fraternal twins) combine and develop into one fetus. Sex-chromosome discordant chimerism occurs when at least one embryo with XX chromosomes fuses with at least one embryo with XY chromosomes. A person who develops this way would have sets of both XX and XY chromosomes, or a chromosome pattern of 46XX/46XY, and could have a wide variety of different possible sex characteristics. Many people with chimerism and XX/XY chromosomes have both ovarian and testicular tissue, while others have only testes or only ovaries, and still others have gonadal dysgenesis. Some have noticeable genital differences and others do not.
comment: Término utilizado para describir la variación en la que una persona nace con dos o más tipos de ADN. Esto puede ocurrir cuando varios cigotos (como los gemelos fraternos) se combinan y forman un solo feto. El quimerismo discordante de cromosomas sexuales ocurre cuando al menos un embrión con cromosomas XX se fusiona con al menos un embrión con cromosomas XY. Una persona que se desarrolla de esta manera tendría conjuntos de cromosomas XX y XY, o un patrón cromosómico de 46XX/46XY, y podría tener una amplia variedad de posibles características sexuales diferentes. Muchas personas con quimerismo y cromosomas XX/XY tienen tejido ovárico y testicular, mientras que otras solo tienen testículos o solo ovarios, y otras tienen disgenesia gonadal. Algunos tienen diferencias genitales notables y otros no. @es
broader: Intersex variations
has top concept: Sex (Body)
issued: 2023-06-28
modified: 2025-02-23
type: Concept
in scheme: v3
change note: Version 4.1.0

Classical congenital adrenal hyperplasia
preferred label: Hiperplasia suprarrenal congénita clásica @es
comment: People who have classical congenital adrenal hyperplasia (CAH), a subtype of CAH, have more pronounced issues with cortisol and/or aldosterone production. This variation is likely to be noticed at birth or shortly after.
comment: Las personas que tienen hiperplasia suprarrenal congénita clásica (HSC), un subtipo de HSC, tienen problemas más pronunciados con la producción de cortisol y/o aldosterona. Es probable que esta variación se note al nacer o poco después. @es
broader: Congenital adrenal hyperplasia
narrower: Salt-wasting congenital adrenal hyperplasia
has top concept: Sex (Body)
issued: 2023-06-28
modified: 2025-02-23
type: Concept
in scheme: v3
change note: Version 4.1.0

Cloacal exstrophy
preferred label: Extrofia cloacal @es
alternative label: Síndrome de OEIS @es
comment: People born with cloacal exstrophy are born with an open abdominal wall exposing their colon, bladder, and sometimes other abdominal organs. Their organs may also be positioned outside of the body at birth. The bladder is often split into two halves, and the colon and bladder may be connected. The anal opening may be blocked or not have been formed. The pubic bones do not join together, resulting in an open pelvis with noticeable genital differences. People with XY chromosomes and cloacal exstrophy may have a smaller-than-typical penis that is flat or split into two halves with an epispadic urethra (opening on the top of the penis rather than at the tip) and undescended testes. Someone with XX chromosomes and cloacal exstrophy usually has a clitoris that is split into two halves, and they may have two vaginal openings.
comment: Las personas que nacen con extrofia cloacal nacen con la pared abdominal abierta, exponiendo el colon, la vejiga y, a veces, otros órganos abdominales. Sus órganos también pueden estar ubicados fuera del cuerpo al nacer. La vejiga suele estar dividida en dos mitades, y el colon y la vejiga pueden estar conectados. La apertura anal puede estar bloqueada o no haberse formado. Los huesos púbicos no se unen, lo que resulta en una pelvis abierta con diferencias genitales notables. Las personas con cromosomas XY y extrofia cloacal pueden tener un pene más pequeño de lo usual, plano o dividido en dos mitades con una uretra epispádica (que se abre en la parte superior del pene en lugar de la punta) y testículos no descendidos. Alguien con cromosomas XX y extrofia cloacal suele tener un clítoris dividido en dos mitades y puede tener dos aperturas vaginales. @es
broader: Intersex variations
has top concept: Sex (Body)
issued: 2023-06-28
modified: 2025-02-23
type: Concept
in scheme: v3
change note: Version 4.1.0

Complete androgen insensitivity syndrome
preferred label: Síndrome de insensibilidad androgénica completa @es
alternative label: CAIS
comment: People with complete androgen insensitivity syndrome (CAIS) have no response to androgens and are born with a vulva and clitoris, as well as a shorter-than-typical vagina and undescended testes. In adolescence, they will develop breasts and other features associated with a typical estrogen puberty due to the body’s natural conversion of testosterone to estrogen. However, people with CAIS do not menstruate because they do not have a uterus or ovaries.
comment: Las personas con síndrome de insensibilidad androgénica completa (CAIS) no responden a los andrógenos y nacen con vulva y clítoris, así como con una vagina más corta de lo usual y testículos no descendidos. En la adolescencia, desarrollarán senos y otras características asociadas con una pubertad típica de estrógeno debido a la conversión natural de testosterona en estrógeno por parte del cuerpo. Sin embargo, las personas con CAIS no menstrúan porque no tienen útero ni ovarios. @es
broader: Intersex variations
has top concept: Sex (Body)
issued: 2023-06-28
modified: 2025-02-23
type: Concept
in scheme: v3
change note: Version 4.1.0

Complete gonadal dysgenesis
preferred label: Disgenesia gonadal completa @es
alternative label: Pure gonadal dysgenesis
alternative label: Síndrome de Swyer @es
comment: People with complete gonadal dysgenesis are born with XX or XY chromosomes and gonadal tissue that has not developed into testicles or ovaries (also known as streak gonads). They are generally born with a vulva and vagina, and they will not usually develop secondary sex characteristics at puberty because streak gonads do not produce hormones.
comment: Las personas con disgenesia gonadal completa nacen con cromosomas XX o XY y con tejido gonadal que no se ha desarrollado en testículos u ovarios (también conocido como gónadas rayadas). Tienden a nacer con vulva y vagina, y usualmente no desarrollan características sexuales secundarias en la pubertad porque las gónadas rayadas no producen hormonas. @es
broader: Androgen insensitivity syndrome
has top concept: Sex (Body)
issued: 2023-06-28
modified: 2025-02-23
type: Concept
in scheme: v3
change note: Version 4.1.0

Congenital chordee
preferred label: Chordee peneano @es
alternative label: Encordamiento peneano @es
alternative label: Cuerda congénita @es
alternative label: Curvatura peniana ventral @es
comment: People born with congenital chordee have a penis that curves upward or downward or bends to one side, usually due to bands of fibrous tissue that pull the penis in a particular direction. People with congenital chordee often have hypospadias, meaning that their urethral opening is not at the tip of the penis.
comment: Las personas que nacen con cuerda congénita tienen un pene que se curva hacia arriba o hacia abajo o se dobla hacia un lado, generalmente debido a bandas de tejido fibroso que tiran del pene en una dirección particular. Las personas con cuerda congénita suelen tener hipospadias, lo que significa que la apertura uretral no está en la punta del pene. @es
broader: Intersex variations
has top concept: Sex (Body)
issued: 2023-06-28
modified: 2025-02-23
type: Concept
in scheme: v3
change note: Version 4.1.0

Cryptorchidism
preferred label: Criptorquidia @es
alternative label: Undescended testes
alternative label: Undescended testicles
alternative label: Testículos no descendidos @es
comment: An intersex variation in which one or both of the testes do not descend from the abdomen into the scrotum. If both testes are undescended, this is known as "bilateral cryptorchidism," whereas "unilateral cryptorchidism" occurs when only one the testes does not descend.
comment: Una variación intersex en la que uno o ambos testículos no descienden del abdomen al escroto. Si ambos testículos no descienden, esto se conoce como "criptorquidia bilateral", mientras que la "criptorquidia unilateral" ocurre cuando solo uno de los testículos no desciende. @es
broader: Intersex variations
has top concept: Sex (Body)
issued: 2023-06-28
modified: 2025-02-23
type: Concept
in scheme: v3
change note: Version 4.1.0

De la Chapelle syndrome
preferred label: Síndrome de De la Chapelle @es
alternative label: XX male syndrome
alternative label: Síndrome del varón XX @es
comment: De la Chapelle syndrome causes people with XX chromosomes to be born with a penis and testes. This usually happens because a particular gene typically seen on Y chromosomes (known as the SRY gene) ends up on one of their X chromosomes and causes their genitals and internal reproductive organs to develop as they typically would in someone with XY chromosomes. People with de la Chapelle might have testes that are smaller than typical or that are undescended, and they are often infertile. In adolescence, they may experience breast growth, and they might not develop the characteristics that are usually associated with a typical testosterone puberty.
comment: El síndrome de De la Chapelle provoca que las personas con cromosomas XX nazcan con pene y testículos. Esto suele suceder porque un gen particular que normalmente se ve en los cromosomas Y (conocido como el gen SRY) termina en uno de los cromosomas X y provoca que sus genitales y órganos reproductivos internos se desarrollen como lo harían normalmente en alguien con cromosomas XY. Las personas con De la Chapelle pueden tener testículos más pequeños de lo usual o que no han descendido y, a menudo, son infértiles. En la adolescencia, pueden experimentar crecimiento de los senos y es posible que no desarrollen las características que generalmente se asocian con una pubertad típica de testosterona. @es
broader: Intersex variations
has top concept: Sex (Body)
issued: 2023-06-28
modified: 2025-02-23
type: Concept
in scheme: v3
change note: Version 4.1.0

Early genital surgery model
alternative label: John Money model
comment: Patient care model developed by John Money, a New Zealand psychologist who theorized that gender was completely dependent on "nurture." This model advocates for performing genital surgery on intersex infants and raising them as girls. Money's theories have resulted in many surgically misgendered children who have had to deal with life-long gender dysphoria, depression, sexual dysfunction, bowel and urinary incontinence, and nerve pain. A patient-centered model, in which the intersex child is allowed to grow up and make their own choices regarding their gender and surgical option, is now preferred.
broader: Intersex
related: Medicalization
has top concept: Sex (Body)
issued: 2023-06-28
modified: 2025-02-23
type: Concept
in scheme: v3
change note: Version 4.1.0

Epispadias
alternative label: Anaspadias
comment: People with epispadias are born with a urinary opening located on the upper surface of their penis rather than at the tip (similar to the more common variation hypospadias). People with vulvas can also be born with epispadias, in which case the urethral opening is wider and located higher than typical. The clitoris may also be split into two halves. Epispadias is usually present whenever bladder exstrophy or cloacal exstrophy develop, but epispadias can also occur by itself.
comment: Las personas con epispadias nacen con una apertura urinaria ubicada en la superficie superior del pene en lugar de en la punta (similar a la variación más común de hipospadias). Las personas con vulva también pueden nacer con epispadias, en cuyo caso la apertura uretral es más ancha y está situada más arriba de lo normal. El clítoris también puede dividirse en dos mitades. El epispadias suele estar presente cuando se desarrolla extrofia de la vejiga o extrofia cloacal, pero el epispadias también puede ocurrir por sí solo. @es
broader: Intersex variations
has top concept: Sex (Body)
issued: 2023-06-28
modified: 2025-02-23
type: Concept
in scheme: v3
change note: Version 4.1.0

Estrogen insensitivity syndrome
preferred label: Síndrome de insensibilidad a los estrógenos @es
alternative label: EIS
alternative label: SIA @es
comment: People with estrogen insensitivity syndrome (EIS) have a genetic variation in which their bodies do not respond to estrogen. People with XX chromosomes and EIS are usually born with a vulva and vagina, may have a small uterus and enlarged ovaries that later develop multiple cysts, and may produce very high levels of estrogen that their bodies do not recognize. In adolescence, they will most likely not experience the changes associated with a typical estrogen puberty such as breast development or menstruation. They may instead develop pubic hair and acne due to the influence of androgens. People with XY chromosomes can also be born with EIS, and they may or may not experience variations in their other hormone production, testicular development, and development of secondary sex characteristics as a result.
comment: Las personas con síndrome de insensibilidad al estrógeno (SIE) tienen una variación genética en la que sus cuerpos no responden al estrógeno. Las personas con cromosomas XX y SIE generalmente nacen con vulva y vagina, pueden tener un útero pequeño y ovarios agrandados que luego desarrollan múltiples quistes y pueden producir niveles muy altos de estrógeno que sus cuerpos no reconocen. En la adolescencia, lo más probable es que no experimenten los cambios asociados con una pubertad típica con estrógenos, como el desarrollo de los senos o la menstruación. En cambio, pueden desarrollar vello púbico y acné debido a la influencia de los andrógenos. Las personas con cromosomas XY también pueden nacer con SIE y, como resultado, pueden o no experimentar variaciones en la producción de otras hormonas, el desarrollo testicular y el desarrollo de características sexuales secundarias. @es
broader: Intersex variations
has top concept: Sex (Body)
issued: 2023-06-28
modified: 2025-02-23
type: Concept
in scheme: v3
change note: Version 4.1.0

Follicle-stimulating hormone insensitivity
preferred label: Insensibilidad a la hormona foliculoestimulante @es
alternative label: FSH
alternative label: FSH insensitivity
comment: People with follicle-stimulating hormone (FSH) insensitivity have a genetic variation where their bodies do not respond to FSH. People with XX chromosomes and FSH insensitivity will usually be born with a vulva, vagina, and ovaries. Their ovaries may produce lower amounts of estrogen than is considered typical, and they may not produce fertile follicles (eggs). In adolescence, they may not develop secondary sex characteristics associated with a typical estrogen puberty and may not menstruate. People with XY chromosomes and FSH insensitivity may develop smaller-than-typical testes, may produce fewer sperm than usual, and may not be fertile.
comment: Las personas con insensibilidad a la hormona foliculoestimulante (FSH) tienen una variación genética por lo que su cuerpo no responde a la FSH. Las personas con cromosomas XX e insensibilidad a la FSH suelen nacer con vulva, vagina y ovarios. Sus ovarios pueden producir menores cantidades de estrógeno a las consideradas típicas y es posible que no produzcan folículos fértiles (óvulos). En la adolescencia, es posible que no desarrollen las características sexuales secundarias asociadas a una pubertad típica con estrógenos y que no menstrúen. Las personas con cromosomas XY e insensibilidad a la FSH pueden desarrollar testículos más pequeños de lo usual, producir menos espermatozoides de lo habitual y no ser fértiles. @es
broader: Intersex variations
has top concept: Sex (Body)
issued: 2023-06-28
modified: 2025-02-23
type: Concept
in scheme: v3
change note: Version 4.1.0

Fraser syndrome
preferred label: Síndrome de Fraser @es
comment: People with Fraser syndrome are usually born with differences in the development of their eyelids, fingers, and toes. They may also have variations in their sex characteristics, such as a larger-than-typical clitoris or undescended testes. They may develop without one or both kidneys, and other parts of the urinary system can additionally be affected.
comment: Las personas con síndrome de Fraser suelen nacer con diferencias en el desarrollo de los párpados, los dedos de las manos y de los pies. También pueden tener variaciones en sus características sexuales, como un clítoris más grande de lo típico o testículos no descendidos. Pueden desarrollarse sin uno o ambos riñones, y otras partes del sistema urinario también pueden verse afectadas. @es
broader: Intersex variations
has top concept: Sex (Body)
issued: 2023-06-28
modified: 2025-02-23
type: Concept
in scheme: v3
change note: Version 4.1.0

Gonadectomy
preferred label: Gonadectomía @es
comment: Surgical procedure to remove the gonads, including testes and ovaries.
comment: Procedimiento quirúrgico para extirpar las gónadas, incluidos los testículos y los ovarios. @es
broader: Bottom surgery
has top concept: Medical care
issued: 2023-06-28
modified: 2025-02-23
type: Concept
in scheme: v3
change note: Version 4.1.0

Hopkins model
alternative label: Concealment centered model
comment: A patient care model that gained popular usage in the 1950s. In this model, parents are used to quickly decide on a gender assignment for their intersex baby, under the assumption that the child would identify with whichever gender their parents raised them as. If a child later deviated from the assigned gender, parents were encouraged to verbally and physically "correct" the child and enforce gender norms. In practice, this resulted in life-altering, unnecessary genital surgeries, irreversible hormone treatments, and dishonesty on the parent's part. A patient-centered model, in which the intersex child is allowed to grow up and make their own choices regarding their gender and surgical option, is now preferred.
broader: Intersex
related: Medicalization
has top concept: Sex (Body)
issued: 2023-06-28
modified: 2025-02-23
type: Concept
in scheme: v3
change note: Version 4.1.0

Hyperandrogenism
preferred label: Hiperandrogenismo @es
comment: People with hyperandrogenism have higher-than-typical levels of testosterone and/or other androgens. In people with XX chromosomes, hyperandrogenism can result in the development of secondary sex characteristics that are associated with the influence of testosterone (such as facial and body hair) to varying degrees. Hyperandrogenism may or may not be the result of an underlying intersex variation, but it is common in several variations (including CAH and PCOS). People with hyperandrogenism who aren’t intersex will nonetheless often have many experiences in common with intersex people, such as encountering exclusion and discrimination in sex-segregated contexts like sports.
comment: Las personas con hiperandrogenismo tienen niveles de testosterona y/u otros andrógenos más altos de lo normal. En personas con cromosomas XX, el hiperandrogenismo puede resultar en el desarrollo de características sexuales secundarias que están asociadas con la influencia de la testosterona (como el vello facial y corporal) en diversos grados. El hiperandrogenismo puede o no ser el resultado de una variación intersex subyacente, pero es común en varias variaciones (incluidas CAH y SOP). Sin embargo, las personas con hiperandrogenismo que no son intersex suelen tener muchas experiencias en común con las personas intersex, como enfrentarse a la exclusión y la discriminación en contextos segregados por sexo, como los deportes. @es
broader: Intersex variations
has top concept: Sex (Body)
issued: 2023-06-28
modified: 2025-02-23
type: Concept
in scheme: v3
change note: Version 4.1.0

Hypogonadism
preferred label: Hipogonadismo @es
comment: People with hypogonadism produce lower-than-typical levels of hormones like testosterone and estrogen, or none at all. This can affect how a person’s secondary sex characteristics develop as well as their fertility. Hypogonadism can be a result of a difference in how someone’s brain signals for their gonads to produce (or not produce) hormones, or it can be a feature of their gonads directly. Hypogonadism is not always caused by an intersex variation, but can be related to Klinefelter syndrome, Turner syndrome, and several other variations.
comment: Las personas con hipogonadismo producen niveles de hormonas como testosterona y estrógeno más bajos de lo normal, o ninguno en absoluto. Esto puede afectar el desarrollo de las características sexuales secundarias de una persona, así como su fertilidad. El hipogonadismo puede ser el resultado de una diferencia en la forma en que el cerebro de una persona envía señales a sus gónadas para que produzcan (o no produzcan) hormonas, o puede ser una característica de sus gónadas directamente. El hipogonadismo no siempre es causado por una variación intersex, pero puede estar relacionado con el síndrome de Klinefelter, el síndrome de Turner y varias otras variaciones. @es
broader: Intersex variations
has top concept: Sex (Body)
issued: 2023-06-28
modified: 2025-02-23
type: Concept
in scheme: v3
change note: Version 4.1.0

Informed consent
preferred label: Consentimiento informado @es
comment: The practice of weighing all options and considering evidence, alternatives, and potential risks in order to make a truly informed medical decision. Such decisions are best made over a period of time rather than under pressure.
comment: La práctica de sopesar todas las opciones y considerar evidencia, alternativas y riesgos potenciales para tomar una decisión médica verdaderamente informada. Se dan mejor esas tomas de decisiones durante un período de tiempo en lugar de bajo presión. @es
broader: Consent
related: Medical care
has top concept: Consent
issued: 2023-06-28
modified: 2025-02-23
type: Concept
in scheme: v3
change note: Version 4.1.0

Intersexual
alternative label: Intersex
comment: This term is not common in the English language as to not confuse intersex with a gender identity or sex orientation by adding "ual" but it is used in other languages such as Spanish to mean "intersex."
is replaced by: homoit0000352
issued: 2023-06-28
modified: 2023-12-08
type: Concept
in scheme: v3
change note: Version 4.1.0

Intersex surgery
preferred label: Cirugía intersex @es
comment: Non-lifesaving cosmetic procedures intended to change and "normalize" natural variations in genital appearance and/or reproductive anatomy. Intersex surgery was first developed in the early 20th century, with doctors making unresearched claims about an "urgent need" for these operations.
comment: Procedimientos cosméticos que no salvan vidas destinados a cambiar y "normalizar" las variaciones naturales en la apariencia genital y/o la anatomía reproductiva. La cirugía intersex se desarrolló por primera vez a principios del siglo XX, cuando los médicos afirmaban sin fundamento investigativo la supuesta "necesidad urgente" para estas operaciones. @es
broader: Intersex genital mutilation
related: Bottom surgery
has top concept: Intersex genital mutilation
issued: 2023-06-28
modified: 2025-02-23
type: Concept
in scheme: v3
change note: Version 4.1.0

Isolated 17,20-lyase deficiency
alternative label: ILD
comment: People with isolated 17,20-lyase deficiency (ILD) have one of several specific variations in their genes that cause their bodies to make lower-than-typical amounts of testosterone. They may be born with genitals that do not appear quite like a typical penis, and their testes may be descended or undescended. In adolescence, they may not experience all of the changes related to a typical testosterone puberty because their variation impacts their hormone production.
broader: Intersex variations
has top concept: Sex (Body)
issued: 2023-06-28
modified: 2025-02-23
type: Concept
in scheme: v3
change note: Version 4.1.0

Asexual studies
preferred label: Estudios asexuales @es
comment: Academic field of research and study about Asexual people, Asexual identity, and Asexual communities.
comment: Campo académico de investigación y estudio sobre las personas asexuales, la identidad asexual y las comunidades asexuales. @es
related: Queer studies
issued: 2023-06-28
modified: 2026-02-24
type: Concept
in scheme: v3
change note: Version 4.1.0

Asexual survivors of hate crimes
preferred label: Sobrevivientes asexuales de crímenes de odio @es
comment: Asexual people who have experienced and survived hate crimes; follow the individual's preference for "victims" or "survivors" whenever possible.
comment: Personas asexuales que han sufrido y sobrevivido a crímenes de odio; siga la preferencia de la persona sobre el uso de "víctimas" o "sobrevivientes" siempre que sea posible. @es
broader: LGBTQ+ survivors of hate crimes
has top concept: LGBTQ+ people
issued: 2023-06-28
modified: 2025-02-23
type: Concept
in scheme: v3
change note: Version 4.1.0

Asexual survivors of rape
preferred label: Sobrevivientes asexuales de violación @es
comment: Asexual people who have experienced and survived rape; follow the individual's preference for "victims" or "survivors" whenever possible.
comment: Personas asexuales que han sufrido y sobrevivido a una violación; siga la preferencia de la persona sobre el uso de "víctimas" o "sobrevivientes" siempre que sea posible. @es
broader: LGBTQ+ survivors of rape
has top concept: LGBTQ+ people
issued: 2023-06-28
modified: 2025-02-23
type: Concept
in scheme: v3
change note: Version 4.1.0

Asexual survivors of sexual abuse
preferred label: Sobrevivientes asexuales de abuso sexual @es
comment: Asexual people who have experienced and survived sexual abuse; follow the individual's preference for "victims" or "survivors" whenever possible.
comment: Personas asexuales que han sufrido y sobrevivido a abusos sexuales; siga la preferencia de la persona sobre el uso de "víctimas" o "sobrevivientes" siempre que sea posible. @es
broader: LGBTQ+ survivors of sexual abuse
has top concept: LGBTQ+ people
issued: 2023-06-28
modified: 2025-02-23
type: Concept
in scheme: v3
change note: Version 4.1.0

Asexual survivors of war
preferred label: Sobrevivientes asexuales de guerra @es
comment: Asexual people who have experienced and survived war; follow the individual's preference for "victims" or "survivors" whenever possible.
comment: Personas asexuales que han sufrido y sobrevivido a la guerra; siga la preferencia de la persona sobre el uso de "víctimas" o "sobrevivientes" siempre que sea posible. @es
broader: LGBTQ+ survivors of war
has top concept: LGBTQ+ people
issued: 2023-06-28
modified: 2025-02-23
type: Concept
in scheme: v3
change note: Version 4.1.0

Asexual television
preferred label: Televisión asexual @es
comment: Television shows featuring asexual characters or themes.
comment: Programas de televisión con personajes o temas asexuales. @es
broader: LGBTQ+ television
has top concept: LGBTQ+ television
issued: 2023-06-28
modified: 2025-02-23
type: Concept
in scheme: v3
change note: Version 4.1.0

Asexual victims of rape
preferred label: Víctimas asexuales de violación @es
comment: Asexual people who have experienced rape and may or may not have survived; follow the individual's preference for "victims" or "survivors" whenever possible.
comment: Personas asexuales que han sufrido una violación y pueden haber sobrevivido o no; siga la preferencia de la persona sobre el uso de "víctimas" o "sobrevivientes" siempre que sea posible. @es
broader: LGBTQ+ victims of rape
has top concept: LGBTQ+ people
issued: 2023-06-28
modified: 2025-02-23
type: Concept
in scheme: v3
change note: Version 4.1.0

Asexual victims of sexual abuse
preferred label: Víctimas asexuales de abuso sexual @es
comment: Asexual people who have experienced sexual abuse and may or may not have survived; follow the individual's preference for "victims" or "survivors" whenever possible.
comment: Personas asexuales que han sufrido abuso sexual y pueden haber sobrevivido o no; siga la preferencia de la persona sobre el uso de "víctimas" o "sobrevivientes" siempre que sea posible. @es
broader: LGBTQ+ victims of sexual abuse
has top concept: LGBTQ+ people
issued: 2023-06-28
modified: 2025-02-23
type: Concept
in scheme: v3
change note: Version 4.1.0

Asexual victims of war
preferred label: Víctimas asexuales de guerra @es
comment: Asexual people who have experienced war and may or may not have survived; follow the individual's preference for "victims" or "survivors" whenever possible.
comment: Personas asexuales que han sufrido la guerra y que pueden haber sobrevivido o no; siga la preferencia de la persona sobre el uso de "víctimas" o "sobrevivientes" siempre que sea posible. @es
broader: LGBTQ+ victims of war
has top concept: LGBTQ+ people
issued: 2023-06-28
modified: 2025-02-23
type: Concept
in scheme: v3
change note: Version 4.1.0

Asexual victims' rights
preferred label: Derechos de víctimas asexuales @es
comment: Asexual people’s legal rights to be informed, present, and heard within the criminal justice system after having been harmed or injured as the result of a crime, accident, or other event.
comment: Los derechos legales de las personas asexuales a estar informadas, estar presentes y ser escuchadas dentro del sistema de justicia penal después de haber sido perjudicadas o lesionadas como resultado de un delito, una accidente u otro evento. @es
broader: LGBTQ+ victims' rights
has top concept: Law
issued: 2023-06-28
modified: 2025-02-23
type: Concept
in scheme: v3
change note: Version 4.1.0

Asexual-focused businesses
preferred label: Negocios orientados a personas asexuales @es
alternative label: Empresas orientadas a personas asexuales @es
alternative label: Compañías orientadas a personas asexuales @es
comment: Businesses focusing on asexual clientele and products related to asexual communities.
comment: Empresas enfocadas clientela asexual y productos relacionados con comunidades asexuales. @es
broader: LGBTQ+-focused businesses
has top concept: LGBTQ+-focused businesses
issued: 2023-06-28
modified: 2025-02-23
type: Concept
in scheme: v3
change note: Version 4.1.0

Asexual-owned businesses
preferred label: Negocios propiedad de personas asexuales @es
alternative label: Negocios de dueños asexuales @es
alternative label: Compañías de dueños asexuales @es
alternative label: Empresas de propietarios asexuales @es
alternative label: Negocios de dueñas asexuales @es
alternative label: Compañías de dueñas asexuales @es
alternative label: Empresas de propietarias asexuales @es
comment: Businesses owned by asexual people.
comment: Empresas pertenecientes a personas asexuales. @es
broader: LGBTQ+-owned businesses
has top concept: LGBTQ+-owned businesses
issued: 2023-06-28
modified: 2025-02-23
type: Concept
in scheme: v3
change note: Version 4.1.0

Jacobs syndrome
preferred label: Síndrome de Jakob @es
alternative label: 47XYY
alternative label: XYY syndrome
alternative label: Síndrome XYY @es
alternative label: Síndrome del supermacho @es
comment: People with Jacobs syndrome develop with an extra Y chromosome. They might not have any obvious physical variations as a result, or they may be taller than usual or have other identifiable differences that do not relate to sex characteristics. Some people with Jacobs syndrome may also have a smaller-than-typical penis or scrotum, hypospadias, and/or undescended testicles.
comment: Las personas con síndrome de Jakob se desarrollan con un cromosoma Y adicional. Como resultado, es posible que no tengan variaciones físicas obvias, o puede que sean más altas de lo habitual o tener otras diferencias identificables que no se relacionan con las características sexuales. Algunas personas con síndrome de Jakob también pueden tener un pene o escroto más pequeño de lo normal, hipospadias y/o testículos no descendidos. @es
broader: Intersex variations
has top concept: Sex (Body)
issued: 2023-06-28
modified: 2025-02-23
type: Concept
in scheme: v3
change note: Version 4.1.0

Kallmann syndrome
preferred label: Síndrome de Kallmann @es
alternative label: Hypogonadotropic hypogonadism
comment: Kallmann syndrome can occur in people with XX or XY chromosomes and is a form of hypogonadism. People with Kallmann syndrome and XY chromosomes are often born with a smaller-than-typical penis and undescended testes. In adolescence, most people with Kallmann syndrome will either start puberty later than usual or not experience typical pubertal changes (such as developing facial hair and a deeper voice for people with XY chromosomes or developing breasts and starting to menstruate for people with XX chromosomes) unless they receive hormone therapy. Kallmann syndrome also affects someone’s sense of smell.
comment: El síndrome de Kallmann puede ocurrir en personas con cromosomas XX o XY y es una forma de hipogonadismo. Las personas con síndrome de Kallmann y cromosomas XY suelen nacer con un pene más pequeño de lo normal y testículos no descendidos. En la adolescencia, la mayoría de las personas con síndrome de Kallmann comenzarán la pubertad más tarde de lo habitual o no experimentarán los cambios puberales típicos (como desarrollar vello facial y una voz más grave en las personas con cromosomas XY o desarrollar senos y comenzar a menstruar en las personas con cromosomas XX) a menos que reciben terapia hormonal. El síndrome de Kallmann también afecta el sentido del olfato. @es
broader: Intersex variations
has top concept: Sex (Body)
issued: 2023-06-28
modified: 2025-02-23
type: Concept
in scheme: v3
change note: Version 4.1.0

Leydig cell hypoplasia
preferred label: Hipoplasia de células de Leydig @es
alternative label: LCH
comment: People with Leydig cell hypoplasia (LCH) have XY chromosomes and a genetic insensitivity to luteinizing hormone. LCH can be either complete (known as LCH Type 1) or partial (known as LCH Type 2). Luteinizing hormone is typically responsible for the development of Leydig cells in the testicles and for signaling for those cells to produce androgens like testosterone. Someone with LCH will develop few or no Leydig cells and therefore will produce less testosterone than is typical.
comment: Las personas con hipoplasia de células de Leydig (HCL) tienen cromosomas XY y una insensibilidad genética a la hormona luteinizante. La HCL puede ser completa (conocida como HCL tipo 1) o parcial (conocida como HCL tipo 2). La hormona luteinizante suele ser responsable del desarrollo de las células de Leydig en los testículos y de indicarles a esas células que produzcan andrógenos como la testosterona. Alguien con HCL desarrollará pocas o ninguna célula de Leydig y, por lo tanto, producirá menos testosterona de lo normal. @es
broader: Intersex variations
narrower: Type 1 Leydig cell hypoplasia
narrower: Type 2 Leydig cell hypoplasia
has top concept: Sex (Body)
issued: 2023-06-28
modified: 2025-02-23
type: Concept
in scheme: v3
change note: Version 4.1.0

Luteinizing hormone insensitivity
comment: People with XY chromosomes and luteinizing hormone insensitivity develop the variation Leydig cell hypoplasiae. Because people with XX chromosomes do not typically produce Leydig cells to begin with, someone with XX chromosomes who has a genetic insensitivity to luteinizing hormone will not be affected in the same way. A person with XX chromosomes whose body does not respond to luteinizing hormone will not usually have any noticeable differences at birth, but their ovaries may not produce fertile follicles (eggs), and they may not menstruate.
broader: Intersex variations
has top concept: Sex (Body)
issued: 2023-06-28
modified: 2025-02-23
type: Concept
in scheme: v3
change note: Version 4.1.0

Mayer-Rokitansky-Küster-Hauser syndrome
preferred label: Síndrome de Mayer-Rokitansky-Küster-Hauser @es
alternative label: MRKH syndrome
alternative label: Müllerian agenesis
alternative label: Müllerian duct anomalies
alternative label: Müllerian duct variations
comment: Mayer-Rokitansky-Küster-Hauser (MRKH) syndrome occurs when a person's Müllerian ducts, which typically become the uterus and upper portion of the vagina during fetal development, do not develop in the typical way. People with MRKH have XX chromosomes and are usually born with a vulva and either a vagina that is shorter than typical or no vagina. They usually do not have a cervix and may have a partial uterus (uterine remnant) or no uterus. They often do not mensturate but may experience cyclic pain if they have a uterine remnant with endometrial lining, and they can develop menstruation-related conditions like endometriosis.
comment: El síndrome de Mayer-Rokitansky-Küster-Hauser (MRKH, por sus siglas en inglés) ocurre cuando los conductos müllerianos de una persona, que normalmente se convierten en el útero y la parte superior de la vagina durante el desarrollo fetal, no se desarrollan de la manera típica. Las personas con MRKH tienen cromosomas XX y generalmente nacen con una vulva y una vagina más corta de lo normal o sin vagina. Por lo general, no tienen cuello uterino y pueden tener un útero parcial (restos uterinos) o ningún útero. A menudo no menstrúan, pero pueden experimentar dolor cíclico si tienen un remanente uterino con tejido endometrial y pueden desarrollar condiciones relacionadas con la menstruación, como la endometriosis. @es
broader: Intersex variations
narrower: Type 1 Mayer-Rokitansky-Küster-Hauser syndrome
narrower: Type 2 Mayer-Rokitansky-Küster-Hauser syndrome
has top concept: Sex (Body)
issued: 2023-06-28
modified: 2025-02-23
type: Concept
in scheme: v3
change note: Version 4.1.0

Mild androgen insensitivity syndrome
preferred label: Síndrome de insensibilidad androgénica leve @es
alternative label: MAIS
comment: People with mild androgen insensitivity syndrome (MAIS) respond to testosterone at a somewhat reduced level compared to typical levels, which means that they will usually be born with a penis (which may or may not be smaller than typical) and will later develop secondary sex characteristics associated with a typical testosterone puberty. Because their bodies convert a small amount of their naturally produced androgens into estrogen, they may have visible variations in features, such as the amount of facial hair, body hair, or muscle tone they develop. They may also experience some breast development during puberty.
comment: Las personas con síndrome de insensibilidad androgénica leve (MAIS, por sus siglas en inglés) responden a la testosterona a un nivel algo reducido en comparación con los niveles típicos, lo que significa que generalmente nacerán con un pene (que puede o no ser más pequeño de lo típico) y luego desarrollarán características sexuales secundarias asociadas con una pubertad típica de testosterona. Debido a que sus cuerpos convierten una pequeña cantidad de los andrógenos producidos naturalmente en estrógeno, pueden tener variaciones visibles en sus rasgos, como la cantidad de vello facial, vello corporal o el tono muscular que desarrollen. También pueden experimentar cierto desarrollo mamario durante la pubertad. @es
broader: Androgen insensitivity syndrome
has top concept: Sex (Body)
issued: 2023-06-28
modified: 2025-02-23
type: Concept
in scheme: v3
change note: Version 4.1.0

Mixed gonadal dysgenesis
preferred label: Disgenesia gonadal mixta @es
alternative label: Partial gonadal dysgenesis
alternative label: Disgenesia gonadal parcial @es
comment: People with mixed gonadal dysgenesis are born with a mosaic (usually 45X/46XY) chromosome pattern and may develop some gonadal streak tissue and testicular tissue. They may be born with a vulva or penis, or with visible genital variations. They usually have a partially or completely developed uterus, and they may have combinations of internal reproductive structures such as a fallopian tube and a vas deferens on opposite sides of the body. In adolescence, people with mixed gonadal dysgenesis may develop some secondary sex characteristics associated with a typical testosterone puberty, depending on the amount of hormone-producing testicular tissue they have.
comment: Las personas con disgenesia gonadal mixta nacen con un patrón cromosómico a modo de mosaico (generalmente 45X/46XY) y pueden desarrollar algo de tejido de estriado gonadal y tejido testicular. Pueden nacer con vulva o pene, o con variaciones genitales visibles. Por lo general, tienen un útero parcial o completamente desarrollado y pueden tener combinaciones de estructuras reproductivas internas como una trompa de Falopio y un conducto deferente en lados opuestos del cuerpo. En la adolescencia, las personas con disgenesia gonadal mixta pueden desarrollar algunas características sexuales secundarias asociadas con una pubertad típica de testosterona, dependiendo de la cantidad de tejido testicular productor de hormonas que tengan. @es
broader: Gonadal dysgenesis
has top concept: Sex (Body)
issued: 2023-06-28
modified: 2025-02-23
type: Concept
in scheme: v3
change note: Version 4.1.0

Müllerian duct variations
alternative label: MRKH
alternative label: Müllerian agenesis
alternative label: Müllerian duct anomalies
comment: People with XX chromosomes can have a broad range of variations in how their Müllerian ducts (which typically form the uterus, fallopian tubes, cervix, and upper portion of the vagina) develop. They might have a variation that causes their uterus to develop with a different shape than typical, or to be doubled. Others may have vaginal variations such as a “hemivagina” (where one side of the vagina is obstructed, which can sometimes block menstrual blood from exiting), or a band of tissue dividing the vaginal canal (known as a vaginal septum). Müllerian duct variations usually don’t cause someone to have any variations in their ovaries or hormone production.
broader: Intersex variations
has top concept: Sex (Body)
is replaced by: homoit0002865
issued: 2023-06-28
modified: 2024-01-30
type: Concept
in scheme: v3
change note: Version 4.1.0

Non-classical congenital adrenal hyperplasia
preferred label: Hiperplasia suprarrenal congénita tardía @es
alternative label: Late-onset congenital adrenal hyperplasia
comment: Non-classical congenital adrenal hyperplasia (CAH), a subtype of CAH, does not usually become apparent until later in childhood, adolescence, or even young adulthood.
comment: La hiperplasia suprarrenal congénita no clásica (CAH, por sus siglas en inglés), un subtipo de CAH, generalmente no se hace evidente hasta más tarde en la infancia, la adolescencia o incluso en la edad adulta. @es
broader: Congenital adrenal hyperplasia
has top concept: Sex (Body)
issued: 2023-06-28
modified: 2025-02-23
type: Concept
in scheme: v3
change note: Version 4.1.0

Penoscrotal transposition
preferred label: Transposición penoscrotal @es
comment: People with penoscrotal transposition are born with a different genital configuration than typical, with their penis located below or in the middle of their scrotum instead of above it. Their scrotum might be bifid (split into two halves), and they may also have hypospadias and/or chordee.
comment: Las personas con transposición penoescrotal nacen con una configuración genital diferente a la típica, con el pene ubicado debajo o en el medio del escroto en lugar de encima. Su escroto puede ser bífido (dividido en dos mitades) y también pueden tener hipospadias y/o cordee. @es
broader: Intersex variations
has top concept: Sex (Body)
issued: 2023-06-28
modified: 2025-02-23
type: Concept
in scheme: v3
change note: Version 4.1.0

Persistent Müllerian duct syndrome
preferred label: Síndrome de persistencia de los conductos müllerianos @es
alternative label: PMDS
comment: People with Persistent Müllerian duct syndrome (PMDS) have XY chromosomes, male-typical reproductive organs and external genitalia, and some component(s) of a female-typical reproductive tract, such as a uterus, fallopian tubes, and/or upper vaginal canal. PMDS occurs when the Müllerian ducts—internal structures that ordinarily break down in an XY fetus—remain and develop as they would in an XX fetus. PMDS is ordinarily not diagnosed at birth, and individuals with this variation often have a male gender identity.
comment: Las personas con síndrome de conducto mülleriano persistente (PMDS, por sus siglas en inglés) tienen cromosomas XY, órganos reproductores y genitales externos típicos masculinos y algunos componentes de un aparato reproductor típico femenino, como útero, trompas de Falopio y/o canal vaginal superior. El SDMP se produce cuando los conductos müllerianos -estructuras internas que normalmente se rompen en un feto XY- permanecen y se desarrollan como lo harían en un feto XX. El SDMP no suele diagnosticarse al nacer, y las personas con esta variante suelen tener una identidad de género masculina. @es
broader: Intersex variations
has top concept: Sex (Body)
issued: 2023-06-28
modified: 2025-02-23
type: Concept
in scheme: v3
change note: Version 4.1.0

Polycystic ovary syndrome
preferred label: Síndrome de ovario poliquístico @es
alternative label: PCOD
alternative label: PCOS
alternative label: Polycystic ovarian disease
alternative label: Polycystic ovarian syndrome
alternative label: SOP @es
comment: People with this variation have XX chromosomes and are generally born with a vulva and vagina, a uterus, and ovaries. Later in life, their ovaries often produce higher-than-typical levels of androgens like testosterone. Polycystic ovary syndrome (PCOS) can also result in the development of characteristics such as facial and body hair, and it can interfere with the process of ovulation. This in turn can cause irregular periods or no periods, and people with PCOS may struggle to become pregnant. Some people with PCOS have small cysts (fluid-filled sacs) on their ovaries, but some do not. Signs of PCOS generally will not show up until a person starts menstruating, or later in life.
comment: Las personas con esta variación tienen cromosomas XX y generalmente nacen con vulva y vagina, útero y ovarios. Más adelante en la vida, sus ovarios a menudo producen niveles de andrógenos, como la testosterona, más altos de lo normal. El síndrome de ovario poliquístico (SOP) también puede provocar el desarrollo de características como vello facial y corporal, y puede interferir con el proceso de ovulación. Esto, a su vez, puede provocar períodos irregulares o ausencia de períodos, y las personas con síndrome de ovario poliquístico pueden tener dificultades para quedar embarazadas. Algunas personas con síndrome de ovario poliquístico tienen pequeños quistes (sacos llenos de líquido) en los ovarios, pero otras no. Los signos del síndrome de ovario poliquístico generalmente no aparecen hasta que una persona comienza a menstruar, o más adelante en la vida. @es
broader: Intersex variations
has top concept: Sex (Body)
issued: 2023-06-28
modified: 2025-02-23
type: Concept
in scheme: v3
change note: Version 4.1.0

Pseudohermaphroditism
preferred label: Pseudohermafroditismo @es
alternative label: Female pseudohermaphroditism
alternative label: Male pseudohermaphroditism
alternative label: Seudohermafroditismo @es
comment: A term previously used in medical contexts to refer to different groups of intersex variations, usually divided into categories of “male pseudohermaphroditism” and “female pseudohermaphroditism” on the basis of the person’s chromosomes. People may still find these terms used in their medical records or in medical journal articles when researching their variation, but they are often considered highly stigmatizing in addition to being vague and inaccurate. Do not use this term to describe a person's variation unless they do so themselves.
comment: Un término utilizado anteriormente en contextos médicos para referirse a diferentes grupos de variaciones intersex, generalmente divididos en categorías de “pseudohermafroditismo masculino” y “pseudohermafroditismo femenino” según los cromosomas de la persona. Es posible que las personas todavía encuentren estos términos utilizados en sus registros médicos o en artículos de revistas médicas cuando investigan su variación, pero a menudo se les considera altamente estigmatizantes, además de vagos e inexactos. No debe utilizarse este término para describir la variación de una persona a menos que lo haga ella misma. @es
broader: Intersex variations
has top concept: Sex (Body)
issued: 2023-06-28
modified: 2025-02-23
type: Concept
in scheme: v3
change note: Version 4.1.0

Salt-wasting congenital adrenal hyperplasia
comment: People who have salt-wasting congenital adrenal hyperplasia (CAH), a subtype of classical CAH, experience "salt-wasting," a dangerous scenario a person's low levels of aldosterone cause their body to lose too much sodium. They may experience life-threatening adrenal crises, especially when their body is under stress.
broader: Classical congenital adrenal hyperplasia
has top concept: Sex (Body)
issued: 2023-06-28
modified: 2025-02-23
type: Concept
in scheme: v3
change note: Version 4.1.0

Sex reversal syndrome
preferred label: Síndrome de inversión de sexo @es
comment: A term sometimes used in medical contexts to refer to different variations in which a person is born with XY chromosomes and a vulva and vagina or XX chromosomes and a penis.
comment: Un término que a veces se utiliza en contextos médicos para referirse a diferentes variaciones en las que una persona nace con cromosomas XY y vulva y vagina o cromosomas XX y pene. @es
broader: Intersex variations
has top concept: Sex (Body)
issued: 2023-06-28
modified: 2025-02-23
type: Concept
in scheme: v3
change note: Version 4.1.0

Steroidogenic factor 1 protein
alternative label: SF-1 protein
comment: The steroidogenic factor 1 (SF-1) protein is a transcription factor involved in sex determination. The SF-1 protein controls the activity of genes related to the gonads and adrenal glands.
related: Hormones
issued: 2023-06-28
modified: 2025-02-23
type: Concept
in scheme: v3
change note: Version 4.1.0

Streak gonads
comment: Minimally developed gonadal tissue that is present in place of either testes or ovaries. Streak gonads are more common in certain intersex variations such as Swyer syndrome.
broader: Gonads
has top concept: Sex (Body)
issued: 2023-06-28
modified: 2025-02-23
type: Concept
in scheme: v3
change note: Version 4.1.0

Trisomy X
preferred label: Trisomía X @es
alternative label: Triple XXX syndrome
alternative label: Síndrome triple XXX @es
comment: People with Trisomy X are born with 47XXX chromosomes rather than the typical 46XX. If they receive the additional X chromosome from their parent's original sperm or egg cell, they will have 47XXX chromosomes in all their cells. If the additional chromosome appears during the embryo's development process, however, only some cells will have 47XXX chromosomes and the person will be born with a mosaic chromosome pattern. Most people with 47XXX chromosomes do not develop any variations in their other sex characteristics but some may have ovaries that stop producing hormones at an earlier-than-typical age and some may not menstruate.
comment: Las personas con trisomía X nacen con los cromosomas 47XXX en lugar del típico 46XX. Si reciben el cromosoma X adicional del espermatozoide o del óvulo original de sus padres, tendrán 47XXX cromosomas en todas sus células. Sin embargo, si el cromosoma adicional aparece durante el proceso de desarrollo del embrión, sólo algunas células tendrán cromosomas 47XXX y la persona nacerá con un patrón cromosómico en mosaico. La mayoría de las personas con cromosomas 47XXX no desarrollan ninguna variación en sus otras características sexuales, pero algunas pueden tener ovarios que dejan de producir hormonas a una edad más temprana de lo normal y algunas pueden no menstruar. @es
broader: Intersex variations
has top concept: Sex (Body)
issued: 2023-06-28
modified: 2025-02-23
type: Concept
in scheme: v3
change note: Version 4.1.0

Type 1 Leydig cell hypoplasia
preferred label: Hipoplasia de células de Leydig tipo 1 @es
alternative label: Type 1 LCH
comment: People with Type 1 Leydig cell hypoplasia (LCH) produce almost no testosterone and will usually be born with a vulva and vagina and undescended testes. They are usually assigned female at birth, often without their variation being recognized until adolescence, at which point they generally will not develop any secondary sex characteristics or experience other changes typically associated with puberty.
comment: Las personas con hipoplasia de células de Leydig (HCL) tipo 1 casi no producen testosterona y generalmente nacen con vulva y vagina y testículos no descendidos. Por lo general, se les asigna al sexo femenino al nacer, a menudo sin que se reconozca su variación hasta la adolescencia, momento en el que generalmente no desarrollan ninguna característica sexual secundaria ni experimentan otros cambios típicamente asociados con la pubertad. @es
broader: Leydig cell hypoplasia
has top concept: Sex (Body)
issued: 2023-06-28
modified: 2025-02-23
type: Concept
in scheme: v3
change note: Version 4.1.0

Type 1 Mayer-Rokitansky-Küster-Hauser syndrome
preferred label: Síndrome de Mayer-Rokitansky-Küster-Hauser tipo 1 @es
alternative label: Type 1 MRKH
comment: People with Type 1 Mayer-Rokitansky-Küster-Hauser (MRKH) syndrome typically have only the differences associated with MRKH syndrome.
comment: Las personas con síndrome de Mayer-Rokitansky-Küster-Hauser (MRKH) tipo 1 normalmente sólo tienen las diferencias asociadas con el síndrome de MRKH. @es
broader: Mayer-Rokitansky-Küster-Hauser syndrome
has top concept: Sex (Body)
issued: 2023-06-28
modified: 2025-02-23
type: Concept
in scheme: v3
change note: Version 4.1.0

Type 2 Leydig cell hypoplasia
preferred label: Hipoplasia de células de Leydig tipo 2 @es
alternative label: Type 2 LCH
comment: People with Type 2 Leydig cell hypoplasia (LCH) have some response to luteinizing hormone and produce lower-than-typical amounts of testosterone, but more than people with Type 1 LCH. At birth, their testes may be descended or undescended, and they may have a smaller-than-typical penis, often with other noticeable differences such as hypospadias. In adolescence, they will often develop some characteristics associated with a typical testosterone puberty.
comment: Las personas con hipoplasia de células de Leydig (HCL) tipo 2 tienen cierta respuesta a la hormona luteinizante y producen cantidades de testosterona inferiores a las típicas, pero más que las personas con HCL tipo 1. Al nacer, sus testículos pueden estar descendidos o no descendidos, y pueden tener un pene más pequeño de lo típico, a menudo con otras diferencias notables, como hipospadias. En la adolescencia, a menudo desarrollarán algunas características asociadas con una pubertad típica de testosterona. @es
broader: Leydig cell hypoplasia
has top concept: Sex (Body)
issued: 2023-06-28
modified: 2025-02-23
type: Concept
in scheme: v3
change note: Version 4.1.0

Type 2 Mayer-Rokitansky-Küster-Hauser syndrome
preferred label: Síndrome de Mayer-Rokitansky-Küster-Hauser tipo 2 @es
alternative label: Type 2 MRKH
alternative label: MRKHS @es
comment: People with Type 2 Mayer-Rokitansky-Küster-Hauser (MRKH) syndrome have both the differences associated with MRKH syndrome and additional differences in other parts of their body, such as their fallopian tubes, kidneys, spine, or heart. A specific example of Type 2 MRKH known as Müllerian agenesis, Renal agenesis, Cervicothoracic Somite (MURCS) association, occurs when someone’s kidneys do not develop typically. They may have scoliosis or fused vertebrae in addition to the usual features of MRKH.
comment: Las personas con síndrome de Mayer-Rokitansky-Küster-Hauser (MRKH) tipo 2 tienen tanto las diferencias asociadas con el síndrome de MRKH como diferencias adicionales en otras partes de su cuerpo, como las trompas de Falopio, los riñones, la columna vertebral o el corazón. Un ejemplo específico de MRKH tipo 2 conocido como agenesia mülleriana, agenesia renal, asociación somita cervicotorácica (MURCS, por sus siglas en inglés), ocurre cuando los riñones de una persona no se desarrollan normalmente. Pueden tener escoliosis o vértebras fusionadas además de las características habituales de MRKH. @es
broader: Mayer-Rokitansky-Küster-Hauser syndrome
has top concept: Sex (Body)
issued: 2023-06-28
modified: 2025-02-23
type: Concept
in scheme: v3
change note: Version 4.1.0

Vaginal atresia
preferred label: Atresia vaginal @es
comment: People with this variation may be born without a vaginal opening, a shallow “dimple” where an opening would typically be, or a vaginal opening that is fused or blocked by fibrous tissue. People with vaginal atresia often have a typical upper vaginal canal (along with a typical uterus, cervix, fallopian tubes, and ovaries) with differences in the lower portion of the vagina only.
comment: Las personas con esta variación pueden nacer sin una abertura vaginal, un "hoyuelo" poco profundo donde normalmente estaría una abertura, o una abertura vaginal fusionada o bloqueada por tejido fibroso. Las personas con atresia vaginal a menudo tienen un canal vaginal superior típico (junto con un útero, cuello uterino, trompas de Falopio y ovarios típicos) con diferencias solo en la porción inferior de la vagina. @es
broader: Intersex variations
has top concept: Sex (Body)
issued: 2023-06-28
modified: 2025-02-23
type: Concept
in scheme: v3
change note: Version 4.1.0

X gender markers
preferred label: Marcadores de género X @es
comment: Gender markers that indicate a person is NOT cisgender. X gender markers may be assigned to or adopted by intersex people or transgender people.
comment: Marcadores de género que indican que una persona NO es cisgénero. Los marcadores de género X pueden ser asignados a o adoptados por personas intersex o transgénero. @es
broader: Gender markers
related: Assigned X at birth
has top concept: Legal status
issued: 2023-06-28
modified: 2025-02-23
type: Concept
in scheme: v3
change note: Version 4.1.0

XXYY syndrome
preferred label: Síndrome XXYY @es
alternative label: Síndrome 48 XXYY @es
comment: People with XXYY syndrome are born with an extra copy of both an X and Y chromosome, resulting in an 48XXYY chromosome pattern instead of the typical 46XY. People with XXYY chromosomes may have undescended testes and produce lower-than-typical amounts of testosterone, which can cause them to start puberty at a later age than typical and develop less pronounced secondary sex characteristics like muscle tone and facial hair. They may also experience breast growth. People with XXYY syndrome often have other physical features that are similar to those developed by people with Klinefelter syndrome (47XXY).
comment: Las personas con síndrome XXYY nacen con una copia adicional de un cromosoma X y uno Y, lo que resulta en un patrón cromosómico 48XXYY, en lugar del típico 46XY. Las personas con cromosomas XXYY pueden tener testículos no descendidos y producir cantidades de testosterona inferiores a las habituales, lo que puede provocar que comiencen la pubertad a una edad más tardía de lo habitual y que desarrollen características sexuales secundarias menos pronunciadas, como el tono muscular y el vello facial. También pueden experimentar crecimiento de los senos. Las personas con síndrome XXYY suelen tener otras características físicas similares a las que desarrollan las personas con síndrome de Klinefelter (47XXY). @es
broader: Intersex variations
has top concept: Sex (Body)
issued: 2023-06-28
modified: 2025-02-23
type: Concept
in scheme: v3
change note: Version 4.1.0

LGBTQ+ operas
preferred label: Óperas LGBTQ+ @es
comment: Long-form musical performances combining singing, orchestral music, and often ballet, typically set to a dramatic narrative or libretto and presented on a theater stage centered on LGBTQ+ characters or themes.
comment: Presentaciones musicales de larga duración que combinan canto, música orquestal y, a menudo, ballet, generalmente ambientadas con una narrativa o libreto dramático y presentadas en un escenario teatral, centradas en personajes o temas LGBTQ+. @es
broader: LGBTQ+ arts
narrower: Gay operas
narrower: Bisexual operas
narrower: Transgender operas
narrower: Asexual operas
narrower: Intersex operas
narrower: Lesbian operas
narrower: Queer operas
related: Two-Spirit operas
has top concept: Subcultures
issued: 2023-06-28
modified: 2025-02-23
type: Concept
in scheme: v3
change note: Version 4.1.0

Gay operas
preferred label: Periódicos gay @es
alternative label: Diarios gay @es
comment: Operas created by gay directors, depicting gay men, or that are regarded as important within gay culture.
comment: Publicaciones impresas o digitales serializadas sobre hombres gay o temas gay (y generalmente producidas por hombres gay u organizaciones gay) que contienen noticias, artículos, columnas, correspondencia y anuncios. @es
broader: LGBTQ+ operas
has top concept: Subcultures
issued: 2023-06-28
modified: 2025-02-23
type: Concept
in scheme: v3
change note: Version 4.1.0

Bisexual operas
preferred label: Boletines bisexuales @es
comment: Operas created by bisexual directors, depicting bisexual individuals, or that are regarded as important within bisexual culture.
comment: Publicaciones impresas o digitales serializadas creadas por o para personas bisexuales, a menudo con el propósito de compartir noticias e información relacionada con comunidades bisexuales y temas bisexuales. @es
broader: LGBTQ+ operas
has top concept: Subcultures
issued: 2023-06-28
modified: 2025-02-23
type: Concept
in scheme: v3
change note: Version 4.1.0

Transgender operas
preferred label: Óperas transgénero @es
comment: Operas created by transgender directors, depicting transgender individuals, or that are regarded as important within transgender culture.
comment: Óperas creadas por directores transgénero, que representan a personas transgénero o que se consideran importantes dentro de la cultura transgénero. @es
broader: LGBTQ+ operas
related: Two-Spirit operas
has top concept: Subcultures
issued: 2023-06-28
modified: 2025-02-23
type: Concept
in scheme: v3
change note: Version 4.1.0

Asexual operas
preferred label: Óperas asexuales @es
comment: Operas created by asexual directors, depicting asexual individuals, or that are regarded as important within asexual culture.
comment: Óperas creadas por directores asexuales, que representan a personas asexuales, o que se consideran importantes dentro de la cultura asexual. @es
broader: LGBTQ+ operas
has top concept: Subcultures
issued: 2023-06-28
modified: 2025-02-23
type: Concept
in scheme: v3
change note: Version 4.1.0

Intersex operas
preferred label: Óperas intersex @es
comment: Operas created by intersex directors, depicting intersex individuals, or that are regarded as important within intersex culture.
comment: Óperas creadas por directores intersex, que representan a personas intersex o que se consideran importantes dentro de la cultura intersex. @es
broader: LGBTQ+ operas
related: Two-Spirit operas
has top concept: Subcultures
issued: 2023-06-28
modified: 2025-02-23
type: Concept
in scheme: v3
change note: Version 4.1.0

Aboriginal Australian asexual people
preferred label: Personas asexuales aborígenes australianas @es
alternative label: Aboriginal asexual people
alternative label: Asexual Aboriginal Australian people
alternative label: Asexual Aboriginal Australians
alternative label: Asexuales aborígenes australianos @es
alternative label: Australianos asexuales aborígenes @es
alternative label: Asexuales aborígenes australianas @es
alternative label: Australianas asexuales aborígenes @es
comment: Asexual people who belong to one or more of the various Indigenous peoples of Australia; do not use to refer to the Indigenous people of the Torres Strait Islands, who are considered ethnically and culturally distinct. Only use to describe people who identify as Aboriginal Australian.
comment: Personas asexuales que pertenecen a uno o más de los diversos pueblos indígenas de Australia; no se utiliza para referirse a los pueblos indígenas de las Islas del Estrecho de Torres, que se consideran étnica y culturalmente distintos. Utilícese únicamente para describir a las personas que se autoidentifiquen como aborígenes australianos. @es
broader: Aboriginal Australian LGBTQ+ people
has top concept: LGBTQ+ people
issued: 2023-06-28
modified: 2025-02-23
type: Concept
in scheme: v3
change note: Version 4.1.0

Afro-Canadian asexual people
preferred label: Afrocanadienses asexuales @es
alternative label: Asexual Afro-Canadian people
alternative label: Asexual Afro-Canadians
alternative label: Afrocanadienses ace @es
alternative label: Personas ace afrocanadienses @es
alternative label: Personas afrocanadienses asexuales @es
comment: Asexual people of African descent born in Canada or asexual people born in African countries who live in or have a strong connection to Canada. Use for individuals who self-identify as Afro-Canadian.
comment: Personas asexuales de ascendencia africana nacidas en Canadá o personas asexuales nacidas en países africanos que viven en Canadá o tienen una conexión fuerte con Canadá. Utilícese para personas que se autoidentifiquen como afrocanadienses. @es
broader: Afro-Canadian LGBTQ+ people
broader: Black asexual people
has top concept: LGBTQ+ people
issued: 2023-06-29
modified: 2025-02-23
type: Concept
in scheme: v3
change note: Version 4.1.0

Afro-Caribbean asexual people
preferred label: Personas asexuales afrocaribeñas @es
alternative label: Asexual Afro-Caribbean people
alternative label: Asexual Afro-Caribbeans
alternative label: Personas afrocaribeñas asexuales @es
alternative label: Afrocaribeños asexuales @es
alternative label: Afrocaribeñas asexuales @es
comment: Asexual people of African descent born in the Caribbean or asexual people born in African countries who live in or have a strong connection to the Caribbean. Only use for individuals who self-identify as Afro-Caribbean.
comment: Personas asexuales de ascendencia africana nacidas en el Caribe o personas asexuales nacidas en países africanos que viven o tienen una conexión fuerte con el Caribe. Utilícese únicamente para personas que se identifiquen como afrocaribeñas. @es
broader: Afro-Caribbean LGBTQ+ people
broader: Black asexual people
has top concept: LGBTQ+ people
issued: 2023-06-29
modified: 2025-02-23
type: Concept
in scheme: v3
change note: Version 4.1.0

Asexual victims of hate crimes
preferred label: Víctimas asexuales de crímenes de odio @es
comment: Asexual people who have experienced hate crimes and may or may not have survived; follow the individual's preference for "victims" or "survivors" whenever possible.
comment: Personas asexuales que han sufrido crímenes de odio y pueden haber sobrevivido o no; siga la preferencia de la persona sobre el uso de "víctimas" o "sobrevivientes" siempre que sea posible. @es
broader: LGBTQ+ victims of hate crimes
has top concept: LGBTQ+ people
issued: 2023-06-29
modified: 2025-02-23
type: Concept
in scheme: v3
change note: Version 4.1.0

Afro-European asexual people
preferred label: Personas asexuales afroeuropeas @es
alternative label: Asexual Afro-European people
alternative label: Asexual Afro-Europeans
alternative label: Personas afroeuropeas asexuales @es
alternative label: Afroeuropeos asexuales @es
alternative label: Afroeuropeas asexuales @es
comment: Asexual people of African descent born in European countries or asexual people born in African countries who live in or have a strong connection to Europe. Only use for individuals who self-identify as Afro-European.
comment: Personas asexuales de ascendencia africana nacidas en países europeos o personas asexuales nacidas en países africanos que viven o tienen una conexión fuerte con Europa. Utilícese únicamente para personas que se identifiquen como afroeuropeas. @es
broader: Afro-European LGBTQ+ people
broader: Black asexual people
has top concept: LGBTQ+ people
issued: 2023-06-29
modified: 2025-02-23
type: Concept
in scheme: v3
change note: Version 4.1.0

Latino/a/x asexual people
preferred label: Personas asexuales Latinx @es
alternative label: Asexual Latinas
alternative label: Asexual Latine people
alternative label: Asexual Latinos
alternative label: Asexual Latinx people
alternative label: Latina asexual people
alternative label: Latine asexual people
alternative label: Latino asexual people
alternative label: Latinx asexual people
comment: Latin American people who are asexual; only use to describe individuals who self-identify as Latino, Latina, or Latinx. Do not conflate with Chicano/a/x or Hispanic.
comment: Personas latinoamericanas que son asexuales; utilícese únicamente para describir a personas que se autoidentifican como latinos, latinas o latinxs. No debe confundirse con chicano/a/x o hispano/a/x. @es
broader: Latino/a/x LGBTQ+ people
narrower: Afro-Latin American asexual people
has top concept: LGBTQ+ people
issued: 2023-06-29
modified: 2025-02-23
type: Concept
in scheme: v3
change note: Version 4.1.0

Afro-Latin American asexual people
preferred label: Personas asexuales afrolatinoamericanas @es
alternative label: Asexual Afro-Latin Americans
alternative label: Personas afrolatinoamericanas asexuales @es
alternative label: Afrolatinoamericanos asexuales @es
alternative label: Afrolatinoamericanas asexuales @es
comment: Asexual people of African descent born in Latin American countries or asexual people born in African countries who live in or have a strong connection to Latin America. Only use for individuals who self-identify as Afro-Latin American.
comment: Personas asexuales afrodescendientes nacidas en países latinoamericanos o personas asexuales nacidas en países africanos que viven o tienen una fuerte conexión con América Latina. Utilícese únicamente para personas que se identifiquen como afrolatinoamericanas. @es
broader: Afro-Latin American LGBTQ+ people
broader: Black asexual people
broader: Latino/a/x asexual people
has top concept: LGBTQ+ people
issued: 2023-06-29
modified: 2025-02-23
type: Concept
in scheme: v3
change note: Version 4.1.0

Anti-asexual discrimination
preferred label: Discriminación anti-asexual @es
comment: The unjust or prejudicial treatment of asexual people due to their sexual identity; may include the denial of legal rights, employment, and housing.
comment: El trato injusto o perjudicial hacia personas asexuales por su identidad sexual; puede incluir la negación de derechos legales, empleo y vivienda. @es
broader: LGBTQ+ discrimination
related: Intolerance towards LGBTQ+ people
has top concept: LGBTQ+ discrimination
issued: 2023-06-29
modified: 2025-02-23
type: Concept
in scheme: v3
change note: Version 4.1.0

Anti-asexual violence
preferred label: Violencia anti-asexual @es
comment: Behavior involving physical force intended to harm or kill asexual people on the basis of their identity.
comment: Comportamiento que involucra fuerza física destinada a hacer daño o a matar a personas asexuales por su identidad. @es
broader: Anti-LGBTQ+ violence
related: Hate crimes
has top concept: Anti-LGBTQ+ violence
issued: 2023-06-29
modified: 2025-02-23
type: Concept
in scheme: v3
change note: Version 4.1.0

Asian asexual people
preferred label: Personas asexuales asiáticas @es
alternative label: Asexual Asian people
alternative label: Asexual Asians
alternative label: Personas asiáticas asexuales @es
alternative label: Asiáticos asexuales @es
alternative label: Asiáticas asexuales @es
comment: Asexual individuals of Asian heritage or descent, living in Asia or part of the Asian diaspora. Only use for people who self-identify as Asian.
comment: Personas asexuales de herencia o ascendencia asiática, que viven en Asia o forman parte de la diáspora asiática. Utilícese únicamente para personas que se autoidentifiquen como asiáticas. @es
broader: Asian LGBTQ+ people
related: Asian American asexual people
has top concept: LGBTQ+ people
issued: 2023-06-29
modified: 2025-02-23
type: Concept
in scheme: v3
change note: Version 4.1.0

Asian American asexual people
preferred label: Personas asexuales asiático-americanas @es
alternative label: Asexual Asian American people
alternative label: Asexual Asian Americans
alternative label: Personas asiático-americanas asexuales @es
alternative label: Asiático-americanos asexuales @es
alternative label: Asiático-americanas asexuales @es
comment: Asexual people of Asian heritage or descent born in the United States or born in Asian countries who live in or have a strong connection to the United States. Only use for individuals who self-identify as Asian American.
comment: Personas asexuales de herencia o ascendencia asiática nacidas en los Estados Unidos o nacidas en países asiáticos que viven en o tienen una conexión fuerte con los Estados Unidos. Utilícese únicamente para personas que seautoidentificancomo asiático-americanas @es
broader: Asian American LGBTQ+ people
related: Asian asexual people
has top concept: LGBTQ+ people
issued: 2023-06-29
modified: 2025-02-23
type: Concept
in scheme: v3
change note: Version 4.1.0

Multiracial asexual people
preferred label: Personas asexuales multirraciales @es
alternative label: Asexual multi-racial people
alternative label: Asexual multiracial people
alternative label: Multi-racial asexual people
alternative label: Personas multirraciales asexuales @es
comment: Asexual people who belong to two or more racial groups.
comment: Personas asexuales que pertenecen a dos o más grupos raciales. Utilícese únicamente para personas que se autoidentifiquen como multirraciales. @es
broader: Multiracial LGBTQ+ people
has top concept: LGBTQ+ people
issued: 2023-06-29
modified: 2025-02-23
type: Concept
in scheme: v3
change note: Version 4.1.0

Biracial asexual people
preferred label: Personas asexuales birraciales @es
alternative label: Asexual bi-racial people
alternative label: Asexual biracial people
alternative label: Bi-racial asexual people
alternative label: Personas birraciales asexuales @es
alternative label: Asexuales birraciales @es
comment: Asexual people who belong to two or more racial groups. Only use to describe people who self-identify as biracial.
comment: Personas asexuales que pertenecen a dos o más grupos raciales. Utilícese únicamente para personas que se autoidentifiquen como birraciales. @es
broader: Biracial LGBTQ+ people
has top concept: LGBTQ+ people
issued: 2023-06-29
modified: 2025-02-23
type: Concept
in scheme: v3
change note: Version 4.1.0

Closeted asexual people
preferred label: Personas asexuales en el clóset @es
comment: Asexual people who do not identify as such to others.
comment: Personas asexuales que no se autoidentifican como tales ante los demás. @es
broader: Asexual people
broader: Closeted LGBTQ+ people
related: Closeted bisexual people
related: Closeted gay men
related: Closeted lesbians
related: Coming out
related: Outing (LGBTQ+ culture)
related: Secrecy
related: Closeted transgender people
related: Closeted queer people
related: Closeted intersex people
has top concept: Sexual minorities
issued: 2023-06-29
modified: 2025-02-23
type: Concept
in scheme: v3
change note: Version 4.1.0

Daughters of asexual people
preferred label: Hijas de personas asexuales @es
comment: Daughters who have one or more asexual parent.
comment: Hijas que tienen uno o más padres asexuales. @es
broader: Daughters of LGBTQ+ people
has top concept: Family members
issued: 2023-06-29
modified: 2025-02-23
type: Concept
in scheme: v3
change note: Version 4.1.0

Fathers of asexual people
preferred label: Padres de personas asexuales @es
alternative label: Papás de personas asexuales @es
comment: People who assume the role of father to asexual people. Only use to describe individuals who identify as fathers.
comment: Personas que asumen el rol de padre de personas asexuales. Utilícese únicamente para describir a personas que se autoidentifiquen como padres. @es
broader: Fathers of LGBTQ+ people
has top concept: Family members
issued: 2023-06-29
modified: 2025-02-23
type: Concept
in scheme: v3
change note: Version 4.1.0

Jewish asexual people
preferred label: Personas asexuales judías @es
alternative label: Asexual Jews
alternative label: Judíos asexuales @es
comment: Asexual people who are Jewish.
comment: Personas asexuales que son judías. @es
broader: Jewish LGBTQ+ people
has top concept: LGBTQ+ people
issued: 2023-06-29
modified: 2025-02-23
type: Concept
in scheme: v3
change note: Version 4.1.0

Mothers of asexual people
preferred label: Madres de personas asexuals @es
alternative label: Mamás de personas asexuales @es
comment: A person who assumes the role of mother to an asexual person; use only for individuals who self-identify as mothers.
comment: Una persona que asume el rol de madre de una persona asexual; utilícese únicamente para personas que se autoidentifiquen como madres. @es
broader: Mothers of LGBTQ+ people
has top concept: Family members
issued: 2023-06-29
modified: 2025-02-23
type: Concept
in scheme: v3
change note: Version 4.1.0

Parents of asexual people
preferred label: Madres y padres de personas asexuales @es
alternative label: Asexual people's parents
alternative label: Padres de personas asexuales @es
alternative label: Madres de personas asexuales @es
comment: People who act as parents to one or more asexual person. For parents who are themselves asexual, use the term "Asexual parents."
comment: Personas que actúan como padres de una o más personas asexuales. Para padres que son asexuales, utilice el término "madres y padres asexuales". @es
broader: Parents of LGBTQ+ people
has top concept: Family members
issued: 2023-06-29
modified: 2025-02-23
type: Concept
in scheme: v3
change note: Version 4.1.0

Partners of asexual people
preferred label: Parejas de personas asexuales @es
comment: People whose sexual, romantic, or play partner is asexual.
comment: Personas cuya pareja sexual, romántica o de juego es asexual. @es
broader: Partners of LGBTQ+ people
has top concept: Partners
issued: 2023-06-29
modified: 2025-02-23
type: Concept
in scheme: v3
change note: Version 4.1.0

Persecution of asexual people
preferred label: Persecución de personas asexuales @es
comment: Systematic mistreatment of asexual people on the basis of their sexual identity.
comment: Maltrato sistemático a personas asexuales por su identidad sexual. @es
broader: LGBTQ+ persecutions
related: Asexual people
has top concept: LGBTQ+ persecutions
issued: 2023-06-29
modified: 2025-02-23
type: Concept
in scheme: v3
change note: Version 4.1.0

Romani asexual people
preferred label: Personas asexuales romaníes @es
alternative label: Asexual Roma
alternative label: Asexual Romanis
alternative label: Asexual Romany
alternative label: Roma asexual people
alternative label: Romany asexual people
alternative label: Personas romaníes asexuales @es
comment: Asexual people who are Romani, or part of the traditionally nomadic Indo-European people.
comment: Personas asexuales que son romaníes o parte del pueblo indoeuropeo tradicionalmente nómada. @es
broader: Romani LGBTQ+ people
has top concept: LGBTQ+ people
issued: 2023-06-29
modified: 2026-02-23
type: Concept
in scheme: v3
change note: Version 4.1.0

Sons of asexual people
preferred label: Hijos de personas asexuales @es
comment: Sons who have one or more asexual parent. For sons who are themselves asexual, use the term "Asexual sons."
comment: Hijos que tienen uno o más padres asexuales. Para los hijos que son asexuales, utilice el término "hijos asexuales". @es
broader: Children of asexual people
broader: Sons of LGBTQ+ people
has top concept: Family members
issued: 2023-06-29
modified: 2025-02-23
type: Concept
in scheme: v3
change note: Version 4.1.0

White asexual people
preferred label: Personas asexuales blancas @es
alternative label: Asexual Caucasian people
alternative label: Asexual white people
alternative label: Personas caucásicas asexuales @es
alternative label: Personas blancas asexuales @es
comment: Asexual people who are white.
comment: Personas asexuales que son blancas. @es
broader: White LGBTQ+ people
has top concept: White LGBTQ+ people
issued: 2023-06-29
modified: 2025-02-23
type: Concept
in scheme: v3
change note: Version 4.1.0

Intersex mothers
preferred label: Madres intersex @es
comment: Intersex people who are mothers. Only use to describe individuals who identify as mothers.
comment: Personas intersex que son madres. Utilícese únicamente para describir a personas que se autoidentifiquen como madres. @es
broader: Mothers
broader: Intersex parents
broader: LGBTQ+ mothers
has top concept: Family members
issued: 2023-06-30
modified: 2025-02-23
type: Concept
in scheme: v3
change note: Version 4.1.0

Intersex museums
preferred label: Museos intersex @es
comment: Institutions dedicated to the storage, exhibition, conservation, and preservation of materials relating to intersex people and intersex history.
comment: Instituciones dedicadas al almacenamiento, la exhibición, la conservación y la preservación de materiales relacionados con las personas intersex y la historia intersex. @es
broader: LGBTQ+ museums
has top concept: LGBTQ+ cultural heritage institutions
issued: 2023-06-30
modified: 2025-02-23
type: Concept
in scheme: v3
change note: Version 4.1.0

Intersex newsletters
preferred label: Boletines intersex @es
comment: Serialized print or digital periodicals created by or for intersex people, often with the purpose of sharing news and information related to intersex communities and intersex issues.
comment: Publicaciones periódicas impresas o digitales serializadas creadas por o para personas intersex, a menudo con el propósito de compartir noticias e información relacionada con comunidades intersex y cuestiones intersex. @es
broader: LGBTQ+ newsletters
has top concept: LGBTQ+ press
issued: 2023-06-30
modified: 2025-02-23
type: Concept
in scheme: v3
change note: Version 4.1.0

Intersex newspapers
preferred label: Periódicos intersex @es
alternative label: Diarios intersex @es
comment: Serialized print or digital publications about intersex issues (and typically produced by intersex people or intersex organizations) that contain news, articles, columns, correspondence, and advertisements.
comment: Publicaciones impresas o digitales serializadas sobre personas intersex o cuestiones intersex (y generalmente producidas por personas intersex u organizaciones intersex) que contienen noticias, artículos, columnas, correspondencia y anuncios. @es
broader: LGBTQ+ newspapers
has top concept: LGBTQ+ press
issued: 2023-06-30
modified: 2025-02-23
type: Concept
in scheme: v3
change note: Version 4.1.0

Intersex partners
preferred label: Parejas intersex @es
comment: Intersex people who are the romantic, sexual, or play partners of another person or people.
comment: Personas intersex que son parejas románticas, sexuales o de juego de otra persona o personas. @es
broader: LGBTQ+ partners
has top concept: LGBTQ+ families
issued: 2023-06-30
modified: 2025-02-23
type: Concept
in scheme: v3
change note: Version 4.1.0

Intersex people in the military
preferred label: Personas intersex en el ejército @es
alternative label: Personas intersex en las fuerzas armadas @es
comment: Intersex people serving in state and national armed forces.
comment: Personas intersex que sirven en las fuerzas armadas estatales y nacionales. @es
broader: LGBTQ+ people in the military
has top concept: Legal status
issued: 2023-06-30
modified: 2025-02-23
type: Concept
in scheme: v3
change note: Version 4.1.0

Indigenous asexual people
preferred label: Personas asexuales indígenas @es
alternative label: Asexual Indigenous people
alternative label: Personas indígenas asexuales @es
comment: Asexual people who are part of an Indigenous people, or culturally distinct ethnic group whose members are directly descended from the earliest known inhabitants of a particular region and, to some extent, maintain the language and culture of those people. Only use to describe people who identify as Indigenous; use more specific terms whenever possible.
comment: Personas asexuales que forman parte de un pueblo indígena o grupo étnico culturalmente distinto cuyos miembros descienden directamente de los primeros habitantes conocidos de una región en particular y, hasta cierto punto, mantienen el idioma y la cultura de ese pueblo. Utilícese únicamente para describir a personas que se autoidentifiquen como indígenas; utilícese términos más específicos siempre que sea posible. @es
broader: Indigenous LGBTQ+ people
narrower: Inuit asexual people
narrower: Kānaka Maoli asexual people
narrower: Native American asexual people
narrower: Pacific Islander American asexual people
narrower: Papuan asexual people
has top concept: LGBTQ+ people
issued: 2023-06-30
modified: 2025-02-23
type: Concept
in scheme: v3
change note: Version 4.1.0

Inuit asexual people
preferred label: Personas asexuales inuit @es
comment: Asexual people who are Inuit, or part of several Indigenous peoples inhabiting the Inuit homeland in the Arctic and subarctic regions of Greenland, Canada, and Alaska. Only use for people who identify as Inuit.
comment: Personas asexuales que son inuit o que son parte de varios pueblos indígenas que habitan los territorios ancestrales inuit en las regiones árticas o subárticas de Groenlandia, Canadá y Alaska. Utilícese únicamente para personas que se identifiquen como inuit. @es
broader: Inuit LGBTQ+ people
broader: Indigenous asexual people
has top concept: LGBTQ+ people
issued: 2023-06-30
modified: 2025-02-23
type: Concept
in scheme: v3
change note: Version 4.1.0

Kānaka Maoli asexual people
preferred label: Personas asexuales kānaka maoli @es
alternative label: Asexual Indigenous Hawaiians
alternative label: Asexual Kānaka Maoli
alternative label: Asexual Kānaka ʻŌiwi
alternative label: Asexual Native Hawaiians
alternative label: Indigenous Hawaiian asexual people
alternative label: Native Hawaiian asexual people
comment: Asexual people who are part of the Indigenous people of Mokupuni o Hawai‘i, or the Hawaiian Islands; only use to refer to people who identify as Kanaka Maoli.
comment: Personas asexuales que pertenecen al pueblo indígena mokupuni o hawai‘i, o a las islas hawaianas. Utilícese únicamente para describir a las personas que se identifiquen como kānaka maoli. @es
broader: Kānaka Maoli LGBTQ+ people
broader: Indigenous asexual people
has top concept: LGBTQ+ people
issued: 2023-06-30
modified: 2025-02-23
type: Concept
in scheme: v3
change note: Version 4.1.0

Native American asexual people
preferred label: Personas asexuales nativoamericanas @es
alternative label: American Indian asexual people
alternative label: Asexual American Indians
alternative label: Asexual Native Americans
alternative label: Personas nativoamericanas asexuales @es
comment: People who are part of the Native peoples of the continental United States and Canada (excluding Inuit people) and self-identity as asexual. Use more specific terms when available.
comment: Personas asexuales que son nativoamericanas o parte de los pueblos indígenas de Norteamérica; utilícese únicamente para personas que se autoidentifiquen como nativoamericanas y asexuales. @es
broader: Native American LGBTQ+ people
broader: Indigenous asexual people
has top concept: LGBTQ+ people
issued: 2023-06-30
modified: 2025-02-23
type: Concept
in scheme: v3
change note: Version 4.1.0

Pacific Islander American asexual people
preferred label: Personas asexuales del Pacífico estadounidenses @es
alternative label: Pacific Islander asexual people
alternative label: Personas del Pacífico estadounidenses asexuales @es
comment: Asexual people who identify as both Pacific Islanders (or of Pacific Islander ancestry) and American.
comment: Personas asexuales que se identifican como isleñas del Pacífico (o de ascendencia isleña del Pacífico) y estadounidenses. @es
broader: Pacific Islander American LGBTQ+ people
broader: Indigenous asexual people
has top concept: LGBTQ+ people
issued: 2023-06-30
modified: 2025-02-23
type: Concept
in scheme: v3
change note: Version 4.1.0

Papuan asexual people
preferred label: Personas asexuales papúes @es
alternative label: Asexual Papuan people
alternative label: Asexual Papuans
alternative label: Personas papúes asexuales @es
comment: Asexual people who are Papuan, or part of the Indigenous peoples of new Guinea; only use for people who identify as Papuan.
comment: Personas asexuales que son papúes o parte de los pueblos indígenas de Nueva Guinea. Utilícese únicamente para personas que se autoidentifiquen como papúes. @es
broader: Papuan LGBTQ+ people
broader: Indigenous asexual people
has top concept: LGBTQ+ people
issued: 2023-06-30
modified: 2025-02-23
type: Concept
in scheme: v3
change note: Version 4.1.0

Intersex people with chronic illnesses
preferred label: Personas intersex con enfermedades crónicas @es
alternative label: Chronically ill intersex people
alternative label: Personas con enfermedades crónicas intersex @es
alternative label: Enfermos crónicos intersex @es
comment: Intersex people who have long-term health conditions that require continued medical attention and/or significantly impact or limit daily life; some but not all people with chronic illnesses consider themselves disabled.
comment: Personas intersex que tienen condiciones de salud a largo plazo que requieren atención médica continua y/o impactan o limitan significativamente la vida diaria; algunas, pero no todas, las personas con enfermedades crónicas se consideran discapacitadas. @es
broader: LGBTQ+ people with chronic illnesses
related: Intersex disabled people
has top concept: LGBTQ+ people
issued: 2023-06-30
modified: 2025-02-23
type: Concept
in scheme: v3
change note: Version 4.1.0

Intersex disabled people
preferred label: Personas intersex discapacitadas @es
alternative label: Personas discapacitadas intersex @es
alternative label: Personas intersex con discapacidades @es
comment: Intersex people who are disabled.
comment: Personas intersex con discapacidad. @es
broader: LGBTQ+ disabled people
narrower: Intersex blind people
narrower: Intersex wheelchair users
related: Intersex people with chronic illnesses
has top concept: LGBTQ+ people
issued: 2023-06-30
modified: 2025-02-23
type: Concept
in scheme: v3
change note: Version 4.1.0

Intersex Deaf people
preferred label: Personas intersex sordas @es
alternative label: Deaf intersex people
alternative label: Personas sordas intersex @es
comment: Intersex people with significant or total hearing loss. Some but not all Deaf people prefer to capitalize Deaf in recognition of the cultural and linguistic identity they share with other Deaf people.
comment: Personas intersex con pérdida auditiva significativa o total. Algunas personas sordas, pero no todas, prefieren escribir “Sorda/o” con mayúscula en reconocimiento de la identidad cultural y lingüística que comparten con otras personas sordas. @es
broader: LGBTQ+ deaf people
has top concept: LGBTQ+ deaf people
issued: 2023-06-30
modified: 2025-02-23
type: Concept
in scheme: v3
change note: Version 4.1.0

Intersex community
preferred label: Comunidad intersex @es
comment: Groups of people who share the experience of being intersex.
comment: Grupos de personas que comparten la experiencia de ser intersex. @es
broader: LGBTQ+ communities
has top concept: LGBTQ+ communities
issued: 2023-06-30
modified: 2025-02-23
type: Concept
in scheme: v3
change note: Version 4.1.0

Intersex blind people
preferred label: Personas intersexuales ciegas @es
alternative label: Blind intersex people
alternative label: Personas ciegas intersex @es
alternative label: Personas intersex ciegas @es
comment: Intersex people with significant or total loss of vision.
comment: Personas intersex con pérdida significativa o total de la visión. @es
broader: LGBTQ+ blind people
broader: Intersex disabled people
has top concept: LGBTQ+ people
issued: 2023-06-30
modified: 2025-02-23
type: Concept
in scheme: v3
change note: Version 4.1.0

Intersex political activists
preferred label: Activistas políticos intersex @es
comment: Intersex people working to bring about political or social change through public organizing.
comment: Personas intersex que trabajan para lograr cambios políticos o sociales a través de la organización pública. @es
broader: LGBTQ+ political activists
broader: Intersex activism
has top concept: LGBTQ+ people
issued: 2023-06-30
modified: 2025-02-23
type: Concept
in scheme: v3
change note: Version 4.1.0

Intersex studies
preferred label: Estudios intersex @es
comment: Academic field of research and study about intersex people, intersex identity, and intersex communities.
comment: Campo académico de investigación y estudio sobre personas intersex, la identidad intersex y comunidades intersex. @es
related: Gender studies
related: Queer studies
issued: 2023-06-30
modified: 2026-02-24
type: Concept
in scheme: v3
change note: Version 4.1.0

African American intersex people
preferred label: Personas intersexuales afroamericanas @es
alternative label: Intersex African American people
alternative label: Intersex African Americans
alternative label: Afroamericanos intersex @es
alternative label: Intersex afroamericanos @es
alternative label: Afroamericanas intersex @es
alternative label: Intersex afroamericanas @es
alternative label: Personas intersex afroamericanas @es
comment: Intersex people of African descent born in the United States or intersex people born in African countries who live in or have a strong connection to the United States. Use for individuals who self-identity as African American. Follow the individual’s preference for African American or Black whenever possible.
comment: Personas intersexuales de ascendencia africana nacidas en los Estados Unidos o personas intersex nacidas en países africanos que viven o tienen una conexión fuerte con los Estados Unidos. Utilícese para personas que se autoidentifiquen como afroamericanas. @es
broader: African American LGBTQ+ people
has top concept: LGBTQ+ people
issued: 2023-06-30
modified: 2025-02-23
type: Concept
in scheme: v3
change note: Version 4.1.0

Intersex press
preferred label: Prensa intersex @es
comment: Newspapers, magazines, or other publishing outlets aimed at intersex audiences and/or operated by intersex people.
comment: Periódicos, revistas u otros medios editoriales dirigidos a audiencias intersex y/o operados por personas intersex. @es
broader: LGBTQ+ press
narrower: Intersex zines
has top concept: LGBTQ+ press
issued: 2023-09-29
modified: 2025-02-23
type: Concept
in scheme: v3
change note: Version 4.1.0

Intersex publishers
preferred label: Editoriales intersex @es
comment: Companies and organizations that publish materials for intersex communities or addressing intersex issues.
comment: Empresas y organizaciones que publican materiales para comunidades intersex o que abordan asuntos intersex. @es
broader: LGBTQ+ publishers
has top concept: LGBTQ+ publishers
issued: 2023-09-29
modified: 2025-02-23
type: Concept
in scheme: v3
change note: Version 4.1.0

Intersex radio
preferred label: Radio intersex @es
comment: Auditory content broadcast on the radio (analog or digital) about intersex people and intersex issues.
comment: Contenido auditivo difundido por radio (analógica o digital) sobre personas intersex y asuntos intersex. @es
broader: LGBTQ+ radio
has top concept: LGBTQ+ radio
issued: 2023-09-29
modified: 2025-02-23
type: Concept
in scheme: v3
change note: Version 4.1.0

Intersex relationships
preferred label: Relaciones intersex @es
comment: Ongoing connections (romantic, sexual, or platonic) between two or more intersex people.
comment: Conexiones continuas (románticas, sexuales o platónicas) entre dos o más personas intersex. @es
broader: Relationship satisfaction
narrower: Intersex couples
has top concept: Relationship satisfaction
issued: 2023-09-29
modified: 2025-02-23
type: Concept
in scheme: v3
change note: Version 4.1.0

Intersex slang
preferred label: Jerga intersex @es
alternative label: Argot intersex @es
comment: Colloquial or informal language related to intersex identity or used by intersex people.
comment: Lenguaje coloquial o informal relacionado con la identidad intersex o utilizado por personas intersex. @es
broader: LGBTQ+ slang
has top concept: LGBTQ+ slang
issued: 2023-09-29
modified: 2025-02-23
type: Concept
in scheme: v3
change note: Version 4.1.0

Intersex sons
preferred label: Hijos intersex @es
comment: Intersex people who are sons. Only use to describe individuals who identify as sons.
comment: Personas intersex que son hijos. Utilícese únicamente para describir a personas que se autoidentifiquen como hijos. @es
broader: LGBTQ+ sons
has top concept: LGBTQ+ people
issued: 2023-09-29
modified: 2025-02-23
type: Concept
in scheme: v3
change note: Version 4.1.0

Intersex survivors of hate crimes
preferred label: Sobrevivientes intersex de crímenes de odio @es
comment: Intersex people who have experienced and survived hate crimes; follow the individual's preference for "victims" or "survivors" whenever possible.
comment: Personas intersex que han sufrido y sobrevivido crímenes de odio; siga la preferencia de la persona sobre el uso de "víctimas" o "sobrevivientes" siempre que sea posible. @es
broader: LGBTQ+ survivors of hate crimes
has top concept: LGBTQ+ people
issued: 2023-09-29
modified: 2025-02-23
type: Concept
in scheme: v3
change note: Version 4.1.0

Intersex survivors of rape
preferred label: Sobrevivientes intersex de violación @es
comment: Intersex people who have experienced and survived rape; follow the individual's preference for "victims" or "survivors" whenever possible.
comment: Personas intersex que han sufrido y sobrevivido una violación; siga la preferencia de la persona sobre el uso de "víctimas" o "sobrevivientes" siempre que sea posible. @es
broader: LGBTQ+ survivors of rape
has top concept: LGBTQ+ people
issued: 2023-09-29
modified: 2025-02-23
type: Concept
in scheme: v3
change note: Version 4.1.0

Intersex survivors of sexual abuse
preferred label: Sobrevivientes intersex de abuso sexual @es
comment: Intersex people who have experienced and survived sexual abuse; follow the individual's preference for "victims" or "survivors" whenever possible.
comment: Personas intersex que han sufrido y sobrevivido abusos sexuales; siga la preferencia de la persona sobre el uso de "víctimas" o "sobrevivientes" siempre que sea posible. @es
broader: LGBTQ+ survivors of sexual abuse
has top concept: LGBTQ+ people
issued: 2023-09-29
modified: 2025-02-23
type: Concept
in scheme: v3
change note: Version 4.1.0

Intersex survivors of war
preferred label: Sobrevivientes intersex de guerra @es
comment: Intersex people who have experienced and survived war; follow the individual's preference for "victims" or "survivors" whenever possible.
comment: Personas intersex que han sufrido y sobrevivido la guerra; siga la preferencia de la persona sobre el uso de "víctimas" o "sobrevivientes" siempre que sea posible. @es
broader: LGBTQ+ survivors of war
has top concept: LGBTQ+ people
issued: 2023-09-29
modified: 2025-02-23
type: Concept
in scheme: v3
change note: Version 4.1.0

Intersex television
preferred label: Televisión intersex @es
comment: Television shows featuring intersex characters or themes.
comment: Programas de televisión que presentan personajes o temas intersex. @es
broader: LGBTQ+ television
has top concept: LGBTQ+ television
issued: 2023-09-29
modified: 2025-02-23
type: Concept
in scheme: v3
change note: Version 4.1.0

Intersex theater
preferred label: Teatro intersex @es
alternative label: Intersex theatre
comment: Works in the performance arts that focus on intersex characters or themes.
comment: Trabajos en las artes escénicas que se centran en personajes o temas intersex. @es
broader: LGBTQ+ theater
has top concept: LGBTQ+ theater
issued: 2023-09-29
modified: 2025-02-23
type: Concept
in scheme: v3
change note: Version 4.1.0

Intersex victims of hate crimes
preferred label: Víctimas intersex de crímenes de odio @es
comment: Intersex people who have experienced hate crimes and may or may not have survived; follow the individual's preference for "victims" or "survivors" whenever possible.
comment: Personas intersex que han sufrido crímenes de odio y que pueden haber sobrevivido o no; siga la preferencia de la persona sobre el uso de "víctimas" o "sobrevivientes" siempre que sea posible. @es
broader: LGBTQ+ victims of hate crimes
has top concept: LGBTQ+ people
issued: 2023-09-29
modified: 2025-02-23
type: Concept
in scheme: v3
change note: Version 4.1.0

Intersex victims of sexual abuse
preferred label: Víctimas intersex de abuso sexual @es
comment: Intersex people who have experienced sexual abuse and may or may not have survived; follow the individual's preference for "victims" or "survivors" whenever possible.
comment: Personas intersex que han sufrido abuso sexual y que pueden haber sobrevivido o no; siga la preferencia de la persona sobre el uso de "víctimas" o "sobrevivientes" siempre que sea posible. @es
broader: LGBTQ+ victims of sexual abuse
has top concept: LGBTQ+ people
issued: 2023-09-29
modified: 2025-02-23
type: Concept
in scheme: v3
change note: Version 4.1.0

Intersex victims of war
preferred label: Víctimas intersex de guerra @es
comment: Intersex people who have experienced war and may or may not have survived; follow the individual's preference for "victims" or "survivors" whenever possible.
comment: Personas intersex que han sufrido la guerra y que pueden haber sobrevivido o no; siga la preferencia de la persona sobre el uso de "víctimas" o "sobrevivientes" siempre que sea posible. @es
broader: LGBTQ+ victims of war
has top concept: LGBTQ+ people
issued: 2023-09-29
modified: 2025-02-23
type: Concept
in scheme: v3
change note: Version 4.1.0

Intersex victims' rights
preferred label: Derechos de víctimas intersex @es
comment: Intersex people’s legal rights to be informed, present, and heard within the criminal justice system after having been harmed or injured as the result of of a crime, accident, or other event.
comment: Los derechos legales de las personas intersex a estar informadas, estar presentes y ser escuchadas dentro del sistema de justicia penal después de haber sido perjudicadas o lesionadas como resultado de un delito, un accidente u otro evento. @es
broader: LGBTQ+ victims' rights
has top concept: Law
issued: 2023-09-29
modified: 2025-02-23
type: Concept
in scheme: v3
change note: Version 4.1.0

Intersex wheelchair users
preferred label: Usuarios intersex de sillas de ruedas @es
comment: Intersex people who use wheelchairs.
comment: Personas intersex que utilizan sillas de ruedas. @es
broader: LGBTQ+ wheelchair users
broader: Intersex disabled people
has top concept: LGBTQ+ people
issued: 2023-09-29
modified: 2025-02-23
type: Concept
in scheme: v3
change note: Version 4.1.0

Intersex youth literature
preferred label: Literatura juvenil intersex @es
alternative label: Intersex YA
alternative label: Intersex young adult literature
comment: Written literary works for an audience of readers from 12-18 years of age, also known as young adult literature or YA; use in reference to youth literature focusing on intersex characters or themes.
comment: Obras literarias escritas para una audiencia de lectores de 12 a 18 años de edad, también conocidas como literatura para adultos jóvenes o YA (por sus siglas en inglés); utilícese en referencia a la literatura juvenil que se centra en personajes o temas intersex. @es
broader: LGBTQ+ youth literature
broader: Intersex literature
has top concept: Subcultures
issued: 2023-09-29
modified: 2025-02-23
type: Concept
in scheme: v3
change note: Version 4.1.0

Intersex-focused businesses
preferred label: Negocios orientados a personas intersex @es
comment: Businesses focusing on intersex clientele and products related to intersex communities.
comment: Empresas enfocadas en clientela intersex y productos relacionados con comunidades intersex. @es
broader: LGBTQ+-focused businesses
has top concept: LGBTQ+-focused businesses
issued: 2023-09-29
modified: 2025-02-23
type: Concept
in scheme: v3
change note: Version 4.1.0

Intersex-owned businesses
preferred label: Negocios propiedad de personas intersex @es
comment: Businesses owned by intersex people.
comment: Empresas pertenecientes a personas intersex. @es
broader: LGBTQ+-owned businesses
has top concept: LGBTQ+-owned businesses
issued: 2023-09-29
modified: 2025-02-23
type: Concept
in scheme: v3
change note: Version 4.1.0

Afro-Canadian intersex people
preferred label: Personas intersexuales afrocanadienses @es
alternative label: Intersex Afro-Canadian people
alternative label: Intersex Afro-Canadians
alternative label: Afrocanadienses intersex @es
alternative label: Intersex afrocanadienses @es
alternative label: Personas intersex afrocanadienses @es
comment: Intersex people of African descent born in Canada or intersex people born in African countries who live in or have a strong connection to Canada. Use for individuals who self-identify as Afro-Canadian.
comment: Personas intersexuales de ascendencia africana nacidas en Canadá o personas intersex nacidas en países africanos que viven o tienen una conexión fuerte con Canadá. Utilícese para personas que se autoidentifican como afrocanadienses. @es
broader: Afro-Canadian LGBTQ+ people
broader: Black intersex people
has top concept: LGBTQ+ people
issued: 2023-09-29
modified: 2025-02-23
type: Concept
in scheme: v3
change note: Version 4.1.0

Afro-Caribbean intersex people
preferred label: Personas intersexuales afrocaribeñas @es
alternative label: Personas intersex afrocaribeñas @es
comment: Intersex people of African descent born in the Caribbean or intersex people born in African countries who live in or have a strong connection to the Caribbean. Only use for individuals who self-identify as Afro-Caribbean.
comment: Personas intersexuales de ascendencia africana nacidas en el Caribe o personas intersex nacidas en países africanos que viven o tienen una conexión fuerte con el Caribe. Utilícese únicamente para personas que se identifiquen como afrocaribeñas. @es
broader: Afro-Caribbean LGBTQ+ people
broader: Black intersex people
has top concept: LGBTQ+ people
issued: 2023-09-29
modified: 2025-02-23
type: Concept
in scheme: v3
change note: Version 4.1.0

Afro-European intersex people
preferred label: Personas intersexuales afroeuropeas @es
alternative label: Intersex Afro-Europeans
alternative label: Afroeuropeos intersex @es
alternative label: Afroeuropeas intersex @es
alternative label: Personas intersex afroeuropeas @es
comment: Intersex people of African descent born in European countries or intersex people born in African countries who live in or have a strong connection to Europe. Only use for individuals who self-identify as Afro-European.
comment: Personas intersexuales de ascendencia africana nacidas en países europeos o personas intersexuales nacidas en países africanos que viven o tienen una conexiónfuerte con Europa. Utilícese únicamente para personas que se identifiquen como afroeuropeas. @es
broader: Afro-European LGBTQ+ people
broader: Black intersex people
has top concept: LGBTQ+ people
issued: 2023-09-29
modified: 2025-02-23
type: Concept
in scheme: v3
change note: Version 4.1.0

Afro-Latin American intersex people
preferred label: Personas intersexuales afrolatinoamericanas @es
alternative label: Afro-Latina intersex people
alternative label: Afro-Latine intersex people
alternative label: Afro-Latino intersex people
alternative label: Afro-Latino/a/x intersex people
alternative label: Afro-Latinx intersex people
alternative label: Intersex Afro-Latin Americans
alternative label: Intersex Afro-Latinas
alternative label: Intersex Afro-Latine people
alternative label: Intersex Afro-Latinos
alternative label: Intersex Afro-Latinx people
alternative label: Intersex afrolatinoamericanos @es
alternative label: Personas afrolatinoamericanas intersex @es
alternative label: Personas intersex afrolatinoamericanas @es
alternative label: Personas afrolatinas intersex @es
alternative label: Personas intersex afrolatinas @es
alternative label: Intersex afrolatinos @es
alternative label: Afrolatinos intersex @es
alternative label: Intersex afrolatinxs @es
alternative label: Afrolatinxs intersex @es
alternative label: Intersex afrolatinas @es
alternative label: Afrolatinas intersex|| @es
comment: Intersex people of African descent born in Latin American countries or intersex people born in African countries who live in or have a strong connection to Latin America. Only use for individuals who self-identify as Afro-Latin American.
comment: Personas intersexuales de ascendencia africana nacidas en países latinoamericanos o personas intersexuales nacidas en países africanos que viven o tienen una conexión fuerte con América Latina. Utilícese únicamente para personas que se identifiquen como afrolatinoamericanas. @es
broader: Afro-Latin American LGBTQ+ people
broader: Black intersex people
broader: Latino/a/x intersex people
has top concept: LGBTQ+ people
issued: 2023-09-29
modified: 2025-02-23
type: Concept
in scheme: v3
change note: Version 4.1.0

Biracial intersex people
preferred label: Personas intersexuales birraciales @es
alternative label: Bi-racial intersex people
alternative label: Intersex bi-racial people
alternative label: Intersex biracial people
alternative label: Personas bi-raciales intersex @es
alternative label: Personas intersex bi-raciales @es
alternative label: Personas birraciales intersex @es
alternative label: Personas intersex birraciales @es
comment: Intersex people who belong to two or more racial groups. Only use for people who self-identify as biracial.
comment: Personas intersexuales que pertenecen a dos o más grupos raciales. Utilícese únicamente para personas que se autoidentifiquen como birraciales. @es
broader: Biracial LGBTQ+ people
has top concept: LGBTQ+ people
issued: 2023-09-29
modified: 2025-02-23
type: Concept
in scheme: v3
change note: Version 4.1.0

Mothers of intersex people
preferred label: Madres de personas intersexuales @es
alternative label: Mamás de personas intersex @es
alternative label: Madres de personas intersex @es
comment: A person who assumes the role of mother to an intersex person; use only for individuals who self-identify as mothers.
comment: Una persona que asume el rol de madre de una persona intersexual; utilícese únicamente para personas que se autoidentifiquen como madres. @es
broader: Mothers of LGBTQ+ people
has top concept: Family members
issued: 2023-09-29
modified: 2025-02-23
type: Concept
in scheme: v3
change note: Version 4.1.0

Multiracial intersex people
preferred label: Personas intersexuales multirraciales @es
alternative label: Intersex multi-racial people
alternative label: Intersex multiracial people
alternative label: Multi-racial intersex people
alternative label: Personas intersex multirraciales @es
alternative label: Personas multirraciales intersexuales @es
comment: Intersex people who belong to two or more racial groups. Only use for people who self-identify as multiracial.
comment: Personas intersexuales que pertenecen a dos o más grupos raciales. Utilícese únicamente para personas que se autoidentifiquen como multirraciales. @es
broader: Multiracial LGBTQ+ people
has top concept: LGBTQ+ people
issued: 2023-09-29
modified: 2025-02-23
type: Concept
in scheme: v3
change note: Version 4.1.0

Native American intersex people
preferred label: Personas intersexuales nativoamericanas @es
alternative label: American Indian intersex people
alternative label: Intersex American Indians
alternative label: Intersex Native Americans
alternative label: Personas intersex nativoamericanas @es
alternative label: Personas nativoamericanas intersexuales @es
comment: People who are part of the Native peoples of the continental United States and Canada (excluding Inuit people) and self-identity as intersex. Use more specific terms when available.
comment: Personas intersexuales que son nativoamericanas o parte de los pueblos indígenas de Norteamérica; utilícese únicamente para personas que se autoidentifiquen como nativoamericanas e intersexuales. @es
broader: Native American LGBTQ+ people
broader: Indigenous intersex people
has top concept: LGBTQ+ people
issued: 2023-09-29
modified: 2025-02-23
type: Concept
in scheme: v3
change note: Version 4.1.0

Intersex bookshops
preferred label: Librerías intersex @es
comment: Bookshops that sell materials intended for use by intersex people or addressing topics related to intersex experiences.
comment: Librerías que venden materiales destinados al uso de personas intersex o que abordan temas relacionados con experiencias intersex. @es
broader: LGBTQ+ bookshops
has top concept: LGBTQ+ bookshops
issued: 2023-09-29
modified: 2025-02-23
type: Concept
in scheme: v3
change note: Version 4.1.0

Intersex characters
preferred label: Personajes intersex @es
comment: Characters in creative works who are intersex.
comment: Personajes de obras creativas que son intersex. @es
broader: LGBTQ+ characters
has top concept: LGBTQ+ characters
issued: 2023-09-29
modified: 2025-02-23
type: Concept
in scheme: v3
change note: Version 4.1.0

Intersex community centers
preferred label: Centros comunitarios intersex @es
alternative label: Intersex community centres
comment: Spaces in which people from intersex communities meet for social, education, recreational, or organizing activities.
comment: Espacios en los que personas de comunidades intersex se reúnen para realizar actividades sociales, educativas, recreativas u organizativas. @es
broader: LGBTQ+ community centers
has top concept: LGBTQ+ centers
issued: 2023-09-29
modified: 2025-02-23
type: Concept
in scheme: v3
change note: Version 4.1.0

Intersex couples
preferred label: Parejas intersex @es
comment: Partnerships in which both people are intersex.
comment: Relaciones en las que ambas personas son intersex. @es
broader: LGBTQ+ couples
broader: Intersex relationships
has top concept: Relationship satisfaction
issued: 2023-09-29
modified: 2025-02-23
type: Concept
in scheme: v3
change note: Version 4.1.0

Intersex culture
preferred label: Cultura intersex @es
comment: Cultural experiences shared by members of intersex communities or products of intersex culture (e.g., art and media created by and for intersex people, activism focused on intersex issues, slang commonly used in intersex communities, etc.).
comment: Experiencias culturales compartidas por miembros de comunidades intersex o productos de la cultura intersex (por ejemplo, arte y medios creados por y para personas intersex, activismo centrado en cuestiones intersex, jerga comúnmente utilizada en comunidades intersex, etc.). @es
broader: LGBTQ+ culture
has top concept: Subcultures
issued: 2023-09-29
modified: 2025-02-23
type: Concept
in scheme: v3
change note: Version 4.1.0

Intersex daughters
preferred label: Hijas intersex @es
comment: Daughters who identify as intersex. Only use for people who identify as daughters.
comment: Hijas que se identifican como intersex. Utilícese únicamente para personas que se autoidentifiquen como hijas. @es
broader: LGBTQ+ daughters
has top concept: LGBTQ+ people
issued: 2023-09-29
modified: 2025-02-23
type: Concept
in scheme: v3
change note: Version 4.1.0

Intersex atheists
preferred label: Ateos intersex @es
comment: Intersex people who are atheists.
comment: Personas intersex que son ateas. @es
broader: LGBTQ+ atheists
has top concept: LGBTQ+ people
issued: 2023-09-29
modified: 2025-02-23
type: Concept
in scheme: v3
change note: Version 4.1.0

Intersex Christians
preferred label: Cristianos intersex @es
comment: Intersex people who are Christian.
comment: Personas intersex que son cristianas. @es
broader: LGBTQ+ Christians
has top concept: LGBTQ+ African religions
issued: 2023-09-29
modified: 2025-02-23
type: Concept
in scheme: v3
change note: Version 4.1.0

Intersex clergy
preferred label: Clero intersexual @es
alternative label: Clero intersex @es
comment: Intersex people who are ordained for religious duties, particularly in the Christian Church.
comment: Personas intersex que son ordenadas para deberes religiosos, particularmente en la Iglesia cristiana. @es
broader: LGBTQ+ clergy
has top concept: LGBTQ+ clergy
issued: 2023-09-29
modified: 2025-02-23
type: Concept
in scheme: v3
change note: Version 4.1.0

Intersex Muslims
preferred label: Musulmanes intersex @es
comment: Intersex people who are Muslim.
comment: Personas intersex que son musulmanas. @es
broader: LGBTQ+ Muslims
has top concept: LGBTQ+ African religions
issued: 2023-09-29
modified: 2025-02-23
type: Concept
in scheme: v3
change note: Version 4.1.0

Intersex Pagans
preferred label: Paganos intersexuales @es
comment: Intersex people who are members of polytheistic religions or other religions outside of the dominant culture that typically incorporate nature worship and/or the sacred feminine, such as Wicca, Druidry, Heathenry, etc. Use to describe intersex people who self-identify as Pagan.
comment: Personas intersex que son miembros de religiones politeístas u otras religiones fuera de la cultura dominante que típicamente incorporan el culto a la naturaleza y/o lo sagrado femenino, como la Wicca, el druidismo, el paganismo, etc. Utilícese para describir a las personas intersex que se autoidentifican como paganas. @es
broader: LGBTQ+ Pagans
has top concept: LGBTQ+ African religions
issued: 2023-09-29
modified: 2025-02-23
type: Concept
in scheme: v3
change note: Version 4.1.0

Intersex Protestants
preferred label: Protestantes intersex @es
comment: Intersex people who are members of the Protestant Church.
comment: Personas intersex que son miembros de la Iglesia protestante. @es
broader: LGBTQ+ Protestants
has top concept: LGBTQ+ African religions
issued: 2023-09-29
modified: 2025-02-23
type: Concept
in scheme: v3
change note: Version 4.1.0

Asexual atheists
preferred label: Ateos asexuales @es
comment: Asexual people who are atheists.
comment: Personas asexuales que son ateas. @es
broader: LGBTQ+ atheists
has top concept: LGBTQ+ people
issued: 2023-10-27
modified: 2025-02-23
type: Concept
in scheme: v3
change note: Version 4.1.0

Asexual Christians
preferred label: Cristianos asexuales @es
comment: Asexual people who are Christian.
comment: Personas asexuales que son cristianas. @es
broader: LGBTQ+ Christians
has top concept: LGBTQ+ African religions
issued: 2023-10-27
modified: 2025-02-23
type: Concept
in scheme: v3
change note: Version 4.1.0

Asexual clergy
preferred label: Clero asexual @es
comment: Asexual people who are ordained for religious duties, particularly in the Christian Church.
comment: Personas asexuales que son ordenadas para deberes religiosos, particularmente en la iglesia cristiana. @es
broader: LGBTQ+ clergy
has top concept: LGBTQ+ clergy
issued: 2023-10-27
modified: 2025-02-23
type: Concept
in scheme: v3
change note: Version 4.1.0

Asexual Muslims
preferred label: Musulmanes asexuales @es
comment: Asexual people who are Muslim.
comment: Personas asexuales que son musulmanas. @es
broader: LGBTQ+ Muslims
has top concept: LGBTQ+ African religions
issued: 2023-10-27
modified: 2025-02-23
type: Concept
in scheme: v3
change note: Version 4.1.0

Asexual Pagans
preferred label: Paganos asexuales @es
comment: Asexual people who are members of polytheistic religions or other religions outside of the dominant culture that typically incorporate nature worship and/or the sacred feminine, such as Wicca, Druidry, Heathenry, etc. Use to describe asexual people who self-identify as Pagan.
comment: Personas asexuales que son miembros de religiones politeístas u otras religiones fuera de la cultura dominante que típicamente incorporan el culto a la naturaleza y/o a lo sagrado femenino, tal como la wicca, el druidismo, el paganismo, etc. Utilícese para describir a las personas asexuales que se autoidentifiquen como paganas. @es
broader: LGBTQ+ Pagans
has top concept: LGBTQ+ African religions
issued: 2023-10-27
modified: 2025-02-23
type: Concept
in scheme: v3
change note: Version 4.1.0

Asexual Protestants
preferred label: Protestantes asexuales @es
comment: Asexual people who are members of the Protestant Church.
comment: Personas asexuales que son miembros de la Iglesia protestante. @es
broader: LGBTQ+ Protestants
has top concept: LGBTQ+ African religions
issued: 2023-10-27
modified: 2025-02-23
type: Concept
in scheme: v3
change note: Version 4.1.0

Asexual witches
alternative label: Asexual Wiccans
comment: Asexual practitioners of Wicca or other Pagan religions who self-identify as witches.
broader: LGBTQ+ witches
has top concept: LGBTQ+ African religions
issued: 2023-10-27
modified: 2025-02-23
type: Concept
in scheme: v3
change note: Version 4.1.0

Asexual Roman Catholics
preferred label: Personas católicas romanas asexuales @es
alternative label: Católicos romanos asexuales @es
alternative label: Católicas romanas asexuales @es
comment: Asexual people who are members of the Roman Catholic Church.
comment: Personas asexuales que son miembros de la Iglesia católica romana. @es
broader: LGBTQ+ Roman Catholics
has top concept: LGBTQ+ African religions
issued: 2023-10-27
modified: 2025-02-23
type: Concept
in scheme: v3
change note: Version 4.1.0

Intersex Roman Catholics
preferred label: Personas católicas romanas intersex @es
alternative label: Católico romanos intersex @es
comment: Intersex people who are members of the Roman Catholic Church.
comment: Personas intersex que son miembros de la Iglesia católica romana. @es
broader: LGBTQ+ Roman Catholics
has top concept: LGBTQ+ African religions
issued: 2023-10-27
modified: 2025-02-23
type: Concept
in scheme: v3
change note: Version 4.1.0

Asexual Buddhists
preferred label: Budistas asexuales @es
comment: Asexual people who are Buddhist.
comment: Personas asexuales que son budistas. @es
broader: LGBTQ+ Buddhists
has top concept: LGBTQ+ African religions
issued: 2023-10-27
modified: 2025-02-23
type: Concept
in scheme: v3
change note: Version 4.1.0

Intersex Buddhists
preferred label: Budistas intersex @es
comment: Intersex people who are Buddhist.
comment: Personas intersex que son budistas. @es
broader: LGBTQ+ Buddhists
has top concept: LGBTQ+ African religions
issued: 2023-10-27
modified: 2025-02-23
type: Concept
in scheme: v3
change note: Version 4.1.0

Asexual dominatrices
preferred label: Dominatrices asexuales @es
comment: Women who take a dominant role in BDSM activities; use for dominatrices who identify as asexual.
comment: Mujeres que desempeñan un papel dominante en actividades de BDSM; utilícese para dominatrices que se autoidentifiquen como asexuales. @es
broader: LGBTQ+ dominatrices
has top concept: Relationship minorities
issued: 2023-10-27
modified: 2025-02-23
type: Concept
in scheme: v3
change note: Version 4.1.0

Asexual dominants
preferred label: Dominantes asexuales @es
comment: Asexual people (typically men) who are part of the BDSM scene and assume the dominant role in sexual relationships with a master/slave dynamic.
comment: Personas asexuales (típicamente hombres) que forman parte de la escena BDSM y asumen el rol dominante en relaciones sexuales con una dinámica amo/esclavo. @es
broader: LGBTQ+ dominants
has top concept: Sexual identity
issued: 2023-10-27
modified: 2025-02-23
type: Concept
in scheme: v3
change note: Version 4.1.0

Asexual mistresses
comment: Asexual women who are part of the BDSM scene and assume the mistress role in sexual relationships with a mistress/slave dynamic.
broader: LGBTQ+ mistresses (BDSM culture)
has top concept: Sexual identity
issued: 2023-10-27
modified: 2026-02-24
type: Concept
in scheme: v3
change note: Version 4.1.0

Demisexual disabled people
preferred label: Personas demisexuales discapacitadas @es
alternative label: Disabled demisexual people
alternative label: Personas discapacitadas demisexuales @es
alternative label: Personas demisexuales con discapacidades @es
comment: Demisexual people who are disabled.
comment: Personas demisexuales con discapacidad. @es
broader: LGBTQ+ disabled people
narrower: Demisexual neurodivergent people
narrower: Demisexual blind people
narrower: Demisexual hard of hearing people
narrower: Demisexual Deaf people
narrower: Demisexual wheelchair users
related: Demisexual people with chronic illnesses
has top concept: LGBTQ+ people
issued: 2023-10-27
modified: 2025-02-23
type: Concept
in scheme: v3
change note: Version 4.1.0

Megasexual disabled people
preferred label: Personas megasexuales discapacitadas @es
alternative label: Disabled megasexual people
alternative label: Personas discapacitadas megasexuales @es
alternative label: Personas megasexuales con discapacidades @es
comment: Megasexual people who are disabled.
comment: Personas megasexuales con discapacidad. @es
broader: LGBTQ+ disabled people
narrower: Megasexual neurodivergent people
narrower: Megasexual blind people
narrower: Megasexual hard of hearing people
narrower: Megasexual Deaf people
narrower: Megasexual wheelchair users
related: Megasexual people with chronic illnesses
has top concept: LGBTQ+ people
issued: 2023-10-27
modified: 2025-02-23
type: Concept
in scheme: v3
change note: Version 4.1.0

Aromantic disabled people
preferred label: Personas arrománticas discapacitadas @es
alternative label: Disabled aromantic people
alternative label: Personas discapacitadas arrománticas @es
alternative label: Personas arrománticas con discapacidades @es
comment: Aromantic people who are disabled.
comment: Personas arrománticas con discapacidad. @es
broader: LGBTQ+ disabled people
narrower: Aromantic neurodivergent people
narrower: Aromantic blind people
narrower: Aromantic hard of hearing people
narrower: Aromantic Deaf people
narrower: Aromantic wheelchair users
related: Aromantic people with chronic illnesses
has top concept: LGBTQ+ people
issued: 2023-10-27
modified: 2025-02-23
type: Concept
in scheme: v3
change note: Version 4.1.0

Greyromantic disabled people
preferred label: Personas grisrománticas discapacitadas @es
alternative label: Disabled greyromantic people
alternative label: Personas discapacitadas grisrománticas @es
alternative label: Personas grisrománticas con discapacidades @es
comment: Greyromantic people who are disabled.
comment: Personas grisrománticas con discapacidad. @es
broader: LGBTQ+ disabled people
narrower: Greyromantic neurodivergent people
narrower: Greyromantic blind people
narrower: Greyromantic hard of hearing people
narrower: Greyromantic Deaf people
narrower: Greyromantic wheelchair users
related: Greyromantic people with chronic illnesses
has top concept: LGBTQ+ people
issued: 2023-10-27
modified: 2025-02-23
type: Concept
in scheme: v3
change note: Version 4.1.0

Demisexual autistic people
preferred label: Personas demisexuales autistas @es
alternative label: Autistic demisexual people
alternative label: Personas autistas demisexuales @es
alternative label: Personas demisexuales con autismo @es
comment: Demisexual people who are autistic.
comment: Personas demisexuales que son autistas. @es
broader: Demisexual neurodivergent people
has top concept: LGBTQ+ people
issued: 2023-10-27
modified: 2025-02-23
type: Concept
in scheme: v3
change note: Version 4.1.0

Megasexual autistic people
preferred label: Personas megasexuales autistas @es
alternative label: Autistic megasexual people
alternative label: Personas autistas megasexuales @es
alternative label: Personas megasexuales con autismo @es
comment: Megasexual people who are autistic.
comment: Personas megasexuales que son autistas. @es
broader: Megasexual neurodivergent people
has top concept: LGBTQ+ people
issued: 2023-10-27
modified: 2025-02-23
type: Concept
in scheme: v3
change note: Version 4.1.0

Aromantic autistic people
preferred label: Personas arrománticas autistas @es
alternative label: Autistic aromantic people
alternative label: Personas autistas arrománticas @es
alternative label: Personas arrománticas con autismo @es
comment: Aromantic people who are autistic.
comment: Personas arrománticas que son autistas. @es
broader: Aromantic neurodivergent people
has top concept: LGBTQ+ people
issued: 2023-10-27
modified: 2025-02-23
type: Concept
in scheme: v3
change note: Version 4.1.0

Greyromantic autistic people
preferred label: Personas grisrománticas autistas @es
alternative label: Autistic greyromantic people
alternative label: Personas autistas grisrománticas @es
alternative label: Personas grisrománticas con autismo @es
comment: Greyromantic people who are autistic.
comment: Personas grisrománticas que son autistas. @es
broader: Greyromantic neurodivergent people
has top concept: LGBTQ+ people
issued: 2023-10-27
modified: 2025-02-23
type: Concept
in scheme: v3
change note: Version 4.1.0

Demisexual neurodivergent people
preferred label: Personas demisexuales neurodivergentes @es
alternative label: Neurodivergent demisexual people
alternative label: Personas neurodivergentes demisexuales @es
comment: Demisexual people whose brains process, learn, and/or behave differently from what is considered typical by society. Some of these neurological differences can present as learning disabilities, medical disorders, and other conditions.
comment: Personas demisexuales cuyos cerebros procesan, aprenden y/o se comportan de manera diferente a lo que la sociedad considera típico. Algunas de estas diferencias neurológicas pueden presentarse como problemas de aprendizaje, trastornos médicos y otras condiciones. @es
broader: Demisexual disabled people
narrower: Demisexual autistic people
has top concept: LGBTQ+ people
issued: 2023-10-27
modified: 2025-02-23
type: Concept
in scheme: v3
change note: Version 4.1.0

Megasexual neurodivergent people
preferred label: Personas megasexuales neurodivergentes @es
alternative label: Neurodivergent megasexual people
alternative label: Personas neurodivergentes megasexuales @es
comment: Megasexual people whose brains process, learn, and/or behave differently from what is considered typical by society. Some of these neurological differences can present as learning disabilities, medical disorders, and other conditions.
comment: Personas megasexuales cuyos cerebros procesan, aprenden y/o se comportan de manera diferente a lo que la sociedad considera típico. Algunas de estas diferencias neurológicas pueden presentarse como problemas de aprendizaje, trastornos médicos y otras condiciones. @es
broader: Megasexual disabled people
narrower: Megasexual autistic people
has top concept: LGBTQ+ people
issued: 2023-10-27
modified: 2025-02-23
type: Concept
in scheme: v3
change note: Version 4.1.0

Aromantic neurodivergent people
preferred label: Personas arrománticas neurodivergentes @es
alternative label: Neurodivergent aromantic people
alternative label: Personas neurodivergentes arrománticas @es
comment: Aromantic people whose brains process, learn, and/or behave differently from what is considered typical by society. Some of these neurological differences can present as learning disabilities, medical disorders, and other conditions.
comment: Personas arrománticas cuyos cerebros procesan, aprenden y/o se comportan de manera diferente a lo que la sociedad considera típico. Algunas de estas diferencias neurológicas pueden presentarse como problemas de aprendizaje, trastornos médicos y otras condiciones. @es
broader: Aromantic disabled people
narrower: Aromantic autistic people
has top concept: LGBTQ+ people
issued: 2023-10-27
modified: 2025-02-23
type: Concept
in scheme: v3
change note: Version 4.1.0

Greyromantic neurodivergent people
preferred label: Personas grisrománticas neurodivergentes @es
alternative label: Neurodivergent greyromantic people
alternative label: Personas neurodivergentes grisrománticas @es
comment: Greyromantic people whose brains process, learn, and/or behave differently from what is considered typical by society. Some of these neurological differences can present as learning disabilities, medical disorders, and other conditions.
comment: Personas grisrománticas cuyos cerebros procesan, aprenden y/o se comportan de manera diferente a lo que la sociedad considera típico. Algunas de estas diferencias neurológicas pueden presentarse como problemas de aprendizaje, trastornos médicos y otras condiciones. @es
broader: Greyromantic disabled people
narrower: Greyromantic autistic people
has top concept: LGBTQ+ people
issued: 2023-10-27
modified: 2025-02-23
type: Concept
in scheme: v3
change note: Version 4.1.0

Non-binary neurodivergent people
preferred label: Personas no binarias neurodivergentes @es
alternative label: Neurodivergent non-binary people
alternative label: Personas neurodivergentes no binarias @es
comment: Non-binary people whose brains process, learn, and/or behave differently from what is considered typical by society. Some of these neurological differences can present as learning disabilities, medical disorders, and other conditions.
comment: Personas no binarias cuyos cerebros procesan, aprenden y/o se comportan de manera diferente a lo que la sociedad considera típico. Algunas de estas diferencias neurológicas pueden presentarse como problemas de aprendizaje, trastornos médicos y otras condiciones. @es
broader: Non-binary disabled people
narrower: Non-binary autistic people
has top concept: LGBTQ+ people
issued: 2023-10-27
modified: 2026-03-05
type: Concept
in scheme: v3
change note: Version 4.1.0

Demisexual blind people
preferred label: Personas demisexuales ciegas @es
alternative label: Blind demisexual people
alternative label: Personas ciegas demisexuales @es
alternative label: Ciegos demisexuales @es
alternative label: Ciegas demisexuales @es
comment: Demisexual people with significant or total loss of vision.
comment: Personas demisexuales con pérdida significativa o total de la visión. @es
broader: Demisexual disabled people
has top concept: LGBTQ+ people
issued: 2023-10-27
modified: 2025-02-23
type: Concept
in scheme: v3
change note: Version 4.1.0

Megasexual blind people
preferred label: Personas megasexuales ciegas @es
alternative label: Blind megasexual people
alternative label: Personas ciegas megasexuales @es
comment: Megasexual people with significant or total loss of vision.
comment: Personas megasexuales con pérdida significativa o total de la visión. @es
broader: Megasexual disabled people
has top concept: LGBTQ+ people
issued: 2023-10-27
modified: 2025-02-23
type: Concept
in scheme: v3
change note: Version 4.1.0

Aromantic blind people
preferred label: Personas arrománticas ciegas @es
alternative label: Blind aromantic people
alternative label: Personas ciegas arrománticas @es
comment: Aromantic people with significant or total loss of vision.
comment: Personas aromáticas con pérdida significativa o total de la visión. @es
broader: Aromantic disabled people
has top concept: LGBTQ+ people
issued: 2023-10-27
modified: 2025-02-23
type: Concept
in scheme: v3
change note: Version 4.1.0

Greyromantic blind people
preferred label: Personas grisrománticas ciegas @es
alternative label: Blind greyromantic people
alternative label: Personas ciegas grisrománticas @es
alternative label: Ciegos grisrománticos @es
comment: Greyromantic people with significant or total loss of vision.
comment: Personas grisrománticas con pérdida significativa o total de la visión. @es
broader: Greyromantic disabled people
has top concept: LGBTQ+ people
issued: 2023-10-27
modified: 2025-02-23
type: Concept
in scheme: v3
change note: Version 4.1.0

Non-binary blind people
preferred label: Personas no binarias ciegas @es
alternative label: Blind non-binary people
alternative label: Nonbinary blind people
alternative label: Personas ciegas no binarias @es
comment: Non-binary people with significant or total loss of vision.
comment: Personas no binarias con pérdida significativa o total de la visión. @es
broader: Non-binary disabled people
has top concept: LGBTQ+ people
issued: 2023-10-27
modified: 2025-02-23
type: Concept
in scheme: v3
change note: Version 4.1.0

Demisexual hard of hearing people
preferred label: Personas demisexuales con problemas de audición @es
alternative label: Demisexual HoH people
alternative label: Demisexual hearing impaired people
alternative label: Hearing impaired demisexual people
alternative label: HoH Demisexual people
alternative label: Personas demisexuales con dificultades de audición @es
alternative label: Personas demisexuales con dificultades auditivas @es
comment: Demisexual people with significant or total hearing loss who may or may not consider themselves d/Deaf.
comment: Personas demisexuales con pérdida auditiva significativa o total que pueden considerarse o no S/sordas. @es
broader: Demisexual disabled people
related: Demisexual Deaf people
has top concept: LGBTQ+ people
issued: 2023-10-27
modified: 2025-02-23
type: Concept
in scheme: v3
change note: Version 4.1.0

Megasexual hard of hearing people
preferred label: Personas megasexuales con problemas de audición @es
alternative label: Hearing impaired megasexual people
alternative label: HoH Megasexual people
alternative label: Megasexual HoH people
alternative label: Megasexual hearing impaired people
alternative label: Personas megasexuales con dificultades de audición @es
alternative label: Personas megasexuales con dificultades auditivas @es
comment: Megasexual people with significant or total hearing loss who may or may not consider themselves d/Deaf.
comment: Personas megasexuales con pérdida auditiva significativa o total, que pueden o no considerarse S/sordas. @es
broader: Megasexual disabled people
related: Megasexual Deaf people
has top concept: LGBTQ+ people
issued: 2023-10-27
modified: 2025-02-23
type: Concept
in scheme: v3
change note: Version 4.1.0

Aromantic hard of hearing people
preferred label: Personas arrománticas con problemas de audición @es
alternative label: Aromantic HoH people
alternative label: Aromantic hearing impaired people
alternative label: Hearing impaired aromantic people
alternative label: HoH Aromantic people
alternative label: Personas arrománticas con dificultades de audición @es
alternative label: Personas arrománticas con dificultades auditivas @es
comment: Aromantic people who are hard of hearing.
comment: Personas arrománticas con problemas de audición, que pueden o no considerarse S/sordas. @es
broader: Aromantic disabled people
related: Aromantic Deaf people
has top concept: LGBTQ+ people
issued: 2023-10-27
modified: 2025-02-23
type: Concept
in scheme: v3
change note: Version 4.1.0

Greyromantic hard of hearing people
preferred label: Personas grisrománticas con problemas de audición @es
alternative label: Greyromantic hearing impaired people
alternative label: Greyromantic HoH people
alternative label: Hearing impaired greyromantic people
alternative label: HoH Greyromantic people
alternative label: Personas grisrománticas con dificultades de audición @es
alternative label: Personas grisrománticas con dificultades auditivas @es
comment: Greyromantic people with significant or total hearing loss who may or may not consider themselves d/Deaf.
comment: Personas grisrománticas con pérdida auditiva significativa o total que pueden o no considerarse S/sordas. @es
broader: Greyromantic disabled people
broader: Greyromantic Deaf people
has top concept: LGBTQ+ people
issued: 2023-10-27
modified: 2025-02-23
type: Concept
in scheme: v3
change note: Version 4.1.0

Non-binary hard of hearing people
preferred label: Personas no binarias con problemas de audición @es
alternative label: Hearing impaired non-binary people
alternative label: HoH Non-binary people
alternative label: Non-binary HoH people
alternative label: Non-binary hearing impaired people
alternative label: Nonbinary hard of hearing people
alternative label: Personas no binarias con dificultades de audición @es
alternative label: Personas no binarias con dificultades auditivas @es
comment: Non-binary people with significant or total hearing loss who may or may not consider themselves d/Deaf.
comment: Personas no binarias con pérdida auditiva significativa o total, que pueden o no considerarse S/sordas. @es
broader: Non-binary disabled people
related: Non-binary Deaf people
has top concept: LGBTQ+ people
issued: 2023-10-27
modified: 2025-02-23
type: Concept
in scheme: v3
change note: Version 4.1.0

Demisexual Deaf people
preferred label: Personas demisexuales sordas @es
alternative label: Deaf demisexual people
alternative label: Personas sordas demisexuales @es
comment: Demisexual people with significant or total hearing loss. Some but not all Deaf people prefer to capitalize Deaf in recognition of the cultural and linguistic identity they share with other Deaf people.
comment: Personas demisexuales con pérdida auditiva significativa o total. Algunas personas sordas, pero no todas, prefieren escribir “Sorda/o” con mayúscula en reconocimiento de la identidad cultural y lingüística que comparten con otras personas sordas. @es
broader: Demisexual disabled people
related: Demisexual hard of hearing people
has top concept: LGBTQ+ people
issued: 2023-10-27
modified: 2025-02-23
type: Concept
in scheme: v3
change note: Version 4.1.0

Megasexual Deaf people
preferred label: Personas megasexuales sordas @es
alternative label: Deaf megasexual people
alternative label: Personas sordas megasexuales @es
comment: Megasexual people with significant or total hearing loss who may or may not consider themselves d/Deaf.
comment: Personas megasexuales con pérdida auditiva significativa o total. Algunas personas sordas, pero no todas, prefieren escribir “Sorda/o” con mayúscula en reconocimiento de la identidad cultural y lingüística que comparten con otras personas sordas. @es
broader: Megasexual disabled people
related: Megasexual hard of hearing people
has top concept: LGBTQ+ people
issued: 2023-10-27
modified: 2025-02-23
type: Concept
in scheme: v3
change note: Version 4.1.0

Aromantic Deaf people
preferred label: Personas arrománticas sordas @es
alternative label: Deaf aromantic people
alternative label: Personas sordas arrománticas @es
comment: Aromantic people with significant or total hearing loss. Some but not all Deaf people prefer to capitalize Deaf in recognition of the cultural and linguistic identity they share with other Deaf people.
comment: Personas arrománticas con pérdida auditiva significativa o total. Algunas personas sordas, pero no todas, prefieren escribir “Sorda/o” con mayúscula en reconocimiento de la identidad cultural y lingüística que comparten con otras personas sordas. @es
broader: Aromantic disabled people
related: Aromantic hard of hearing people
has top concept: LGBTQ+ people
issued: 2023-10-27
modified: 2025-02-23
type: Concept
in scheme: v3
change note: Version 4.1.0

Greyromantic Deaf people
preferred label: Personas grisrománticas sordas @es
alternative label: Deaf greyromantic people
alternative label: Personas sordas grisrománticas @es
comment: Greyromantic people with significant or total hearing loss who may or may not consider themselves d/Deaf.
comment: Personas grisrománticas con pérdida auditiva significativa o total. Algunas personas sordas, pero no todas, prefieren escribir “Sorda/o” con mayúscula en reconocimiento de la identidad cultural y lingüística que comparten con otras personas sordas. @es
broader: Greyromantic disabled people
narrower: Greyromantic hard of hearing people
has top concept: LGBTQ+ people
issued: 2023-10-27
modified: 2025-02-23
type: Concept
in scheme: v3
change note: Version 4.1.0

Non-binary Deaf people
preferred label: Personas no binarias sordas @es
alternative label: Deaf non-binary people
alternative label: Nonbinary Deaf people
alternative label: Personas sordas no binarias @es
alternative label: Sordos no binarios @es
comment: Non-binary people with significant or total hearing loss. Some but not all Deaf people prefer to capitalize Deaf in recognition of the cultural and linguistic identity they share with other Deaf people.
comment: Personas no binarias con pérdida auditiva significativa o total. Algunas personas sordas, pero no todas, prefieren escribir “Sorda/o” con mayúscula en reconocimiento de la identidad cultural y lingüística que comparten con otras personas sordas. @es
broader: Non-binary disabled people
related: Non-binary hard of hearing people
has top concept: LGBTQ+ people
issued: 2023-10-27
modified: 2025-02-23
type: Concept
in scheme: v3
change note: Version 4.1.0

Demisexual people with chronic illnesses
preferred label: Personas demisexuales con enfermedades crónicas @es
alternative label: Chronically ill demisexual people
alternative label: Personas con enfermedades crónicas demisexuales @es
alternative label: Enfermos crónicos demisexuales @es
alternative label: Enfermas crónicas demisexuales @es
comment: Demisexual people who have long-term health conditions that require continued medical attention and/or significantly impact or limit daily life; some but not all people with chronic illnesses consider themselves disabled.
comment: Personas demisexuales que tienen condiciones de salud a largo plazo que requieren atención médica continua y/o que impactan o limitan significativamente la vida diaria; algunas, pero no todas, las personas con enfermedades crónicas se consideran discapacitadas. @es
related: Demisexual disabled people
issued: 2023-10-27
modified: 2025-02-23
type: Concept
in scheme: v3
change note: Version 4.1.0

Megasexual people with chronic illnesses
preferred label: Personas megasexuales con enfermedades crónicas @es
alternative label: Chronically ill megasexual people
alternative label: Personas con enfermedades crónicas megasexuales @es
alternative label: Enfermos crónicos megasexuales @es
comment: Megasexual people who have long-term health conditions that require continued medical attention and/or significantly impact or limit daily life; some but not all people with chronic illnesses consider themselves disabled.
comment: Personas megasexuales que tienen condiciones de salud a largo plazo que requieren atención médica continua y/o impactan o limitan significativamente la vida diaria; algunas, pero no todas, las personas con enfermedades crónicas se consideran discapacitadas. @es
related: Megasexual disabled people
issued: 2023-10-27
modified: 2025-02-23
type: Concept
in scheme: v3
change note: Version 4.1.0

Aromantic people with chronic illnesses
alternative label: Chronically ill aromantic people
comment: Aromantic people who have long-term health conditions that require continued medical attention and/or significantly impact or limit daily life; some but not all people with chronic illnesses consider themselves disabled.
related: Aromantic disabled people
issued: 2023-10-27
modified: 2025-02-23
type: Concept
in scheme: v3
change note: Version 4.1.0

Greyromantic people with chronic illnesses
preferred label: Personas grisrománticas con enfermedades crónicas @es
alternative label: Chronically ill greyromantic people
alternative label: Personas con enfermedades crónicas grisrománticas @es
alternative label: Enfermos crónicos grisrománticos @es
comment: Greyromantic people who have long-term health conditions that require continued medical attention and/or significantly impact or limit daily life; some but not all people with chronic illnesses consider themselves disabled.
comment: Personas grisrománticas que tienen condiciones de salud a largo plazo que requieren atención médica continua y/o impactan o limitan significativamente la vida diaria; algunas, pero no todas, las personas con enfermedades crónicas se consideran discapacitadas. @es
related: Greyromantic disabled people
issued: 2023-10-27
modified: 2025-02-23
type: Concept
in scheme: v3
change note: Version 4.1.0

Non-binary people with chronic illnesses
preferred label: Personas no binarias con enfermedades crónicas @es
alternative label: Chronically ill non-binary people
alternative label: Personas con enfernedades crónicas no binarias @es
alternative label: Enfermos crónicos no binarios @es
comment: Non-binary people who have long-term health conditions that require continued medical attention and/or significantly impact or limit daily life; some but not all people with chronic illnesses consider themselves disabled.
comment: Personas no binarias que tienen condiciones de salud a largo plazo que requieren atención médica continua y/o impactan o limitan significativamente la vida diaria; algunas, pero no todas, las personas con enfermedades crónicas se consideran discapacitadas. @es
related: Non-binary disabled people
issued: 2023-10-27
modified: 2025-02-23
type: Concept
in scheme: v3
change note: Version 4.1.0

Non-binary wheelchair users
preferred label: Usuarios no binarios de sillas de ruedas @es
alternative label: Nonbinary wheelchair users
alternative label: Usuarios de sillas de ruedas no binarios @es
comment: Non-binary people who use wheelchairs.
comment: Personas no binarias que utilizan sillas de ruedas. @es
broader: Non-binary disabled people
has top concept: LGBTQ+ people
issued: 2023-10-27
modified: 2025-02-23
type: Concept
in scheme: v3
change note: Version 4.1.0

Demisexual wheelchair users
preferred label: Usuarios demisexuales de sillas de ruedas @es
comment: Demisexual people who use wheelchairs.
comment: Personas demisexuales que utilizan sillas de ruedas. @es
broader: Demisexual disabled people
has top concept: LGBTQ+ people
issued: 2023-10-27
modified: 2025-02-23
type: Concept
in scheme: v3
change note: Version 4.1.0

Megasexual wheelchair users
preferred label: Usuarios megasexuales de sillas de ruedas @es
comment: Megasexual people who use wheelchairs.
comment: Personas megasexuales que utilizan sillas de ruedas. @es
broader: Megasexual disabled people
has top concept: LGBTQ+ people
issued: 2023-10-27
modified: 2025-02-23
type: Concept
in scheme: v3
change note: Version 4.1.0

Aromantic wheelchair users
preferred label: Usuarios arrománticos de sillas de ruedas @es
comment: Aromantic people who use wheelchairs.
comment: Personas arrománticas que utilizan sillas de ruedas. @es
broader: Aromantic disabled people
has top concept: LGBTQ+ people
issued: 2023-10-27
modified: 2025-02-23
type: Concept
in scheme: v3
change note: Version 4.1.0

Greyromantic wheelchair users
preferred label: Usuarios grisrománticos de sillas de ruedas @es
comment: Greyromantic people who use wheelchairs.
comment: Personas grisrománticas que utilizan sillas de ruedas. @es
broader: Greyromantic disabled people
has top concept: LGBTQ+ people
issued: 2023-10-27
modified: 2025-02-23
type: Concept
in scheme: v3
change note: Version 4.1.0

LGBTQ+ alumni groups
preferred label: Grupos de ex estudiantes LGBTQ+ @es
alternative label: LGBTQ+ alumni associations
alternative label: Agrupaciones de ex estudiantes LGBTQ+ @es
alternative label: Asociaciones de ex estudiantes LGBTQ+ @es
comment: Alumni groups or associations whose membership is specifically comprised of LGBTQ+ former students of the same university, college, or school
comment: Grupos o asociaciones de ex estudiantes cuya membresía esté compuesta específicamente por ex estudiantes LGBTQ+ de la misma universidad, colegio o escuela. @es
broader: LGBTQ+ communities
related: Aromantic college students
related: Asexual college students
related: Bisexual college students
related: Demisexual college students
related: Gay college students
related: Greyromantic college students
related: Intersex college students
related: Lesbian college students
related: Megasexual college students
related: Non-binary college students
related: Queer college students
related: Transgender college students
related: Two-Spirit college students
has top concept: LGBTQ+ communities
issued: 2023-12-05
modified: 2025-02-23
type: Concept
in scheme: v3
change note: Version 4.1.0

Aromantic college students
preferred label: Estudiantes universitarios arrománticos @es
comment: Aromantic people who are attending college.
comment: Personas arrománticas que asisten a la universidad. @es
broader: LGBTQ+ college students
related: LGBTQ+ alumni groups
has top concept: LGBTQ+ people
issued: 2023-12-05
modified: 2025-02-23
type: Concept
in scheme: v3
change note: Version 4.1.0

Asexual college students
preferred label: Estudiantes universitarios asexuales @es
alternative label: Asexuales universitarios @es
alternative label: Universitarios asexuales @es
alternative label: Asexuales universitarias @es
alternative label: Universitarias asexuales @es
comment: Asexual people who are attending college.
comment: Personas asexuales que asisten a la universidad. @es
broader: Asexual people
broader: LGBTQ+ college students
related: LGBTQ+ alumni groups
has top concept: Sexual minorities
issued: 2023-12-05
modified: 2025-02-23
type: Concept
in scheme: v3
change note: Version 4.1.0

Bisexual college students
preferred label: Estudiantes universitarios bisexuales @es
comment: Bisexual people who are attending college.
comment: Personas bisexuales que asisten a la universidad. @es
broader: Bisexual people
broader: LGBTQ+ college students
related: LGBTQ+ alumni groups
has top concept: LGBTQ+ people
issued: 2023-12-05
modified: 2025-02-23
type: Concept
in scheme: v3
change note: Version 4.1.0

Demisexual college students
preferred label: Estudiantes universitarios demisexuales @es
comment: Demisexual people who are attending college.
comment: Personas demisexuales que asisten a la universidad. @es
broader: Demisexual people
broader: LGBTQ+ college students
related: LGBTQ+ alumni groups
has top concept: Sexual identity
issued: 2023-12-05
modified: 2025-02-23
type: Concept
in scheme: v3
change note: Version 4.1.0

Gay college students
preferred label: Estudiantes universitarios gay @es
comment: Gay men who are attending college.
comment: Hombres gay que asisten a la universidad. @es
broader: Gay men
broader: LGBTQ+ college students
related: LGBTQ+ alumni groups
has top concept: LGBTQ+ people
issued: 2023-12-05
modified: 2025-02-23
type: Concept
in scheme: v3
change note: Version 4.1.0

Greyromantic college students
preferred label: Estudiantes universitarios grisrománticos @es
comment: Greyromantic people who are attending college.
comment: Personas grisrománticas que asisten a la universidad. @es
broader: Greyromantic people
broader: LGBTQ+ college students
related: LGBTQ+ alumni groups
has top concept: Romantic minorities
issued: 2023-12-05
modified: 2025-02-23
type: Concept
in scheme: v3
change note: Version 4.1.0

Intersex college students
preferred label: Estudiantes universitarios intersex @es
comment: Intersex people who are attending college.
comment: Personas intersex que asisten a la universidad. @es
broader: Intersex people
broader: LGBTQ+ college students
related: LGBTQ+ alumni groups
has top concept: LGBTQ+ people
issued: 2023-12-05
modified: 2025-02-23
type: Concept
in scheme: v3
change note: Version 4.1.0

Lesbian college students
preferred label: Estudiantes universitarias lesbianas @es
comment: Lesbians who are attending college.
comment: Lesbianas que asisten a la universidad. @es
broader: Lesbians
broader: LGBTQ+ college students
related: LGBTQ+ alumni groups
has top concept: LGBTQ+ people
issued: 2023-12-05
modified: 2025-02-23
type: Concept
in scheme: v3
change note: Version 4.1.0

LGBTQ+ college students
preferred label: Estudiantes universitarios LGBTQ+ @es
alternative label: LGBT college students
alternative label: Estudiantes universitarios LGBTQ @es
comment: LGBTQ+ people who are attending college.
comment: Personas LGBTQ+ que asisten a la universidad. @es
broader: LGBTQ+ students
narrower: Aromantic college students
narrower: Asexual college students
narrower: Bisexual college students
narrower: Demisexual college students
narrower: Gay college students
narrower: Greyromantic college students
narrower: Intersex college students
narrower: Lesbian college students
narrower: Megasexual college students
narrower: Non-binary college students
narrower: Queer college students
narrower: Transgender college students
related: Two-Spirit college students
has top concept: LGBTQ+ people
issued: 2023-12-05
modified: 2025-02-23
type: Concept
in scheme: v3
change note: Version 4.1.0

Megasexual college students
preferred label: Estudiantes universitarios megasexuales @es
comment: Megasexual people who are attending college.
comment: Personas megasexuales que asisten a la universidad. @es
broader: Megasexual people
broader: LGBTQ+ college students
related: LGBTQ+ alumni groups
has top concept: Sexual minorities
issued: 2023-12-05
modified: 2025-02-23
type: Concept
in scheme: v3
change note: Version 4.1.0

Non-binary college students
preferred label: Estudiantes universitarios no binarios @es
alternative label: Nonbinary college students
comment: Non-binary people who are attending college.
comment: Personas no binarias que asisten a la universidad. @es
broader: Non-binary people
broader: LGBTQ+ college students
related: LGBTQ+ alumni groups
has top concept: LGBTQ+ people
issued: 2023-12-05
modified: 2025-02-23
type: Concept
in scheme: v3
change note: Version 4.1.0

Queer college students
preferred label: Estudiantes universitarios queer @es
comment: Queer people who are attending college.
comment: Personas queer que asisten a la universidad. @es
broader: Queer people
broader: LGBTQ+ college students
related: LGBTQ+ alumni groups
has top concept: LGBTQ+ people
issued: 2023-12-05
modified: 2025-02-23
type: Concept
in scheme: v3
change note: Version 4.1.0

Transgender college students
preferred label: Estudiantes universitarios transgénero @es
comment: Transgender people who are attending college.
comment: Personas transgénero que asisten a la universidad. @es
broader: Transgender people
broader: LGBTQ+ college students
related: LGBTQ+ alumni groups
has top concept: LGBTQ+ people
issued: 2023-12-05
modified: 2025-02-23
type: Concept
in scheme: v3
change note: Version 4.1.0

Two-Spirit college students
preferred label: Estudiantes universitarios dos espíritus @es
alternative label: 2S college students
alternative label: Two Spirit college students
alternative label: Two Spirited college students
alternative label: Two-Spirited college students
alternative label: Universitarios dos espíritus @es
alternative label: Personas universitarias dos espíritus @es
comment: Two-Spirit people who are attending college.
comment: Personas dos espíritus que asisten a la universidad. @es
broader: Two-Spirit people
related: LGBTQ+ alumni groups
related: LGBTQ+ college students
has top concept: Gender
issued: 2023-12-05
modified: 2025-02-23
type: Concept
in scheme: v3
change note: Version 4.1.0

Wrestling
preferred label: Lucha libre @es
alternative label: Luchar @es
alternative label: Lucha @es
comment: A competitive, social, or erotic activity involving two or more people engaging in grappling with each other trying throw or force the other(s) to the ground.
comment: Una actividad competitiva, social o erótica que involucra a dos o más personas luchando entre sí, tratando de arrojar o forzar a la otra persona(s) al suelo. @es
broader: BDSM
has top concept: Eroticism
issued: 2023-12-15
modified: 2025-02-23
type: Concept
in scheme: v3
change note: Version 4.1.0

Whipping
preferred label: Azotar @es
alternative label: Latiguear @es
comment: Consensual use of whips, floggers, or similar impact play tools on the body.
comment: Uso consensual de látigos, azotadores o herramientas de juego de impacto similares en el cuerpo. @es
broader: Impact play
narrower: Flagellation
related: Whips
related: Flogging
has top concept: Eroticism
issued: 2023-12-15
modified: 2025-02-23
type: Concept
in scheme: v3
change note: Version 4.1.0

Wax play
preferred label: Juego con cera @es
alternative label: Juego con velas @es
comment: Application of liquid wax to the body for erotic or sensual play.
comment: Aplicación de cera líquida en el cuerpo para juegos eróticos o sensuales. @es
broader: Temperature play
related: Hair removal
related: Fire play
related: Ice play
has top concept: Eroticism
issued: 2023-12-15
modified: 2025-02-23
type: Concept
in scheme: v3
change note: Version 4.1.0

Violet wands
alternative label: Varita violeta @es
comment: A device used to apply an electrical charge to the body.
comment: Dispositivo utilizado para aplicar una carga eléctrica al cuerpo. @es
broader: Sex accessories
related: Electrical play
has top concept: Sex accessories
issued: 2023-12-15
modified: 2025-02-23
type: Concept
in scheme: v3
change note: Version 4.1.0

Muscle worship
preferred label: Adoración de los músculos @es
alternative label: Adoración muscular @es
comment: Any practice of revering muscles, usually in a sexual context.
comment: Cualquier práctica de reverencia a los músculos, generalmente en un contexto sexual. @es
broader: BDSM
broader: Body part fetishes
broader: Body worship
related: Gym subculture
has top concept: Eroticism
issued: 2023-12-15
modified: 2025-02-23
type: Concept
in scheme: v3
change note: Version 4.1.0

Power exchange
preferred label: Intercambio de poder @es
alternative label: D & S
alternative label: D and S
alternative label: D&s
alternative label: D/s
alternative label: Dom and sub
alternative label: Dom-sub
alternative label: Dominance and submission
alternative label: Domination and submission
alternative label: M/s
alternative label: Master/slave lifestyle
alternative label: Master/slave
alternative label: Submission and dominance
alternative label: Submission and domination
alternative label: Dominación y sumisión @es
alternative label: D&S @es
alternative label: Dom y sub @es
alternative label: Amo y esclavo @es
alternative label: Amo/esclavo @es
alternative label: Estilo de vida amo/esclavo @es
comment: Consensual exchange of power between two or more people as a feature of their relationship or during erotic activity.
comment: Intercambio consensual de poder entre dos o más personas como característica de su relación o durante una actividad erótica. @es
broader: Sexual roles
narrower: Total power exchange
related: Age play
related: Bottoms (Sex)
related: LGBTQ+ dominatrices
related: BDSM
related: Leather community
related: LGBTQ+ dominants
related: Roleplay
related: LGBTQ+ submissives
related: Tops (Sex)
related: Relationship minorities
related: Mind play
related: Erotic hypnosis
related: Kinky people
related: Consent play
related: Dehumanization (Erotic)
has top concept: Role behavior
issued: 2023-12-15
modified: 2025-03-20
type: Concept
in scheme: v3
change note: Version 4.1.0

Impact play
preferred label: Juegos de impacto @es
alternative label: Beating
alternative label: Cropping
comment: An activity where a person is struck repeatedly, with or without an implement, for erotic play.
comment: Actividad en la que se golpea repetidamente a una persona, con o sin un instrumento, como parte de juegos eróticos. @es
broader: BDSM
narrower: Flagellation
narrower: Spanking
narrower: Whipping
narrower: Paddling
narrower: Caning
narrower: Flogging
related: Gloves (Erotic)
has top concept: Eroticism
issued: 2023-12-15
modified: 2025-02-23
type: Concept
in scheme: v3
change note: Version 4.1.0

Temperature play
preferred label: Juego de temperatura @es
comment: Any of various forms of sensual or sexual play in which objects and substances are used to stimulate the body with heat or cold.
comment: Cualquiera de las diversas formas de juego sensual o sexual en las que se utilizan objetos y sustancias para estimular el cuerpo con calor o frío. @es
broader: BDSM
narrower: Wax play
narrower: Fire play
narrower: Ice play
narrower: Cigar play
has top concept: Eroticism
issued: 2023-12-15
modified: 2025-02-23
type: Concept
in scheme: v3
change note: Version 4.1.0

Fire play
preferred label: Juego de fuego @es
alternative label: Juego con fuego @es
comment: The use of fire or flame in a sexual or erotic context.
comment: El uso de fuego o llamas en un contexto sexual o erótico. @es
broader: Temperature play
related: Wax play
related: Ice play
related: Cigar play
has top concept: Eroticism
issued: 2023-12-15
modified: 2025-02-23
type: Concept
in scheme: v3
change note: Version 4.1.0

Ice play
preferred label: Juego de hielo @es
alternative label: Juego con hielo @es
comment: A type of sensual or sexual play in which ice or similar cold substances are applied to the body.
comment: Un tipo de juego sensual o sexual en el que se aplica sobre el cuerpo hielo o sustancias frías similares. @es
broader: Temperature play
related: Wax play
related: Fire play
has top concept: Eroticism
issued: 2023-12-15
modified: 2025-02-23
type: Concept
in scheme: v3
change note: Version 4.1.0

Electrical play
preferred label: Juego de electricidad @es
alternative label: Juego con electricidad @es
comment: Any of various forms of sexual play which involve the application of electricity.
comment: Cualquiera de las diversas formas de juego sexual que implican la aplicación de electricidad. @es
broader: BDSM
related: Violet wands
has top concept: Eroticism
issued: 2023-12-15
modified: 2025-03-20
type: Concept
in scheme: v3
change note: Version 4.1.0

Vacuum pumps
preferred label: Dispositivo de vacio @es
alternative label: Clitoral pump
alternative label: Nipple pump
alternative label: Penis pump
alternative label: Suckers
alternative label: Bomba de clítoris @es
alternative label: Succionador de pezon @es
alternative label: Succionador de clítoris @es
alternative label: Succionador de pene @es
comment: A sexual aid or accessory that is placed over and around genitalia. The device creates a suction that engorges and enlarges genitalia.
comment: Una ayuda o accesorio sexual que se coloca sobre y alrededor de los genitales. El dispositivo crea una succión que hincha y agranda los genitales. @es
broader: Kink accessories
related: Erectile dysfunction
has top concept: Eroticism
issued: 2023-12-15
modified: 2025-02-23
type: Concept
in scheme: v3
change note: Version 4.1.0

Kink accessories
preferred label: Accesorios kink @es
alternative label: Bondage gear
alternative label: Bondagewear
alternative label: Fetishwear
alternative label: Leather gear
comment: Items used during kink play or worn as fashionable accessories to indicate participation in the kink or leather communities.
comment: Elementos utilizados durante juegos de kink o empleados como accesorios de moda para indicar la participación en las comunidades de kink o cuero. @es
broader: BDSM
narrower: Blindfolds
narrower: Enemas
narrower: Corsets
narrower: Harnesses
narrower: Vacuum pumps
narrower: Diapers (Erotic)
narrower: Uniform fetish
narrower: Gags
narrower: Body bags (Erotic)
narrower: Chastity devices
related: Bondage
related: Leather community
related: Restraints
related: Sex accessories
related: LGBTQ+ fashion
related: Jockstraps
related: Sex swings
has top concept: Eroticism
issued: 2023-12-15
modified: 2025-03-20
type: Concept
in scheme: v3
change note: Version 4.1.0

Total power exchange
preferred label: Intercambio total de poder @es
alternative label: 24/7 (Power Exchange)
alternative label: Kept
alternative label: 24/7 (intercambio de poder} @es
comment: Consensual exchange of power between two or more people as a feature of their relationship that is practiced at all times.
comment: Intercambio consensual de poder entre dos o más personas como característica de su relación que se practica en todo momento. @es
broader: Power exchange
has top concept: Role behavior
issued: 2023-12-15
modified: 2025-02-23
type: Concept
in scheme: v3
change note: Version 4.1.0

Body fluids
preferred label: Fluidos corporales @es
alternative label: Feces
alternative label: Milk
alternative label: Snot
alternative label: Sweat
alternative label: Urine
alternative label: Vomit
alternative label: Heces @es
alternative label: Sudor @es
alternative label: Leche @es
alternative label: Mocos @es
alternative label: Vómito @es
alternative label: Orina @es
comment: Naturally occurring fluids produced by the human body.
comment: Fluidos naturales producidos por el cuerpo humano. @es
narrower: Cum
narrower: Jizz
narrower: Squirting
related: Urine play
issued: 2023-12-18
modified: 2025-03-20
type: Concept
in scheme: v3
change note: Version 4.1.0

Diapers (Erotic)
preferred label: Pañales (erotico) @es
comment: Absorbent material wrapped around a person’s butt and between their legs to absorb urine and feces; typically used in ageplay.
comment: Material absorbente envuelto alrededor del trasero de una persona y entre sus piernas para absorber la orina y las heces; usualmente utilizado en juegos de edad. @es
broader: Kink accessories
related: Age play
related: Urine play
has top concept: Eroticism
issued: 2023-12-18
modified: 2025-02-23
type: Concept
in scheme: v3
change note: Version 4.1.0

Uniform fetish
preferred label: Fetiche de uniformes @es
comment: Eroticization of uniforms.
comment: Erotización de los uniformes. @es
broader: Kink accessories
related: Bootblacking
related: Clothing
related: Roleplay
related: Boot fetish
related: Leather fetish
related: LGBTQ+ fashion
related: Medical play
related: Shoe fetish
has top concept: Eroticism
issued: 2023-12-18
modified: 2025-02-23
type: Concept
in scheme: v3
change note: Version 4.1.0

Boot fetish
preferred label: Fetichismo de botas @es
alternative label: Boot kink
comment: Eroticization of boots through wearing and incorporating into sexual play.
comment: Erotización de las botas mediante su uso e incorporación al juego sexual. @es
broader: Body part fetishes
broader: Shoe fetish
related: Bootblacking
related: Uniform fetish
related: High heel fetish
has top concept: Eroticism
issued: 2023-12-18
modified: 2025-02-23
type: Concept
in scheme: v3
change note: Version 4.1.0

Leather fetish
preferred label: Fetiche leather @es
comment: Eroticization of leather, especially leather garments and accessories associated with the leather and kink communities.
comment: La erotización del cuero, especialmente de prendas y accesorios de cuero asociados a las comunidades leather y kink. @es
broader: BDSM
related: Bootblacking
related: Leather community
related: Uniform fetish
has top concept: Eroticism
issued: 2023-12-18
modified: 2025-02-23
type: Concept
in scheme: v3
change note: Version 4.1.0

LGBTQ+ fashion
preferred label: Moda LGBTQ+ @es
comment: Fashion, clothing, and accessories associated with LGBTQ+ subcultures and expression.
comment: Moda, ropa y accesorios asociados con las subculturas y expresiones LGBTQ+. @es
narrower: Corsets
narrower: Rubber and latex fetish
narrower: Jockstraps
narrower: Gloves (Erotic)
narrower: Gas masks (Erotic)
narrower: Cuffs
narrower: Hoods (Erotic)
narrower: Masks (Erotic)
narrower: PVC (Erotic)
related: Clothing
related: Gender expression
related: Gender transgression
related: Kink accessories
related: Uniform fetish
related: LGBTQ+ makeup artists
related: Makeup and LGBTQ+ communities
related: LGBTQ+ fashion designers
issued: 2023-12-18
modified: 2025-04-23
type: Concept
in scheme: v3
change note: Version 4.1.0

Medical play
preferred label: Juego médico @es
comment: Erotic roleplay and kink activities involving medical tools, settings, uniforms, and procedures.
comment: Juegos de roles eróticos y actividades kink que involucran herramientas, entornos, uniformes y procedimientos médicos. @es
broader: BDSM
broader: Roleplay
related: Uniform fetish
has top concept: Eroticism
issued: 2023-12-18
modified: 2025-02-23
type: Concept
in scheme: v3
change note: Version 4.1.0

Mind play
preferred label: Juego mental @es
alternative label: Juego de mente @es
comment: Psychological games or roleplay performed in order to produce erotic excitement or sexual arousal.
comment: Juegos psicológicos o juegos de rol realizados con el fin de producir excitación erótica o sexual. @es
broader: BDSM
narrower: Roleplay
narrower: Erotic hypnosis
related: Power exchange
has top concept: Eroticism
issued: 2023-12-18
modified: 2025-03-20
type: Concept
in scheme: v3
change note: Version 4.1.0

Humiliation (Erotic)
preferred label: Humillación @es
alternative label: Erotic humiliation
alternative label: Humillación erótica @es
comment: Psychological or physical humiliation performed in order to produce erotic excitement or sexual arousal.
comment: Humillación psicológica o física realizada con el fin de producir excitación erótica o sexual. @es
issued: 2023-12-18
modified: 2025-03-20
type: Concept
in scheme: v3
change note: Version 4.1.0

Erotic hypnosis
preferred label: Hipnosis erótica @es
alternative label: Mind control
alternative label: Control mental @es
comment: The use of hypnosis in a sexual or erotic context.
comment: El uso de la hipnosis en un contexto sexual o erótico. @es
broader: Mind play
related: Power exchange
related: Dollification
related: Dehumanization (Erotic)
has top concept: Eroticism
issued: 2023-12-18
modified: 2025-02-23
type: Concept
in scheme: v3
change note: Version 4.1.0

Mummification (Erotic)
preferred label: Momificación (erótica) @es
comment: A form of bondage that involves wrapping the body with bandages, plastic wrap, or other materials.
comment: Una forma de bondage que consiste en envolver el cuerpo con vendas, plástico u otros materiales. @es
broader: Bondage
related: Restraints
related: Sensory deprivation (Erotic)
has top concept: Eroticism
issued: 2023-12-18
modified: 2025-02-23
type: Concept
in scheme: v3
change note: Version 4.1.0

Body worship
preferred label: Adoración corporal @es
comment: Any practice of revering another’s physical body, usually in a sexual context.
comment: Cualquier práctica de reverenciar el cuerpo físico de otra persona, generalmente en un contexto sexual. @es
broader: Sexual practices
narrower: Muscle worship
related: Gym subculture
has top concept: Sexual practices
issued: 2023-12-18
modified: 2025-02-23
type: Concept
in scheme: v3
change note: Version 4.1.0

Orgasm control
preferred label: Control del orgasmo @es
alternative label: Edging
alternative label: Forced orgasm
alternative label: Orgasm denial
alternative label: Orgasmo forzado @es
comment: The physical or psychological control of one's own or a partner’s orgasm.
comment: El control físico o psicológico del orgasmo propio o de la pareja. @es
broader: BDSM
broader: Sex (Act)
related: Chastity play
has top concept: Eroticism
issued: 2023-12-18
modified: 2025-03-20
type: Concept
in scheme: v3
change note: Version 4.1.0

Chastity play
preferred label: Juego de castidad @es
comment: Refraining from sexual arousal, orgasm, or sex as an act of submission, method of erotic discipline, or for personal satisfaction.
comment: Abstenerse de la excitación sexual, el orgasmo o el sexo como acto de sumisión, método de disciplina erótica o para la satisfacción personal. @es
broader: BDSM
related: Orgasm control
related: Chastity devices
has top concept: Eroticism
issued: 2023-12-18
modified: 2025-02-23
type: Concept
in scheme: v3
change note: Version 4.1.0

Paddling
comment: Striking a body with a paddle as a form of impact play.
broader: Impact play
related: Anal play
related: Spanking paddles
has top concept: Eroticism
issued: 2023-12-18
modified: 2025-02-23
type: Concept
in scheme: v3
change note: Version 4.1.0

Body modification
preferred label: Modificación corporal @es
comment: Modification of the body, such as tattooing, piercing, branding, or cutting.
comment: Modificación del cuerpo como tatuajes, perforaciones, marcas o cortes. @es
narrower: Piercings
narrower: Tattoos
related: Body adornment
related: Corsets
issued: 2023-12-18
modified: 2025-02-23
type: Concept
in scheme: v3
change note: Version 4.1.0

Piercing play
preferred label: Juego de piercing @es
alternative label: Needle play
alternative label: Play piercing
alternative label: Juego con piercings @es
alternative label: Juego de perforación @es
alternative label: Juego con perforaciones @es
comment: Temporary piercing of a body, usually for aesthetic, erotic, or sexual purposes.
comment: Perforación temporal de un cuerpo, generalmente con fines estéticos, eróticos o sexuales. @es
broader: BDSM
broader: Piercings
related: Blood play
has top concept: Eroticism
issued: 2023-12-18
modified: 2025-02-23
type: Concept
in scheme: v3
change note: Version 4.1.0

Blood play
preferred label: Juegos con sangre @es
comment: Use of blood for erotic or sensual pleasure.
comment: Uso de sangre para placer erótico o sensual. @es
broader: BDSM
related: Piercing play
related: Knife play
has top concept: Eroticism
issued: 2023-12-18
modified: 2025-02-23
type: Concept
in scheme: v3
change note: Version 4.1.0

Play spaces
preferred label: Espacios de juego @es
alternative label: Dungeons
alternative label: Calabozos @es
comment: A area or room designated for kink and sexual activities.
comment: Un área o habitación designada para actividades sexuales y kink. @es
broader: Sex locations
related: Dark rooms
related: Gay saunas
related: Sex clubs
related: Leather and kink conventions
has top concept: Sex locations
issued: 2023-12-18
modified: 2025-02-23
type: Concept
in scheme: v3
change note: Version 4.1.0

Leather and kink conventions
preferred label: Convenciones leather y kink @es
comment: Leather and kink conventions typically take place annually at a hotel, resort, or other venue. They usually include parties, performances, title contests, vendors, play spaces, and classes and workshops on kink, sex, relationships, activism, and related topics.
comment: Las convenciones de cuero y kink suelen celebrarse anualmente en un hotel, centro turístico u otro lugar. Suelen incluir fiestas, actuaciones, concursos de títulos, vendedores, espacios de juego y clases y talleres sobre kink, sexo, relaciones, activismo y temas relacionados. @es
broader: Europride
related: Leather community
related: Sex parties
related: Play spaces
related: Title contests
has top concept: Europride
issued: 2023-12-18
modified: 2025-02-23
type: Concept
in scheme: v3
change note: Version 4.1.0

Pony play
preferred label: Juego de pony @es
comment: The act of roleplaying as an equine, sometimes with someone acting as a trainer, handler or pet owner, for fun or erotic enjoyment.
comment: El acto de representar un rol como un equino, a veces con una persona que actúa como entrenadora, cuidadora o dueña de una mascota, por diversión o disfrute erótico. @es
broader: Animal roleplay
has top concept: Sex (Act)
issued: 2023-12-18
modified: 2025-02-23
type: Concept
in scheme: v3
change note: Version 4.1.0

Animal roleplay
alternative label: Pet play
comment: The act of roleplaying as an animal or animal character, sometimes with someone acting as a trainer, handler or pet owner, for fun or erotic enjoyment.
broader: Roleplay
narrower: Pony play
narrower: Pup play
related: BDSM
related: Furries
related: Furry culture
related: Dehumanization (Erotic)
has top concept: Sex (Act)
issued: 2023-12-18
modified: 2025-02-23
type: Concept
in scheme: v3
change note: Version 4.1.0

Pup play
preferred label: Juego de cachorros @es
alternative label: Leatherpups
comment: The act of roleplaying as a canine, sometimes with someone acting as a trainer, handler or pet owner, for fun or erotic enjoyment.
comment: El acto de jugar a un rol como un canino, a veces con una persona que actúa como entrenadora, cuidadora o dueña de una mascota, por diversión o disfrute erótico. @es
broader: Leather community
broader: Animal roleplay
broader: Leather people
related: Pups (Roleplay)
related: Gas masks (Erotic)
related: Masks (Erotic)
has top concept: LGBTQ+ communities
issued: 2023-12-18
modified: 2025-02-23
type: Concept
in scheme: v3
change note: Version 4.1.0

Kinky people
preferred label: Personas kinky @es
alternative label: BDSMers
alternative label: Fetishists
alternative label: Kinksters
alternative label: Sadomasochists
comment: People who participate in kink and/or power exchange relationships.
comment: Personas que participan en relaciones kinki o de intercambio de poder. @es
broader: Sexual identity
broader: Sexual minorities
narrower: LGBTQ+ dominatrices
narrower: LGBTQ+ dominants
narrower: LGBTQ+ submissives
related: Sadomasochism
related: Kink community
related: Bottoms (Sex)
related: BDSM
related: Leather community
related: Tops (Sex)
related: Power exchange
related: Leather people
related: Anti-kink discrimination
has top concept: Sexual identity
issued: 2023-12-18
modified: 2025-02-23
type: Concept
in scheme: v3
change note: Version 4.1.0

Knife play
preferred label: Juego de cuchillos @es
alternative label: Cutting
alternative label: Juego con cuchillos @es
comment: The use of knives or blades during kink or erotic play.
comment: El uso de cuchillos o navajas durante las prácticas kink o en juegos eróticos. @es
broader: BDSM
related: Blood play
has top concept: Eroticism
issued: 2023-12-18
modified: 2025-02-23
type: Concept
in scheme: v3
change note: Version 4.1.0

Leather people
preferred label: Personas leather @es
comment: People who participate in or identify with leather communities.
comment: Personas que participan en comunidades de cuero o se autoidentifican con ellas. @es
broader: Leather community
narrower: Leather daddies
narrower: Leather families
narrower: Leather mommies
narrower: Leathermen
narrower: Leatherwomen
narrower: Pup play
narrower: Leatherboys
narrower: Leathergirls
narrower: Bootblacks
related: Pups (Roleplay)
related: Kinky people
has top concept: LGBTQ+ communities
issued: 2023-12-18
modified: 2025-02-23
type: Concept
in scheme: v3
change note: Version 4.1.0

Leatherboys
preferred label: Chicos leather @es
comment: People who participate in leather communities and identify as leatherboy.
comment: Personas que participan en comunidades de cuero y se autoidentifican como leatherboys. @es
broader: Leather community
broader: Leather people
related: Leather daddies
related: Leather families
related: Leather mommies
related: Leathermen
related: Leatherwomen
related: Leathergirls
has top concept: LGBTQ+ communities
issued: 2023-12-18
modified: 2025-02-23
type: Concept
in scheme: v3
change note: Version 4.1.0

Leathergirls
preferred label: Chicas leather @es
comment: People who participate in leather communities and identify as leathergirls.
comment: Personas que participan en comunidades de cuero y se autoidentifican como leathergirls. @es
broader: Leather community
broader: Leather people
related: Leather daddies
related: Leather families
related: Leather mommies
related: Leathermen
related: Leatherwomen
related: Leatherboys
has top concept: LGBTQ+ communities
issued: 2023-12-18
modified: 2025-02-23
type: Concept
in scheme: v3
change note: Version 4.1.0

Rope bondage
preferred label: Bondage de cuerda @es
alternative label: Japanese rope bondage
alternative label: Kinbaku
alternative label: Shibari
alternative label: Atadura con cuerda @es
comment: Use of rope to tie and restrain the body for sensual or erotic play.
comment: Uso de cuerda para atar y sujetar el cuerpo para juegos sensuales o eróticos. @es
broader: Bondage
related: Restraints
related: Roleplay
has top concept: Eroticism
issued: 2023-12-18
modified: 2025-02-23
type: Concept
in scheme: v3
change note: Version 4.1.0

Gags
preferred label: Mordaza @es
alternative label: Ball gags
alternative label: Ballgags
comment: An item or device used to prevent speech, usually by blocking or filling the mouth. Often used in some forms of bondage play.
comment: Un artículo o dispositivo utilizado para impedir el habla. @es
broader: Kink accessories
related: Bondage
related: Restraints
related: Gas masks (Erotic)
related: Hoods (Erotic)
has top concept: Eroticism
issued: 2023-12-18
modified: 2025-06-03
type: Concept
in scheme: v3
change note: Version 4.1.0

Lateral oppression
preferred label: Opresión lateral @es
alternative label: Lateral violence
comment: The phenomenon in which someone in a marginalized group displaces violence or oppression onto other members of their own group, often by acting on internalized oppressive beliefs (i.e., negative perceptions of and intolerance toward any marginalized identities they hold) adopted as a result of being raised or socialized within an oppressive environment or culture.
comment: El fenómeno a través del cual una persona de un grupo marginado desplaza la violencia u opresión hacia otros miembros de su propio grupo, a menudo, actuando sobre la base de creencias opresivas internalizadas (es decir, percepciones negativas e intolerancia hacia cualquier identidad marginada que tengan), adoptadas como resultado de haber sido criadas o socializadas dentro de un entorno o una cultura opresiva. @es
narrower: Lateral lesbophobia
narrower: Lateral homophobia
narrower: Lateral biphobia
narrower: Lateral transphobia
narrower: Lateral queerphobia
narrower: Lateral intersexphobia
related: Internalized oppression
issued: 2023-12-18
modified: 2025-02-23
type: Concept
in scheme: v3
change note: Version 4.1.0

Lateral lesbophobia
preferred label: Lesbofobia lateral @es
comment: The phenomenon in which lesbians displace violence or oppression onto other lesbians, often by acting on internalized lesbophobic beliefs (i.e., negative perceptions of and intolerance toward lesbians and lesbianism) adopted as a result of being raised or socialized within a lesbophobic environment or culture.
comment: El fenómeno a través del cual las lesbianas desplazan la violencia o la opresión sobre otras lesbianas, a menudo, actuando sobre la base de creencias lesbofóbicas internalizadas (es decir, percepciones negativas e intolerancia hacia las lesbianas y el lesbianismo), adoptadas como resultado de haber sido criadas o socializadas dentro de un entorno o una cultura lesbofóbica. @es
broader: Internalized lesbophobia
broader: Lateral oppression
has top concept: LGBTQ+ phobia
issued: 2023-12-18
modified: 2025-02-23
type: Concept
in scheme: v3
change note: Version 4.1.0

Lateral homophobia
preferred label: Homofobia lateral @es
comment: This term is often used to describe lateral homophobia carried out by LGBTQ+ people in general. Lateral homophobia refers to the phenomenon in which gay men displace violence or oppression onto other gay men, often by acting on internalized homophobic beliefs (i.e., negative perceptions of and intolerance toward gay men and homosexuality) adopted as a result of being raised or socialized within a homophobic environment or culture.
comment: Este término se utiliza a menudo para describir la homofobia lateral llevada a cabo por personas LGBTQ+ en general. La homofobia lateral se refiere al fenómeno a través del cual los hombres gay desplazan la violencia u opresión hacia otros hombres gay, a menudo, actuando sobre la base de creencias homofóbicas internalizadas (es decir, percepciones negativas e intolerancia hacia los hombres gay y la homosexualidad), adoptadas como resultado de haber sido criados o socializados dentro de un ambiente o una cultura homofóbica. @es
broader: Internalized homophobia
broader: Lateral oppression
has top concept: LGBTQ+ phobia
issued: 2023-12-18
modified: 2025-02-23
type: Concept
in scheme: v3
change note: Version 4.1.0

Lateral biphobia
preferred label: Bifobia lateral @es
comment: The phenomenon in which bisexual people displace violence or oppression onto other bisexual people, often by acting on internalized biphobic beliefs (i.e., negative perceptions of and intolerance toward bisexual people and bisexuality) adopted as a result of being raised or socialized within a biphobic environment or culture.
comment: El fenómeno a través del cual las personas bisexuales desplazan la violencia u opresión hacia otras personas bisexuales, a menudo, actuando sobre la base de creencias bifóbicas internalizadas (es decir, percepciones negativas e intolerancia hacia las personas bisexuales y la bisexualidad), adoptadas como resultado de haber sido criadas o socializadas dentro de un entorno o una cultura bifóbica. @es
broader: Internalized biphobia
broader: Lateral oppression
has top concept: LGBTQ+ phobia
issued: 2023-12-18
modified: 2025-02-23
type: Concept
in scheme: v3
change note: Version 4.1.0

Lateral transphobia
preferred label: Transfobia lateral @es
comment: The phenomenon in which transgender people displace violence or oppression onto other transgender people, often by acting on internalized transphobic beliefs (i.e., negative perceptions of and intolerance toward transgender people and trans identities) adopted as a result of being raised or socialized within transphobic environment or culture.
comment: El fenómeno a través del cual las personas transgénero desplazan la violencia u opresión hacia otras personas transgénero, a menudo, actuando sobre la base de creencias transfóbicas internalizadas (es decir, percepciones negativas e intolerancia hacia las personas transgénero y las identidades trans), adoptadas como resultado de haber sido criadas o socializadas en un entorno o una cultura transfóbica. @es
broader: Internalized transphobia
broader: Lateral oppression
has top concept: LGBTQ+ phobia
issued: 2023-12-18
modified: 2025-02-23
type: Concept
in scheme: v3
change note: Version 4.1.0

Lateral queerphobia
preferred label: Queerfobia lateral @es
comment: The phenomenon in which queer people displace violence or oppression onto other queer people, often by acting on internalized queerphobic beliefs (i.e., negative perceptions of and intolerance toward queer people and queer identity) adopted as a result of being raised or socialized within a queerphobic environment or culture.
comment: El fenómeno a través del cual las personas queer desplazan la violencia u opresión hacia otras personas queer, a menudo, actuando sobre la base de creencias queerfóbicas internalizadas (es decir, percepciones negativas e intolerancia hacia las personas queer y la identidad queer), adoptadas como resultado de haber sido criadas o socializadas dentro de un entorno o una cultura queerfóbica. @es
broader: Internalized queerphobia
broader: Lateral oppression
has top concept: LGBTQ+ phobia
issued: 2023-12-18
modified: 2025-02-23
type: Concept
in scheme: v3
change note: Version 4.1.0

Lateral intersexphobia
preferred label: Intersexfobia lateral @es
alternative label: Lateral interphobia
comment: The phenomenon in which intersex people displace violence or oppression onto other intersex people, often by acting on internalized intersexphobic beliefs (i.e., negative perceptions of and intolerance toward intersex people and intersex variations) adopted as a result of being raised or socialized within a intersexphobic environment or culture.
comment: El fenómeno a través del cual las personas intersex desplazan la violencia u opresión hacia otras personas intersex, a menudo, actuando sobre la base de creencias intersexfóbicas internalizadas (es decir, percepciones negativas e intolerancia hacia las personas intersex y variaciones intersex), adoptadas como resultado de haber sido criadas o socializadas dentro de un entorno o una cultura intersexfóbica. @es
broader: Internalized intersexphobia
broader: Lateral oppression
has top concept: LGBTQ+ phobia
issued: 2023-12-18
modified: 2025-02-23
type: Concept
in scheme: v3
change note: Version 4.1.0

Balloon kink
preferred label: Fetish de globos @es
alternative label: Looner
alternative label: Kink de globos @es
comment: The use of balloons for fashion, sexual arousal or erotic play.
comment: El uso de globos para vestir, para la excitación sexual o para el juego erótico. @es
broader: BDSM
related: Rubber and latex community
related: Inflation (Erotic)
has top concept: Eroticism
issued: 2023-12-18
modified: 2025-02-23
type: Concept
in scheme: v3
change note: Version 4.1.0

Inflation (Erotic)
preferred label: Inflación (erotico) @es
alternative label: Inflatables
comment: Inflation of the body, parts of the body, clothing, or inflatable objects with air or other substances for sexual arousal or erotic play.
comment: Inflar el cuerpo, partes del cuerpo, ropa u objetos inflables con aire u otras sustancias para excitación sexual o juegos eróticos. @es
broader: BDSM
related: Sex dolls
related: Rubber and latex fetish
related: Balloon kink
has top concept: Eroticism
issued: 2023-12-18
modified: 2025-02-23
type: Concept
in scheme: v3
change note: Version 4.1.0

Jockstraps
preferred label: Suspensorio @es
alternative label: Suspensores @es
comment: An article of clothing with a pouch to support the genitalia, typically worn by athletes, or for aesthetic or sexual gratification.
comment: Artículo de vestir con una bolsa para sostener los genitales, que suele utilizarse por atletas, o para la gratificación estética o sexual. @es
broader: Sex accessories
broader: LGBTQ+ fashion
related: Kink accessories
has top concept: Sex accessories
issued: 2023-12-18
modified: 2025-02-23
type: Concept
in scheme: v3
change note: Version 4.1.0

Sex-positive feminism
preferred label: Feminismo prosexo @es
alternative label: Sex-positive movement
alternative label: Feminismo pro-sexo @es
alternative label: Feminismo sexo positivo @es
alternative label: Feminismo sexo afirmativo @es
alternative label: Feminismo de positividad sexual @es
comment: A broad feminist movement, usually compared against the anti-sex or anti-pornography feminist movement, that supports sexual liberation, sex workers, pornography, and freedom of sexual and gender expression.
comment: Un movimiento feminista amplio, generalmente contrastado con el movimiento feminista antisexo o antipornografía, que apoya la liberación sexual, a quienes realizan trabajo sexual, la pornografía y la libertad de expresión sexual y de género. @es
broader: Feminism
related: Leather and kink activism
has top concept: Feminism
issued: 2023-12-20
modified: 2025-03-20
type: Concept
in scheme: v3
change note: Version 4.1.0

Shoe fetish
preferred label: Retifismo @es
alternative label: Shoe kink
alternative label: Fetiche de zapatos @es
comment: Eroticization of shoes such as high heels and boots.
comment: Erotización de zapatos, tales como tacones y botas. @es
broader: BDSM
narrower: Boot fetish
narrower: High heel fetish
related: Bootblacking
related: Uniform fetish
related: Foot fetish
has top concept: Eroticism
issued: 2023-12-20
modified: 2025-02-23
type: Concept
in scheme: v3
change note: Version 4.1.0

High heel fetish
preferred label: Fetiche de tacones @es
alternative label: Fetiche de zapatos de tacón @es
alternative label: Fetiche de zapatos de tacón alto @es
alternative label: Altocalcifilia @es
comment: Eroticization of shoes with high heels.
comment: Erotización de los zapatos con tacones altos. @es
broader: Shoe fetish
related: Boot fetish
has top concept: Eroticism
issued: 2023-12-20
modified: 2025-02-23
type: Concept
in scheme: v3
change note: Version 4.1.0

Leather and kink clubs
preferred label: Clubes leather y kink @es
alternative label: Kink clubs
alternative label: SM clubs
alternative label: Clubs leather y kink @es
alternative label: Clubes kink @es
alternative label: Clubs kink @es
comment: Social clubs and other types of membership organizations in the leather, kink, and related communities.
comment: Clubes sociales y otros tipos de organizaciones en comunidades de cuero, kink y afines. @es
broader: LGBTQ+ clubs and organizations
related: Dykes on bikes
related: Leather community
related: LGBTQ+ motorcycle clubs
has top concept: LGBTQ+ clubs and organizations
issued: 2023-12-20
modified: 2025-02-23
type: Concept
in scheme: v3
change note: Version 4.1.0

Bootblacks
preferred label: Lustrabotas @es
alternative label: Limpiabotas @es
comment: In the leather and kink communities, an individual who cleans and conditions someone’s leather boots, shoes or garments.
comment: En las comunidades del cuero y kink, un individuo que limpia y acondiciona las botas, los zapatos o las prendas de cuero de alguien. @es
broader: Leather people
related: Bootblacking
has top concept: LGBTQ+ communities
issued: 2023-12-20
modified: 2025-02-23
type: Concept
in scheme: v3
change note: Version 4.1.0

Title contests
preferred label: Concurso de títulos @es
alternative label: Leather contests
alternative label: Leather pageants
alternative label: Titleholders
alternative label: Competencia de títulos @es
comment: An annual event in leather and kink communities where contestants compete for a title. Contestants are judged on qualities including their stage presence, appearance, charisma, and ability to be a leader and activist in the community for the length of their title year.
comment: Un evento anual en comunidades de leather y kink donde quienes concursan compiten por un título. Se les juzga por cualidades que incluyen su presencia en el escenario, apariencia, carisma y capacidad para ser líder y activista en la comunidad durante el año del título. @es
broader: LGBTQ+ awards
broader: Europride
related: Leather community
related: Leather and kink conventions
has top concept: LGBTQ+ awards
issued: 2023-12-20
modified: 2025-02-23
type: Concept
in scheme: v3
change note: Version 4.1.0

Sex swings
preferred label: Columpios sexuales @es
alternative label: Sex slings
alternative label: Slings
alternative label: Swings
comment: A type of reclining seat suspended from a stand or ceiling, typically used to position the body for sexual activity.
comment: Un tipo de asiento reclinable suspendido de un soporte o del techo, que generalmente se utiliza para posicionar el cuerpo para la actividad sexual. @es
broader: Sex accessories
related: Ass fucking
related: Fisting
related: Fucking
related: Kink accessories
has top concept: Sex accessories
issued: 2023-12-20
modified: 2025-02-23
type: Concept
in scheme: v3
change note: Version 4.1.0

Spitting (Erotic)
preferred label: Escupir (sexo) @es
comment: Expelling spit, usually onto a person’s body or into their mouth.
comment: Expulsar saliva, generalmente sobre el cuerpo de una persona o dentro de su boca. @es
issued: 2023-12-20
modified: 2025-03-20
type: Concept
in scheme: v3
change note: Version 4.1.0

Sounding (Erotic)
preferred label: Sondeo uretral (Sexo) @es
alternative label: Juego uretral @es
comment: Insertion of rods into the urethra, usually for erotic stimulation.
comment: Inserción de varillas en la uretra, generalmente para estimulación erótica. @es
issued: 2023-12-20
modified: 2025-03-20
type: Concept
in scheme: v3
change note: Version 4.1.0

Genital torture
preferred label: Tortura genital @es
alternative label: CBT
alternative label: Cock and ball torture
alternative label: Pussy torture
comment: A kink activity involving application of pain, intense sensation, or constriction to the genitals.
comment: Una actividad kink que implica la aplicación de dolor, sensaciones intensas o la constricción de los genitales. @es
broader: Sadomasochism
related: Genitals
has top concept: Eroticism
issued: 2023-12-20
modified: 2025-03-20
type: Concept
in scheme: v3
change note: Version 4.1.0

Gloves (Erotic)
preferred label: Guantes (erótico) @es
comment: A garment covering the hand and used in kink or erotic play.
comment: Una prenda para vestir que cubre la mano y se utiliza para juegos kinki o eróticos. @es
broader: Sex accessories
broader: LGBTQ+ fashion
narrower: Latex gloves
related: Impact play
has top concept: Sex accessories
issued: 2023-12-20
modified: 2025-02-23
type: Concept
in scheme: v3
change note: Version 4.1.0

Gas masks (Erotic)
preferred label: Máscaras de gas (erótico) @es
comment: A mask traditionally used to protect the wearer from inhaling airborne pollutants and toxic gases and used in kink or erotic play.
comment: Máscara utilizada tradicionalmente para proteger al usuario de la inhalación de contaminantes atmosféricos y gases tóxicos, y usada en juegos eróticos o kink. @es
broader: Sex accessories
broader: LGBTQ+ fashion
broader: Masks (Erotic)
related: Pup play
related: Gags
related: Breath control
related: Hoods (Erotic)
has top concept: Sex accessories
issued: 2023-12-20
modified: 2025-02-23
type: Concept
in scheme: v3
change note: Version 4.1.0

Breath control
preferred label: Control de la respiración @es
alternative label: Breath control play
alternative label: Breath play
alternative label: Breathplay
alternative label: Suffocation
alternative label: Control de respiración @es
alternative label: Juego de respiración @es
alternative label: Juego de control de respiración @es
alternative label: Sofocación @es
comment: Controlling or restricting the ability to breathe in order to achieve heightened pleasure or stimulation.
comment: Controlar o restringir la capacidad de respirar para lograr mayor placer o estimulación. @es
broader: Sexual practices
narrower: Autoerotic asphyxiation
related: Corsets
related: BDSM
related: Gas masks (Erotic)
has top concept: Sexual practices
issued: 2023-12-20
modified: 2025-02-23
type: Concept
in scheme: v3
change note: Version 4.1.0

Squirting
preferred label: Eyaculación femenina @es
alternative label: Cervical mucus
alternative label: Fejac
alternative label: Female ejaculation
alternative label: Gush
alternative label: Squirt
comment: Expulsion of fluid from the urethra during orgasm. Not commonly used for penile ejaculation.
comment: Expulsión de líquido de la uretra durante el orgasmo. No se utiliza comúnmente para la eyaculación del pene. @es
broader: Body fluids
has top concept: Body fluids
issued: 2023-12-20
modified: 2025-03-20
type: Concept
in scheme: v3
change note: Version 4.1.0

Straitjacket
preferred label: Camisa de fuerza @es
alternative label: Strait-jacket
comment: A type of jacket used to restrain the upper body.
comment: Un tipo de chaqueta utilizada para sujetar la parte superior del cuerpo. @es
broader: Restraints
has top concept: Sex accessories
issued: 2023-12-20
modified: 2025-02-23
type: Concept
in scheme: v3
change note: Version 4.1.0

Tickling
preferred label: Cosquilleo @es
alternative label: Knismolagnia
alternative label: Knismophilia
alternative label: Tickle torture
alternative label: Cosquillas @es
comment: Tickling is the act of touching a part of a body in a way that causes involuntary twitching movements and/or laughter.
comment: Cosquillear es el acto de tocar una parte del cuerpo de una manera que provoca movimientos espasmódicos involuntarios y/o risa. @es
broader: BDSM
related: Sadomasochism
has top concept: Eroticism
issued: 2023-12-20
modified: 2025-02-23
type: Concept
in scheme: v3
change note: Version 4.1.0

Cuffs
preferred label: Esposas @es
alternative label: Cuff restraints
alternative label: Marrocas @es
alternative label: Chachas @es
comment: Any of various restraint devices designed to secure an individual’s wrists or ankles in bondage play.
comment: Cualquiera de los diversos dispositivos de sujeción diseñados para asegurar las muñecas o los tobillos de una persona en un juego de bondage. @es
broader: Restraints
broader: LGBTQ+ fashion
narrower: Handcuffs
related: Bondage
related: Hogtie
has top concept: Sex accessories
issued: 2023-12-20
modified: 2025-03-20
type: Concept
in scheme: v3
change note: Version 4.1.0

Chest
preferred label: Pecho @es
alternative label: Tórax @es
comment: A gender-inclusive term for the upper area of the torso, can be used if the person has breasts or not.
comment: Término inclusivo de género para la zona superior del torso; se puede utilizar para personas con o sin senos. @es
broader: Erogenous body parts
related: Binding (Chest)
related: Breast
related: Breast fetish
related: Chest reconstruction surgery
related: Breast play
related: Chest play
has top concept: Erogenous body parts
issued: 2023-12-20
modified: 2025-02-23
type: Concept
in scheme: v3
change note: Version 4.1.0

Caning
preferred label: Golpes con bastón @es
alternative label: Azotes con bastón @es
alternative label: Palmeta @es
alternative label: Palmetazo @es
alternative label: Bastón @es
alternative label: Bastonazo @es
comment: Striking the body with a cane as a form of impact play.
comment: Golpear el cuerpo con un bastón como forma de juego de impacto. @es
broader: Impact play
has top concept: Eroticism
issued: 2023-12-20
modified: 2025-02-23
type: Concept
in scheme: v3
change note: Version 4.1.0

Flogging
preferred label: Flagelación @es
comment: Consensual impact play using a flogger, i.e. a multi-tailed whip, usually made of leather.
comment: Juego de impacto consensuado utilizando un azotador or flagelo, es decir, un látigo de varias colas, generalmente hecho de cuero. @es
broader: Impact play
related: Whipping
has top concept: Eroticism
issued: 2023-12-20
modified: 2025-02-23
type: Concept
in scheme: v3
change note: Version 4.1.0

Feminist sex wars
preferred label: Guerras del Sexo @es
alternative label: Porn wars
alternative label: Sex wars
alternative label: Guerras del porno @es
alternative label: Guerra del sexo @es
comment: A period of debates beginning in the 1970s between different schools and factions of feminist thought concerning sexual freedom, sex work, pornography, kink and sadomasochism, sex toys, butch/femme, and trans identities.
comment: Un período de debates que comenzó en la década de 1970 entre diferentes escuelas y facciones del pensamiento feminista sobre la libertad sexual, el trabajo sexual, la pornografía, el vicio y el sadomasoquismo, los juguetes sexuales, las identidades butch/femme y trans. @es
issued: 2023-12-20
modified: 2025-03-20
type: Concept
in scheme: v3
change note: Version 4.1.0

Foot fetish
preferred label: Fetiche de pies @es
alternative label: Aretifism
alternative label: Foot fetishism
alternative label: Foot kink
alternative label: Foot partialism
alternative label: Podophilia
alternative label: Retifitism
alternative label: Aretifismo @es
alternative label: Fetichismo de pies @es
alternative label: Kink de pies @es
alternative label: Parcialismo de pies @es
alternative label: Podofilia @es
alternative label: Retifismo @es
comment: Eroticization of the feet.
comment: Erotización de los pies. @es
broader: BDSM
related: Bootblacking
related: Shoe fetish
has top concept: Eroticism
issued: 2023-12-20
modified: 2025-02-23
type: Concept
in scheme: v3
change note: Version 4.1.0

Furry culture
preferred label: Cultura furra @es
comment: Use to describe cultural experiences shared by members of furry communities or products of furry culture (e.g., art and media created by and for furries, activism focused on furry issues, slang commonly used in furry communities, etc.).
comment: Utilícese para describir experiencias culturales compartidas por miembros de comunidades furras o productos de la cultura furra (p. ej., arte y medios creados por y para furros, activismo centrado en temas furros, jerga comúnmente utilizada en comunidades furras, etc.). @es
broader: Subcultures
related: Furries
related: Animal roleplay
has top concept: Subcultures
issued: 2023-12-20
modified: 2025-02-23
type: Concept
in scheme: v3
change note: Version 4.1.0

Douching
preferred label: Lavado vaginal @es
alternative label: Ducha vaginal @es
comment: The use of a device (called a douche or enema) to introduce a stream of liquid into either the rectum or vagina. Can be used for sexual or erotic purposes.
comment: El uso de un dispositivo (llamado ducha vaginal o enema) para introducir un chorro de líquido en el recto o la vagina. Puede utilizarse con fines sexuales o eróticos. @es
broader: BDSM
broader: Sex (Act)
broader: Sexual practices
related: Anal sex
related: Ass fucking
related: Anal play
related: Enemas
has top concept: Eroticism
issued: 2023-12-20
modified: 2025-02-23
type: Concept
in scheme: v3
change note: Version 4.1.0

Edge play
preferred label: Control del orgasmo @es
alternative label: Edgeplay
alternative label: Taboo play
alternative label: Juegos de límite @es
comment: BDSM activities and kinks that are considered to have an increased level of risk or taboo, or which are challenging to the participants for subjective reasons, for example due to a personal fear or boundary.
comment: Actividades y kinks del BDSM que se consideran que tienen mayor nivel de riesgo o tabú, o que suponen un desafío para los participantes por razones subjetivas, por ejemplo, debido a un miedo o límite personal. @es
broader: BDSM
related: Roleplay
has top concept: Eroticism
issued: 2023-12-20
modified: 2025-02-23
type: Concept
in scheme: v3
change note: Version 4.1.0

Dollification
alternative label: Rubber dolling
comment: A practice of dressing and acting like a living doll (through makeup, dressing, etc.) for aesthetic or sexual gratification.
related: Crossdressing
related: Gender expression
related: Rubber and latex fetish
related: Erotic hypnosis
related: Dehumanization (Erotic)
issued: 2023-12-20
modified: 2025-02-23
type: Concept
in scheme: v3
change note: Version 4.1.0

Cum shots
preferred label: Corrida @es
alternative label: Cash shots
alternative label: Money shots
alternative label: Money shot @es
alternative label: Cum shot @es
comment: Depictions of ejaculation, especially onto another person and especially in the context of pornography.
comment: La representación de la eyaculación, especialmente sobre otra persona, especialmente en el contexto de la pornografía. @es
issued: 2023-12-20
modified: 2025-03-20
type: Concept
in scheme: v3
change note: Version 4.1.0

Bukkake
preferred label: Bukake @es
comment: A sexual act involving multiple people ejaculating on one person, typically on the face.
comment: Un acto sexual en el que varias personas eyaculan sobre una persona, normalmente en la cara. @es
broader: Group sex
related: Cum
related: Jizz
related: Pornography
has top concept: Sexual practices
issued: 2023-12-20
modified: 2025-03-20
type: Concept
in scheme: v3
change note: Version 4.1.0

Bugchasing
alternative label: Caza del bicho @es
comment: The act or fantasy of engaging in sex with the intent to contract HIV/AIDS.
comment: El acto o la fantasía de tener relaciones sexuales con la intención de contraer VIH/SIDA. @es
broader: Risk behaviors
related: HIV/AIDS
related: Barebacking
related: BDSM
has top concept: Risk behaviors
issued: 2023-12-20
modified: 2025-02-23
type: Concept
in scheme: v3
change note: Version 4.1.0

Breast torture
preferred label: Tortura de senos @es
alternative label: Boob torture
alternative label: Tit torture
alternative label: Tortura de mamas @es
alternative label: Torturas de pechos @es
comment: A kink activity where intense sensation, pain, or constriction is applied to the breasts.
comment: Una actividad kink en la que se aplica sensación, dolor o constricción intensa a los senos. @es
broader: Sadomasochism
broader: Breast play
related: Breast
related: Nipple play
related: Breast fetish
has top concept: Eroticism
issued: 2023-12-20
modified: 2025-02-23
type: Concept
in scheme: v3
change note: Version 4.1.0

Nipple torture
preferred label: Tortura de pezones @es
alternative label: Nip torture
alternative label: Tortura de pezon @es
comment: A kink activity where intense sensation, pain, or constriction is applied to the nipples.
comment: Una actividad kink en la que se aplica una sensación intensa, dolor o constricción en los pezones. @es
broader: Sadomasochism
broader: Nipple play
related: Nipple
related: Breast play
has top concept: Eroticism
issued: 2023-12-20
modified: 2025-02-23
type: Concept
in scheme: v3
change note: Version 4.1.0

Breast play
preferred label: Juego de senos @es
alternative label: Juego con senos @es
comment: Any sexual activity involving the breasts, including fondling/groping, kissing, licking, rubbing, pinching, or squeezing/constricting.
comment: Cualquier actividad sexual que involucre los senos, incluyendo acariciar/manosear, besar, lamer, frotar, pellizcar o apretar/constreñir. @es
broader: Sex (Act)
broader: Sexual practices
narrower: Nipple play
narrower: Breast torture
related: Breast
related: Breast fetish
related: Chest
related: Nipple torture
related: Chest play
has top concept: Sex (Act)
issued: 2023-12-20
modified: 2025-02-23
type: Concept
in scheme: v3
change note: Version 4.1.0

Chest play
preferred label: Juego de pecho @es
comment: A gender-inclusive term for any sexual activity involving the the upper area of the torso, including fondling/groping, kissing, licking, rubbing, pinching, or squeezing/constricting.
comment: Un término inclusivo de género para cualquier actividad sexual que involucre el área superior del torso, incluyendo acariciar/manosear, besar, lamer, frotar, pellizcar o apretar/constreñir. @es
broader: Sex (Act)
broader: Sexual practices
narrower: Nipple play
related: Breast
related: Chest
related: Breast play
has top concept: Sex (Act)
issued: 2023-12-20
modified: 2025-02-23
type: Concept
in scheme: v3
change note: Version 4.1.0

Body bags (Erotic)
preferred label: Bolsas corporales (erotica) @es
comment: A body encasing or bag, often leather, used for sensory deprivation or during kink or sexual play.
comment: Una funda o bolsa para el cuerpo, a menudo de cuero, utilizada para la privación sensorial o durante el juego sexual o kinky. @es
broader: Sex accessories
broader: Kink accessories
related: Bondage
related: Sensory deprivation (Erotic)
has top concept: Sex accessories
issued: 2023-12-20
modified: 2025-02-23
type: Concept
in scheme: v3
change note: Version 4.1.0

Ashing (Erotic)
alternative label: Ash play
comment: Applying cigar or cigarette ash to someone's mouth or body.
issued: 2023-12-20
modified: 2025-03-20
type: Concept
in scheme: v3
change note: Version 4.1.0

Cigar play
preferred label: Juego de cigarros @es
comment: A form of temperature play that involves using cigars, usually applied to the skin.
comment: Una forma de juego de temperatura que implica el uso de cigarros generalmente aplicados sobre la piel. @es
broader: Temperature play
related: Fire play
has top concept: Eroticism
issued: 2023-12-20
modified: 2025-03-20
type: Concept
in scheme: v3
change note: Version 4.1.0

Armpits
alternative label: Axilla
comment: The hollow area underneath the upper arm where the shoulder connects, known to be ticklish and/or sexually stimulative.
broader: Erogenous body parts
has top concept: Erogenous body parts
issued: 2023-12-20
modified: 2025-02-23
type: Concept
in scheme: v3
change note: Version 4.1.0

Abduction play
preferred label: Juego de secuestro @es
alternative label: Consensual kidnapping
alternative label: Secuestro consensuado @es
alternative label: Juego de abducción @es
comment: A type of consensual BDSM play involving the mock capture, bondage, struggle, and intimidation of one or more sexual partners.
comment: Un juego de BDSM consensuado que implica la simulación de la captura, la esclavitud, la lucha y la intimidación de una o más parejas sexuales. @es
broader: BDSM
related: Roleplay
related: Consent play
has top concept: Eroticism
issued: 2023-12-20
modified: 2025-02-23
type: Concept
in scheme: v3
change note: Version 4.1.0

Consent play
preferred label: Juego de consentimiento @es
alternative label: CNC
alternative label: Consensual nonconsent
alternative label: Rape play
comment: A type of consensual play involving mock coercion, intimidation, force, or struggle of one or more partners.
comment: Un tipo de juego consensual que implica la coerción, intimidación, fuerza o lucha simulada de una o más de las personas involucradas en el acto. @es
broader: BDSM
related: Roleplay
related: Power exchange
related: Abduction play
has top concept: Eroticism
issued: 2023-12-20
modified: 2025-02-23
type: Concept
in scheme: v3
change note: Version 4.1.0

Anti-kink discrimination
preferred label: Discriminación anti-kink @es
comment: The unjust or prejudicial treatment of individuals or communities due to their kinks and/or kinky sexual practices; may include adverse legal judgment and/or the denial of legal rights, employment, and housing.
comment: El trato injusto o perjudicial hacia personas o comunidades debido a sus kinks y/o prácticas sexuales kinky; puede incluir sentencias legales adversas y/o la denegación de derechos legales de empleo y vivienda. @es
narrower: Anti-sadomasochism
related: BDSM
related: Leather community
related: Kinky people
related: Gentrification
issued: 2023-12-20
modified: 2025-02-23
type: Concept
in scheme: v3
change note: Version 4.1.0

Anti-sadomasochism
alternative label: Antisadomasochism
comment: Opposition to various practices or fantasies involving sadomasochism or power exchange.
broader: Anti-kink discrimination
related: Sadomasochism
has top concept: Anti-kink discrimination
issued: 2023-12-20
modified: 2025-02-23
type: Concept
in scheme: v3
change note: Version 4.1.0

Chastity devices
preferred label: Aparatos de castidad @es
alternative label: Chastity belt
alternative label: Cock cage
alternative label: Cinturón de castidad @es
alternative label: Dispositivos de castidad @es
alternative label: Jaula de pene @es
alternative label: Jaula de castidad @es
comment: Accessories or devices used to restrict or confine the genitalia.
comment: Accesorios o dispositivos utilizados para restringir o confinar los genitales. @es
broader: Kink accessories
related: Chastity play
has top concept: Eroticism
issued: 2023-12-20
modified: 2025-02-23
type: Concept
in scheme: v3
change note: Version 4.1.0

Clamps (Erotic)
preferred label: Pinzas (Erótico) @es
alternative label: Clamp devices
alternative label: Pinzas @es
comment: A device designed to hold something firmly together or to otherwise fasten down on something (such as the nipples) for the purposes of gratification.
comment: Un dispositivo diseñado para mantener algo firmemente unido o para sujetar algo (como los pezones) con fines de gratificación. @es
broader: Sex accessories
narrower: Nipple clamps
narrower: Clothespins (Erotic)
has top concept: Sex accessories
issued: 2023-12-20
modified: 2025-02-23
type: Concept
in scheme: v3
change note: Version 4.1.0

Clothespins (Erotic)
preferred label: Pinzas para ropa (erótico) @es
alternative label: Clothes pegs
alternative label: Ganchos @es
alternative label: Pinzas @es
comment: A fastener usually used to hang up clothes for drying, here used as a sex toy.
comment: Un sujetador generalmente utilizado para colgar ropa y secarla, utilizado aquí como juguete sexual. @es
broader: Sex accessories
broader: Clamps (Erotic)
has top concept: Sex accessories
issued: 2023-12-20
modified: 2025-02-23
type: Concept
in scheme: v3
change note: Version 4.1.0

Hogtie
preferred label: Atar de manos y pies @es
alternative label: Hogtie restraining
comment: The position or activity of tying a person’s wrists and ankles together behind their back.
comment: La posición o actividad de atar las muñecas y los tobillos de una persona detrás de su espalda. @es
broader: Bondage
related: Restraints
related: Cuffs
has top concept: Eroticism
issued: 2024-01-02
modified: 2025-02-23
type: Concept
in scheme: v3
change note: Version 4.1.0

Hoods (Erotic)
preferred label: Capuchas (erótico) @es
alternative label: Bondage hoods
comment: A hood used as a head covering or restraint, for kink, erotic play or fashion.
comment: Una capucha que se utiliza para cubrir o sujetar la cabeza, para el kink, los juegos eróticos o de moda. @es
broader: Sex accessories
broader: LGBTQ+ fashion
related: Bondage
related: Blindfolds
related: Gags
related: Gas masks (Erotic)
related: Sensory deprivation (Erotic)
has top concept: Sex accessories
issued: 2024-01-02
modified: 2025-02-23
type: Concept
in scheme: v3
change note: Version 4.1.0

Discipline (Erotic)
preferred label: Disciplina @es
comment: A variety of practices where someone in a dominant role sets rules for someone in a submissive role that they are expected to obey and the dominant administers punishments, corrections, or rewards.
comment: Una variedad de prácticas en las que alguien en un rol dominante establece reglas para alguien en un rol sumiso que se espera que obedezca y la persona en el rol dominante administra castigos, correcciones o recompensas. @es
issued: 2024-01-02
modified: 2025-03-20
type: Concept
in scheme: v3
change note: Version 4.1.0

Intersex zines
preferred label: Zines intersex @es
comment: Independent, small-circulation publications usually reproduced via photocopier; use for zines created by intersex people and/or focusing on intersex identity, issues, or culture.
comment: Publicaciones independientes de pequeña tirada generalmente reproducidas mediante fotocopiadora; utilícese para zines creadas por personas intersex y/o centradas en la identidad intersex. @es
broader: LGBTQ+ zines
broader: Intersex press
has top concept: LGBTQ+ press
issued: 2024-01-02
modified: 2025-02-23
type: Concept
in scheme: v3
change note: Version 4.1.0

Transgender zines
preferred label: Zines transgénero @es
alternative label: Trans zines
alternative label: Zines trans @es
comment: Independent, small-circulation publications usually reproduced via photocopier; use for zines created by trans people and/or focusing on trans identities, issues, or culture.
comment: Publicaciones independientes de pequeña tirada generalmente reproducidas mediante fotocopiadora; utilícese para revistas creadas por personas trans y/o centradas en identidades, asuntos o cultura trans. @es
broader: LGBTQ+ zines
broader: Transgender press
has top concept: LGBTQ+ press
issued: 2024-01-02
modified: 2025-02-23
type: Concept
in scheme: v3
change note: Version 4.1.0

Aromantic zines
preferred label: Zines arrománticos @es
comment: Independent, small-circulation publications usually reproduced via photocopier; use for zines created by aromantic people and/or focusing on aromantic identity, issues, or culture.
comment: Publicaciones independientes de pequeña tirada generalmente reproducidas mediante fotocopiadora; utilícese para revistas creadas por personas arrománticas y/o centradas en la identidad arromántica. @es
broader: LGBTQ+ zines
has top concept: LGBTQ+ press
issued: 2024-01-02
modified: 2025-02-23
type: Concept
in scheme: v3
change note: Version 4.1.0

Asexual zines
preferred label: Zines asexuales @es
comment: Independent, small-circulation publications usually reproduced via photocopier; use for zines created by asexual people and/or focusing on asexual identity, issues, or culture.
comment: Publicaciones independientes de tiradas pequeñas generalmente reproducidas mediante fotocopiadora; utilícese para revistas creadas por personas asexuales y/o centradas en la identidad asexual. @es
broader: LGBTQ+ zines
broader: Asexual press
has top concept: LGBTQ+ press
issued: 2024-01-02
modified: 2025-02-23
type: Concept
in scheme: v3
change note: Version 4.1.0

Non-binary zines
alternative label: Nonbinary zines
comment: Independent, small-circulation publications usually reproduced via photocopier; use for zines created by non-binary people and/or focusing on non-binary identities, issues, or culture.
broader: LGBTQ+ zines
has top concept: LGBTQ+ press
issued: 2024-01-02
modified: 2025-02-23
type: Concept
in scheme: v3
change note: Version 4.1.0

Two-Spirit zines
preferred label: Zines dos espíritus @es
alternative label: 2S zines
alternative label: Two Spirit zines
alternative label: Two Spirited zines
alternative label: Two-Spirited zines
comment: Independent, small-circulation publications usually reproduced via photocopier; use for zines created by Two-Spirit people and/or focusing on Two-Spirit identities, issues, or culture.
comment: Publicaciones independientes de tiradas pequeñas generalmente reproducidas mediante fotocopiadora; utilícese para revistas creadas por personas dos espíritus y/o centradas en la identidad dos espíritus. @es
broader: Two-Spirit press
related: LGBTQ+ zines
has top concept: Two-Spirit press
issued: 2024-01-02
modified: 2025-02-23
type: Concept
in scheme: v3
change note: Version 4.1.0

Queer zines
preferred label: Zines queer @es
comment: Independent, small-circulation publications usually reproduced via photocopier; use for zines created by queer people and/or focusing on queer identity, issues, or cultures.
comment: Publicaciones independientes de pequeña tirada generalmente reproducidas mediante fotocopiadora; utilícese para revistas creadas por personas queer y/o que se centren en identidades, cuestiones y culturas queer. @es
broader: LGBTQ+ zines
broader: Queer press
has top concept: LGBTQ+ press
issued: 2024-01-02
modified: 2025-02-23
type: Concept
in scheme: v3
change note: Version 4.1.0

Lesbian zines
preferred label: Zines lésbicos @es
comment: Independent, small-circulation publications usually reproduced via photocopier; use for zines created by lesbians and/or focusing on lesbian identity, issues, or culture.
comment: Publicaciones independientes de pequeña tirada generalmente reproducidas mediante fotocopiadora; utilícese para revistas creadas por lesbianas y/o que se centran en la identidad, los problemas o la cultura lésbica. @es
broader: Lesbian press
broader: LGBTQ+ zines
has top concept: LGBTQ+ press
issued: 2024-01-02
modified: 2025-02-23
type: Concept
in scheme: v3
change note: Version 4.1.0

Gay zines
preferred label: Zines gay @es
comment: Independent, small-circulation publications usually reproduced via photocopier; use for zines created by gay people and/or focusing on gay identity, issues, or culture.
comment: Publicaciones independientes de pequeña tirada generalmente reproducidas mediante fotocopiadora; utilícese para revistas creadas por hombres gay y/o centradas en la identidad gay. @es
broader: Gay press
broader: LGBTQ+ zines
has top concept: LGBTQ+ press
issued: 2024-01-02
modified: 2025-02-23
type: Concept
in scheme: v3
change note: Version 4.1.0

Trans-exclusionary radical feminists
preferred label: Feministas radicales trans-excluyentes @es
alternative label: Gender critical feminists
alternative label: TERFs
alternative label: Trans-exclusionary feminist
alternative label: Terfas @es
alternative label: Feministas críticas de género @es
alternative label: Feministas trans-excluyentes @es
comment: A person who subscribes to a transphobic and transantagonistic ideology that rejects trans and gender diverse identities and rights, and believes that recognition of these identities and rights constitutes discrimination and oppression towards cisgender women. Though originally considered a fringe offshoot of feminism, trans-exclusionary radical feminist groups have formed alliances with right-wing, far-right extremists, and anti-feminist organizations in order to spread misinformation and further anti-trans sentiment and legislation. Use when resources are about trans-exclusionary radical feminists or when an individual identifies as such.
comment: Una persona que se suscribe a una ideología transfóbica y transantagonista que rechaza las identidades y los derechos trans y de género diverso, y cree que el reconocimiento de estas identidades y estos derechos constituye discriminación y opresión hacia las mujeres cisgénero. Aunque originalmente se les consideró una rama marginal del feminismo, los grupos feministas radicales trans-excluyentes han formado alianzas con organizaciones antifeministas, de derecha y de extrema derecha para difundir información errónea y promover el sentimiento y la legislación anti-trans. Utilícese cuando los recursos traten sobre feministas radicales trans-excluyentes o cuando una persona se identifique como tal. @es
related: Feminism
related: Trans-exclusionary radical feminism
issued: 2024-01-02
modified: 2025-02-23
type: Concept
in scheme: v3
change note: Version 4.1.0

Trans-exclusionary radical feminism
preferred label: Feminismo radical trans-excluyente @es
alternative label: Gender critical feminism
alternative label: TERF ideology
alternative label: Trans-exclusionary feminism
alternative label: Ideología TERF @es
alternative label: Femismo trans-excluyente @es
alternative label: Feminismo crítico de género @es
comment: A transphobic and transantagonistic ideology that rejects trans and gender diverse identities and rights, and believes that recognition of these identities and rights constitutes discrimination and oppression towards cisgender women. Though originally considered a fringe offshoot of feminism, trans-exclusionary radical feminist groups have formed alliances with right-wing, far-right extremists, and anti-feminist organizations in order to spread misinformation and further anti-trans sentiment and legislation.
comment: Una ideología transfóbica y transantagonista que rechaza las identidades y los derechos trans y de género diverso, y cree que el reconocimiento de estas identidades y estos derechos constituye discriminación y opresión hacia las mujeres cisgénero. Aunque originalmente se les consideró una rama marginal del feminismo, los grupos feministas radicales trans-excluyente han formado alianzas con organizaciones antifeministas, de derecha y de extrema derecha para difundir información errónea y promover el sentimiento y la legislación anti-trans. @es
broader: Essentialism
broader: Genderism
broader: Transphobia
broader: Transmisogyny
related: Anti-transgender discrimination
related: Feminism
related: Second-wave feminism
related: Anti-Two-Spirit discrimination
related: Trans-exclusionary radical feminists
related: Anti-gender movement
has top concept: Theories
issued: 2024-01-02
modified: 2025-02-23
type: Concept
in scheme: v3
change note: Version 4.1.0

LGBTQ+ country music
preferred label: Música country LGBTQ+ @es
alternative label: Música campirana LGBTQ+ @es
comment: Music expressing a LGBTQ+ sensibility, produced within the larger country genre since the 1930s.
comment: Música que expresa una sensibilidad LGBTQ+, producida dentro del género musical del más amplio del country desde la década de 1930. @es
broader: LGBTQ+ music
has top concept: Subcultures
issued: 2024-01-09
modified: 2025-02-23
type: Concept
in scheme: v3
change note: Version 4.1.0

Drag in film
preferred label: Drag en filmes @es
alternative label: Drag in cinema
alternative label: Drag in movies
alternative label: Drag en el cine @es
alternative label: Drag en películas @es
comment: Films with significant characters who appear in drag. Not to be confused with films where a principal actor plays a character who identifies as a gender other than what the actor identifies as.
comment: Películas con personajes significativos que aparecen en drag. No debe confundirse con películas en las que un actor principal interpreta a un personaje que se identifica con un género distinto al género con el cual se identifica el actor. @es
broader: Drag
broader: LGBTQ+ cinema
related: LGBTQ+ characters
related: Crossdressing
has top concept: Gender
issued: 2024-01-09
modified: 2025-02-23
type: Concept
in scheme: v3
change note: Version 4.1.0

Gay musicals
preferred label: Museos gay @es
alternative label: Homosexual musicals
comment: Musicals created by gay directors, depicting gay men, or that are regarded as important within gay culture.
comment: Instituciones dedicadas al almacenamiento, la exhibición, la conservación y la preservación de materiales relacionados con hombres gay o la historia gay. @es
broader: LGBTQ+ musicals
has top concept: Subcultures
issued: 2024-01-09
modified: 2025-02-23
type: Concept
in scheme: v3
change note: Version 4.1.0

Bisexual musicals
comment: Musicals created by bisexual directors, depicting bisexual individuals, or that are regarded as important within bisexual culture.
broader: LGBTQ+ musicals
has top concept: Subcultures
issued: 2024-01-09
modified: 2025-02-23
type: Concept
in scheme: v3
change note: Version 4.1.0

Transgender musicals
preferred label: Musicales transgénero @es
comment: Musicals created by transgender directors, depicting transgender individuals, or that are regarded as important within transgender culture.
comment: Musicales creados por directores transgénero, que representan a personas transgénero o personas consideradas importantes dentro de la cultura transgénero. @es
broader: LGBTQ+ musicals
has top concept: Subcultures
issued: 2024-01-09
modified: 2025-02-23
type: Concept
in scheme: v3
change note: Version 4.1.0

Asexual musicals
preferred label: Musicales asexuales @es
comment: Musicals created by asexual directors, depicting asexual individuals, or that are regarded as important within asexual culture.
comment: Musicales creados por directores asexuales que representan a personas asexuales. @es
broader: LGBTQ+ musicals
has top concept: Subcultures
issued: 2024-01-09
modified: 2025-02-23
type: Concept
in scheme: v3
change note: Version 4.1.0

Intersex musicals
preferred label: Musicales intersex @es
comment: Musicals created by intersex directors, depicting intersex individuals, or that are regarded as important within intersex culture.
comment: Musicales por directores intersex, presentando a personas intersex, o personas consideradas importantes dentro de la cultura intersex @es
broader: LGBTQ+ musicals
has top concept: Subcultures
issued: 2024-01-09
modified: 2025-02-23
type: Concept
in scheme: v3
change note: Version 4.1.0

Lesbian operas
preferred label: Óperas lésbicos @es
comment: Operas created by lesbian directors, depicting lesbian individuals, or that are regarded as important within lesbian culture.
comment: Óperas creadas por directoras lesbianas, que representan a personas lesbianas, o a personas consideradas importantes dentro de la cultura lésbica. @es
broader: LGBTQ+ operas
related: Women's music
has top concept: Subcultures
issued: 2024-01-09
modified: 2025-02-23
type: Concept
in scheme: v3
change note: Version 4.1.0

Queer operas
preferred label: Óperas queer @es
comment: Operas created by queer directors, depicting queer individuals, or that are regarded as important within queer culture.
comment: Óperas creadas por directores queer, que representan a personas queer, o personas consideradas importantes dentro de la cultura queer. @es
broader: LGBTQ+ operas
related: Two-Spirit operas
has top concept: Subcultures
issued: 2024-01-09
modified: 2025-02-23
type: Concept
in scheme: v3
change note: Version 4.1.0

Two-Spirit operas
preferred label: Óperas dos espíritus @es
alternative label: 2S operas
alternative label: Two Spirit operas
alternative label: Two Spirited operas
alternative label: Two-Spirited operas
comment: Operas created by Two-Spirit directors, depicting Two-Spirit individuals, or that are regarded as important within Two-Spirit culture.
comment: Óperas creadas por directores dos espíritus, que representan a personas dos espíritus, o que se consideran importantes dentro de la cultura dos espíritus. @es
related: LGBTQ+ operas
related: Transgender operas
related: Intersex operas
related: Queer operas
issued: 2024-01-09
modified: 2025-02-23
type: Concept
in scheme: v3
change note: Version 4.1.0

Lesbian feminists
preferred label: Feministas lesbianas @es
alternative label: Lesbianas feministas @es
comment: A person who subscribes to lesbian feminism, an ideology that encourages women to focus their efforts, activities, and relationships toward other women rather than men, often advocating for lesbianism as the logical result of feminism. Use when resources are about lesbian feminists or when an individual identifies as such.
comment: Persona que se suscribe el feminismo lésbico, una ideología que anima a las mujeres a centrar sus esfuerzos, actividades y relaciones en otras mujeres en lugar de en los hombres, a menudo, defendiendo el lesbianismo como el resultado lógico del feminismo. Utilícese cuando los recursos sean sobre feministas lesbianas o cuando una persona se identifique como tal. @es
broader: Feminists
related: Lesbian feminism
related: Lesbian movement
has top concept: Feminists
issued: 2024-01-11
modified: 2025-02-23
type: Concept
in scheme: v3
change note: Version 4.1.0

Black feminists
preferred label: Feministas negras @es
alternative label: Afro feminists
alternative label: Afro-feminists
alternative label: Afro feministas @es
alternative label: Afro-feministas @es
comment: A person who subscribes to a form of feminism that developed in response to the failures of mainstream feminist and civil rights efforts to acknowledge the ways white supremacy and the patriarchy interact to inform the particular experiences of Black women. Use when resources are about Black feminists or when an individual identifies as such.
comment: Una persona que se suscribe a una forma de feminismo que se desarrolló en respuesta a los fracasos de los esfuerzos feministas y de derechos civiles dominantes para reconocer las formas en que la supremacía blanca y el patriarcado interactúan para informar las experiencias particulares de las mujeres negras. Utilícese cuando los recursos sean sobre feministas negras o cuando una persona se autoidentifique como tal. @es
broader: Feminists
related: Black feminism
related: Womanists
has top concept: Feminists
issued: 2024-01-11
modified: 2025-02-23
type: Concept
in scheme: v3
change note: Version 4.1.0

Eco-feminists
preferred label: Ecofeministas @es
alternative label: Ecofeminsts
alternative label: Eco-feministas @es
comment: A person who subscribes to the political and philosophical movement that views feminism and concerns for the environment as inherently related. Use when resources are about eco-feminists or when an individual identifies as such.
comment: Una persona que se posiciona bajo el movimiento político y filosófico que entiende el feminismo y las preocupaciones por el medio ambiente como intrínsecamente relacionados. Utilícese cuando los recursos son sobre ecofeministas o cuando una persona se identifique como tal. @es
broader: Feminists
related: Ecofeminism
has top concept: Feminists
issued: 2024-01-11
modified: 2025-02-23
type: Concept
in scheme: v3
change note: Version 4.1.0

First-wave feminists
preferred label: Feministas la de primera ola @es
alternative label: First wave feminists
alternative label: Feministas de la primera ola @es
comment: A person who was part of a period of women's rights activism in the 19th and early 20th centuries that was primarily focused on legal rights such as women's right to vote. Use when resources are about first-wave feminists.
comment: Persona que formó parte de un período de activismo por los derechos de las mujeres en el siglo XIX y principios del XX que se centró principalmente en derechos legales como el derecho de las mujeres al voto. Utilícese cuando los recursos sean sobre feministas de la primera ola. @es
broader: Feminists
related: First-wave feminism
has top concept: Feminists
issued: 2024-01-11
modified: 2025-02-23
type: Concept
in scheme: v3
change note: Version 4.1.0

Second-wave feminists
preferred label: Feministas de segunda ola @es
alternative label: Second wave feminists
comment: A person who was part of or subscribes to beliefs developed during a period of feminist political activity (also referred to as women’s liberation) beginning in the early 1960s that critiqued male-dominated institutions and cultural practices in society. Use when resources are about second-wave feminists or when an individual identifies as such.
comment: Una persona que formó parte o se suscribe a creencias desarrolladas durante un período de actividad política feminista (también conocido como liberación de la mujer) que comenzó a principios de la década de 1960 y que criticaba las instituciones y prácticas culturales dominadas por los hombres en la sociedad. Utilícese cuando los recursos sean sobre feministas de segunda ola o cuando una persona se identifique como tal. @es
broader: Feminists
related: Second-wave feminism
has top concept: Feminists
issued: 2024-01-11
modified: 2025-02-23
type: Concept
in scheme: v3
change note: Version 4.1.0

Third-wave feminists
preferred label: Feministas de la tercera ola @es
alternative label: Third wave feminists
comment: A person who was part of or subscribes to beliefs developed during a period of feminist political activity beginning in the early 1990s that embraced diversity and individualism in women and sought to redefine what it meant to be a feminist. The third-wave is characterized by the emergence of new feminist movements and theories such as intersectionality, sex positivity, ecofeminism, transfeminism, and postmodern feminism. Use when resources are about third-wave feminists or when an individual identifies as such.
comment: Una persona que formaba parte de o se suscribía a creencias desarrolladas durante un período de actividad política feminista que comenzó a principios de la década de 1990 y que abrazó la diversidad y el individualismo de las mujeres y buscó redefinir lo que significaba ser feminista. La tercera ola se caracteriza por el surgimiento de nuevos movimientos y teorías feministas como la interseccionalidad, la positividad sexual, el ecofeminismo, el transfeminismo y el feminismo posmoderno. Utilícese cuando los recursos sean sobre feministas de la tercera ola o cuando una persona se identifique como tal. @es
broader: Feminists
related: Third-wave feminism
has top concept: Feminists
issued: 2024-01-11
modified: 2025-02-23
type: Concept
in scheme: v3
change note: Version 4.1.0

Transfeminists
preferred label: Transfeministas @es
comment: A person who is part of or subscribes to beliefs developed as part of a movement by and for trans women who view the liberation of trans women as essential to the liberation of all women. Use when resources are about transfeminists or when an individual identifies as such.
comment: Una persona que forma parte de o se suscribe a creencias desarrolladas como parte de un movimiento por y para las mujeres trans, que ven la liberación de las mujeres trans como esencial para la liberación de todas las mujeres. Utilícese cuando los recursos sean sobre transfeministas o cuando una persona se identifique como tal. @es
issued: 2024-01-11
modified: 2025-02-28
type: Concept
in scheme: v3
change note: Version 4.1.0

Womanists
preferred label: Mujeristas @es
comment: A person who subscribes to womanism, an ideology that grew out of the perceived indifference of the feminist movement towards the needs of Black women, who are often excluded from the categories of "female" and "femininity" as understood by white feminists. At the core of womanism is the idea that mainstream feminism is a movement led by white women to serve white women's goals, which can be indifferent or even oppositional to the needs of Black women. Use for resources about womanists or when an individual identifies as such.
comment: Una persona que se suscribe el mujerismo, una ideología que surgió de la indiferencia percibida del movimiento feminista hacia las necesidades de las mujeres negras, que a menudo son excluidas de las categorías de "femenino" y "feminidad" tal como las entienden las feministas blancas. Al centro del mujerismo está la idea de que el feminismo dominante es un movimiento liderado por mujeres blancas para servir a los objetivos de las mujeres blancas, que pueden ser indiferentes o incluso opuestos a las necesidades de las mujeres negras. Utilícese para recursos sobre mujeristas o cuando una persona se identifica como tal. @es
related: Womanism
related: Black feminists
issued: 2024-01-11
modified: 2025-02-23
type: Concept
in scheme: v3
change note: Version 4.1.0

Radical feminists
preferred label: Feministas radicales @es
comment: A person who subscribes to a perspective within feminism that calls for a radical reordering of society in which male supremacy is eliminated in all social and economic contexts. Distinct from and not to be confused with trans-exclusionary radical feminists. Use for resources about radical feminists or for individuals who identify as such, unless trans-exclusionary radical feminists is a more appropriate term.
comment: Una persona que se suscribe a una perspectiva dentro del feminismo que exige un reordenamiento radical de la sociedad en el que se elimine la supremacía masculina en todos los contextos sociales y económicos. Es distinto a y no debe confundirse con feministas radicales transexcluyentes. Utilícese para recursos sobre feministas radicales o para personas que se autoidentifican como tales, a menos que "feministas radicales transexcluyentes" sea un término más apropiado. @es
broader: Feminists
narrower: SWERFs
related: Radical feminism
has top concept: Feminists
issued: 2024-01-11
modified: 2025-02-23
type: Concept
in scheme: v3
change note: Version 4.1.0

Masks (Erotic)
preferred label: Máscaras (erótica) @es
comment: Masks worn as a fetish fashion accessory or for sensual or sexual play.
comment: Máscaras utilizadas como accesorio de moda fetiche o para juegos sensuales o sexuales. @es
broader: Sex accessories
broader: LGBTQ+ fashion
narrower: Gas masks (Erotic)
related: Pup play
has top concept: Sex accessories
issued: 2024-01-17
modified: 2025-02-23
type: Concept
in scheme: v3
change note: Version 4.1.0

LGBTQ+ urban fantasy fiction
preferred label: Ficción fantástica urbana LGBTQ+ @es
comment: A subgenre of fantasy fiction featuring magic and supernatural creatures in contemporary urban settings; use for urban fantasy focusing on LGBTQ+ characters or themes.
comment: Un subgénero de la ficción fantástica que presenta a criaturas mágicas y sobrenaturales en entornos urbanos contemporáneos; utilícese para la ficción fantástica urbana centrada en personajes o temas LGBTQ+. @es
broader: LGBTQ+ fantasy fiction
narrower: Gay urban fantasy fiction
narrower: Lesbian urban fantasy fiction
narrower: Bisexual urban fantasy fiction
narrower: Queer urban fantasy fiction
narrower: Transgender urban fantasy fiction
narrower: Asexual urban fantasy fiction
narrower: Aromantic urban fantasy fiction
narrower: Megasexual urban fantasy fiction
narrower: Demisexual urban fantasy fiction
narrower: Intersex urban fantasy fiction
narrower: Non-binary urban fantasy fiction
narrower: Greyromantic urban fantasy fiction
related: Two-Spirit urban fantasy fiction
has top concept: Subcultures
issued: 2024-01-17
modified: 2025-02-23
type: Concept
in scheme: v3
change note: Version 4.1.0

Gay urban fantasy fiction
preferred label: Ficción fantástica urbana gay @es
comment: A subgenre of fantasy fiction featuring magic and supernatural creatures in contemporary urban settings; use for urban fantasy focusing on gay male characters or themes.
comment: Un subgénero de ficción fantástica que presenta a criaturas mágicas y sobrenaturales en entornos urbanos contemporáneos; utilícese para la fantasía urbana centrada en temas o personajes masculinos gay. @es
broader: LGBTQ+ urban fantasy fiction
has top concept: Subcultures
issued: 2024-01-18
modified: 2025-02-23
type: Concept
in scheme: v3
change note: Version 4.1.0

Lesbian urban fantasy fiction
preferred label: Ficción fantástica urbana lésbica @es
comment: A subgenre of fantasy fiction featuring magic and supernatural creatures in contemporary urban settings; use for urban fantasy focusing on lesbian characters or themes.
comment: Un subgénero de la ficción fantástica que presenta criaturas mágicas y sobrenaturales en entornos urbanos contemporáneos; utilícese para la fantasía urbana centrada en personajes o temas lésbicos. @es
broader: LGBTQ+ urban fantasy fiction
has top concept: Subcultures
issued: 2024-01-18
modified: 2025-02-23
type: Concept
in scheme: v3
change note: Version 4.1.0

Bisexual urban fantasy fiction
preferred label: Ficción fantástica urbana bisexual @es
comment: A subgenre of fantasy fiction featuring magic and supernatural creatures in contemporary urban settings; use for urban fantasy focusing on bisexual characters or themes.
comment: Un subgénero de la ficción fantástica que presenta criaturas mágicas y sobrenaturales en entornos urbanos contemporáneos; utilícese para la fantasía urbana centrada en personajes o temas bisexuales. @es
broader: LGBTQ+ urban fantasy fiction
has top concept: Subcultures
issued: 2024-01-18
modified: 2025-02-23
type: Concept
in scheme: v3
change note: Version 4.1.0

Queer urban fantasy fiction
preferred label: Ficción fantástica urbana queer @es
comment: A subgenre of fantasy fiction featuring magic and supernatural creatures in contemporary urban settings; use for urban fantasy focusing on queer characters or themes.
comment: Un subgénero de la ficción fantástica que presenta criaturas mágicas y sobrenaturales en entornos urbanos contemporáneos; utilícese para la ficción fantástica urbana centrada en personajes o temas queer. @es
broader: LGBTQ+ urban fantasy fiction
has top concept: Subcultures
issued: 2024-01-18
modified: 2025-02-23
type: Concept
in scheme: v3
change note: Version 4.1.0

Transgender urban fantasy fiction
preferred label: Ficción fantástica urbana transgénero @es
comment: A subgenre of fantasy fiction featuring magic and supernatural creatures in contemporary urban settings; use for urban fantasy focusing on transgender characters or themes.
comment: Un subgénero de la ficción fantástica que presenta criaturas mágicas y sobrenaturales en entornos urbanos contemporáneos; utilícese para la ficción fantástica urbana centrada en personajes o temas transgénero. @es
broader: LGBTQ+ urban fantasy fiction
has top concept: Subcultures
issued: 2024-01-18
modified: 2025-02-23
type: Concept
in scheme: v3
change note: Version 4.1.0

Asexual urban fantasy fiction
preferred label: Ficción fantástica urbana asexual @es
comment: A subgenre of fantasy fiction featuring magic and supernatural creatures in contemporary urban settings; use for urban fantasy focusing on asexual characters or themes.
comment: Un subgénero de la ficción fantástica que presenta a criaturas mágicas y sobrenaturales en entornos urbanos contemporáneos; utilícese para la fantasía urbana centrada en personajes o temas asexuales. @es
broader: LGBTQ+ urban fantasy fiction
has top concept: Subcultures
issued: 2024-01-18
modified: 2025-02-23
type: Concept
in scheme: v3
change note: Version 4.1.0

Aromantic urban fantasy fiction
preferred label: Ficción fantástica urbana arromántica @es
comment: A subgenre of fantasy fiction featuring magic and supernatural creatures in contemporary urban settings; use for urban fantasy focusing on aromantic characters or themes.
comment: Un subgénero de la ficción fantástica que presenta criaturas mágicas y sobrenaturales en entornos urbanos contemporáneos; utilícese para fantasía urbana centrada en personajes o temas arománticos. @es
broader: LGBTQ+ urban fantasy fiction
has top concept: Subcultures
issued: 2024-01-18
modified: 2025-02-23
type: Concept
in scheme: v3
change note: Version 4.1.0

Megasexual urban fantasy fiction
preferred label: Ficción fantástica urbana megasexual @es
comment: A subgenre of fantasy fiction featuring magic and supernatural creatures in contemporary urban settings; use for urban fantasy focusing on megasexual characters or themes.
comment: Un subgénero de la ficción fantástica que presenta criaturas mágicas y sobrenaturales en entornos urbanos contemporáneos; utilícese para la ficción fantasía urbana centrada en personajes o temas megasexuales. @es
broader: LGBTQ+ urban fantasy fiction
has top concept: Subcultures
issued: 2024-01-18
modified: 2025-02-23
type: Concept
in scheme: v3
change note: Version 4.1.0

Two-Spirit urban fantasy fiction
preferred label: Ficción fantástica urbana dos espiritus @es
preferred label: 2S urban fantasy fiction
preferred label: Two Spirit urban fantasy fiction
preferred label: Two Spirited urban fantasy fiction
preferred label: Two-Spirited urban fantasy fiction
comment: A subgenre of fantasy fiction featuring magic and supernatural creatures in contemporary urban settings; use for urban fantasy focusing on Two-Spirit characters or themes.
comment: Un subgénero de la ficción fantástica que presenta a criaturas mágicas y sobrenaturales en entornos urbanos contemporáneos; utilícese para la fantasía urbana centrada en personajes o temas dos espíritus. @es
related: LGBTQ+ urban fantasy fiction
issued: 2024-01-18
modified: 2025-10-03
type: Concept
in scheme: v3
change note: Version 4.1.0

Demisexual urban fantasy fiction
preferred label: Ficción fantástica urbana demisexual @es
comment: A subgenre of fantasy fiction featuring magic and supernatural creatures in contemporary urban settings; use for urban fantasy focusing on demisexual characters or themes.
comment: Un subgénero de la ficción fantástica que presenta criaturas mágicas y sobrenaturales en entornos urbanos contemporáneos. Utilícese para fantasía urbana centrada en personajes o temas demisexuales. @es
broader: LGBTQ+ urban fantasy fiction
has top concept: Subcultures
issued: 2024-01-18
modified: 2025-02-23
type: Concept
in scheme: v3
change note: Version 4.1.0

Intersex urban fantasy fiction
preferred label: Ficción fantástica urbana intersex @es
comment: A subgenre of fantasy fiction featuring magic and supernatural creatures in contemporary urban settings; use for urban fantasy focusing on intersex characters or themes.
comment: Un subgénero de la ficción fantástica que presenta criaturas mágicas y sobrenaturales en entornos urbanos contemporáneos; utilícese para la fantasía urbana centrada en personajes o temas intersex. @es
broader: LGBTQ+ urban fantasy fiction
has top concept: Subcultures
issued: 2024-01-18
modified: 2025-02-23
type: Concept
in scheme: v3
change note: Version 4.1.0

Non-binary urban fantasy fiction
preferred label: Ficción fantástica urbana no binaria @es
preferred label: Nonbinary urban fantasy fiction
alternative label: Ficción de fantasía urbana no binaria @es
alternative label: Ficción no binaria de fantasía urbana @es
comment: A subgenre of fantasy fiction featuring magic and supernatural creatures in contemporary urban settings; use for urban fantasy focusing on non-binary characters or themes.
comment: Un subgénero de la ficción fantástica que presenta criaturas mágicas y sobrenaturales en entornos urbanos contemporáneos; utilícese para la ficción fantástica urbana centrada en personajes o temas no binarios. @es
broader: LGBTQ+ urban fantasy fiction
has top concept: Subcultures
issued: 2024-01-18
modified: 2025-10-31
type: Concept
in scheme: v3
change note: Version 4.1.0

Greyromantic urban fantasy fiction
preferred label: Ficción fantástica urbana grisromántica @es
comment: A subgenre of fantasy fiction featuring magic and supernatural creatures in contemporary urban settings; use for urban fantasy focusing on greyromantic characters or themes.
comment: Un subgénero de la ficción fantástica que presenta criaturas mágicas y sobrenaturales en entornos urbanos contemporáneos; utilícese para la fantasía urbana centrada en personajes o temas grisrománticos. @es
broader: LGBTQ+ urban fantasy fiction
has top concept: Subcultures
issued: 2024-01-18
modified: 2025-02-23
type: Concept
in scheme: v3
change note: Version 4.1.0

Queer joy
preferred label: Alegría queer @es
comment: A positive feeling connected to queer community, activism, and/or culture that counters the impact of living in a discriminatory society. Note that queer is used as an umbrella term for the LGBTQ+ community within this phrase.
comment: Un sentimiento positivo conectado con la comunidad, el activismo y/o la cultura queer que contrarresta el impacto de vivir en una sociedad discriminatoria. Tenga en cuenta que queer se utiliza como término general para la comunidad LGBTQ+ dentro de esta frase. @es
related: Queer community
related: Gender euphoria
related: Trans joy
issued: 2024-01-18
modified: 2025-02-23
type: Concept
in scheme: v3
change note: Version 4.1.0

Lesbian dominants
preferred label: Lesbianas dominantes @es
alternative label: Lesbian masters
alternative label: Amas lesbianas @es
comment: Lesbians who are part of the BDSM scene and assume the dominant role in sexual relationships with a dominant/submissive dynamic.
comment: Lesbianas que forman parte de la escena BDSM y asumen el rol dominante en las relaciones sexuales con una dinámica dominante/sumisa. @es
broader: LGBTQ+ dominants
has top concept: Sexual identity
issued: 2024-02-01
modified: 2025-02-23
type: Concept
in scheme: v3
change note: Version 4.1.0

LGBTQ+ solidarity
alternative label: Solidarity (LGBTQ+)
comment: A sense of fellowship and overall unity of purpose, political interest, and/or community sympathies based on shared experiences as LGBTQ+ people.
narrower: Lesbian solidarity
narrower: Gay solidarity
narrower: Bisexual solidarity
narrower: Transgender solidarity
narrower: Queer solidarity
narrower: Intersex solidarity
narrower: Asexual solidarity
narrower: Aromantic solidarity
narrower: Demisexual solidarity
narrower: Greyromantic solidarity
narrower: Dyke solidarity
narrower: Megasexual solidarity
narrower: Non-binary solidarity
related: LGBTQ+ activism
related: Allies
related: Two-Spirit solidarity
issued: 2024-04-16
modified: 2025-02-23
type: Concept
in scheme: v3
change note: Version 4.1.0

Lesbian solidarity
comment: A sense of fellowship and overall unity of purpose, political interest, and/or community sympathies based on shared experiences as lesbians.
broader: LGBTQ+ solidarity
has top concept: LGBTQ+ solidarity
issued: 2024-04-16
modified: 2025-02-23
type: Concept
in scheme: v3
change note: Version 4.1.0

Gay solidarity
comment: A sense of fellowship and overall unity of purpose, political interest, and/or community sympathies based on shared experiences as gay men.
broader: LGBTQ+ solidarity
has top concept: LGBTQ+ solidarity
issued: 2024-04-16
modified: 2025-02-23
type: Concept
in scheme: v3
change note: Version 4.1.0

Bisexual solidarity
comment: A sense of fellowship and overall unity of purpose, political interest, and/or community sympathies based on shared experiences as bisexual people.
broader: LGBTQ+ solidarity
has top concept: LGBTQ+ solidarity
issued: 2024-04-16
modified: 2025-02-23
type: Concept
in scheme: v3
change note: Version 4.1.0

Transgender solidarity
alternative label: Trans solidarity
comment: A sense of fellowship and overall unity of purpose, political interest, and/or community sympathies based on shared experiences as transgender people.
broader: LGBTQ+ solidarity
has top concept: LGBTQ+ solidarity
issued: 2024-04-16
modified: 2025-02-23
type: Concept
in scheme: v3
change note: Version 4.1.0

Queer solidarity
comment: A sense of fellowship and overall unity of purpose, political interest, and/or community sympathies based on shared experiences as queer people.
broader: LGBTQ+ solidarity
has top concept: LGBTQ+ solidarity
issued: 2024-04-16
modified: 2025-02-23
type: Concept
in scheme: v3
change note: Version 4.1.0

Intersex solidarity
comment: A sense of fellowship and overall unity of purpose, political interest, and/or community sympathies based on shared experiences as intersex people.
broader: LGBTQ+ solidarity
has top concept: LGBTQ+ solidarity
issued: 2024-04-16
modified: 2025-02-23
type: Concept
in scheme: v3
change note: Version 4.1.0

Asexual solidarity
comment: A sense of fellowship and overall unity of purpose, political interest, and/or community sympathies based on shared experiences as asexual people.
broader: LGBTQ+ solidarity
has top concept: LGBTQ+ solidarity
issued: 2024-04-16
modified: 2025-02-23
type: Concept
in scheme: v3
change note: Version 4.1.0

Aromantic solidarity
comment: A sense of fellowship and overall unity of purpose, political interest, and/or community sympathies based on shared experiences as aromantic people.
broader: LGBTQ+ solidarity
has top concept: LGBTQ+ solidarity
issued: 2024-04-16
modified: 2025-02-23
type: Concept
in scheme: v3
change note: Version 4.1.0

Demisexual solidarity
comment: A sense of fellowship and overall unity of purpose, political interest, and/or community sympathies based on shared experiences as demisexual people.
broader: LGBTQ+ solidarity
has top concept: LGBTQ+ solidarity
issued: 2024-04-16
modified: 2025-02-23
type: Concept
in scheme: v3
change note: Version 4.1.0

Greyromantic solidarity
comment: A sense of fellowship and overall unity of purpose, political interest, and/or community sympathies based on shared experiences as greyromantic people.
broader: LGBTQ+ solidarity
has top concept: LGBTQ+ solidarity
issued: 2024-04-16
modified: 2025-02-23
type: Concept
in scheme: v3
change note: Version 4.1.0

Dyke solidarity
comment: A sense of fellowship and overall unity of purpose, political interest, and/or community sympathies based on shared experiences as self-identifying dykes.
broader: LGBTQ+ solidarity
related: Dyke demonstrations
has top concept: LGBTQ+ solidarity
issued: 2024-04-16
modified: 2025-04-23
type: Concept
in scheme: v3
change note: Version 4.1.0

Megasexual solidarity
comment: A sense of fellowship and overall unity of purpose, political interest, and/or community sympathies based on shared experiences as megasexual people.
broader: LGBTQ+ solidarity
has top concept: LGBTQ+ solidarity
issued: 2024-04-16
modified: 2025-02-23
type: Concept
in scheme: v3
change note: Version 4.1.0

Non-binary solidarity
alternative label: Nonbinary solidarity
comment: A sense of fellowship and overall unity of purpose, political interest, and/or community sympathies based on shared experiences as non-binary people.
broader: LGBTQ+ solidarity
has top concept: LGBTQ+ solidarity
issued: 2024-04-16
modified: 2025-02-23
type: Concept
in scheme: v3
change note: Version 4.1.0

Two-Spirit solidarity
alternative label: 2S solidarity
alternative label: Two Spirit solidarity
alternative label: Two Spirited solidarity
alternative label: Two-Spirited solidarity
comment: A sense of fellowship and overall unity of purpose, political interest, and/or community sympathies based on shared experiences as Two-Spirit people.
related: LGBTQ+ solidarity
issued: 2024-04-16
modified: 2025-02-23
type: Concept
in scheme: v3
change note: Version 4.1.0

Lesbian websites
comment: Public web pages that primarily address lesbian communities and issues, as well as web pages intended for use by lesbians.
broader: LGBTQ+ websites
has top concept: LGBTQ+ websites
issued: 2024-04-25
modified: 2025-02-23
type: Concept
in scheme: v3
change note: Version 4.1.0

Gay websites
comment: Public web pages that primarily address gay communities and issues, as well as web pages intended for use by gay people.
broader: LGBTQ+ websites
has top concept: LGBTQ+ websites
issued: 2024-04-25
modified: 2025-02-23
type: Concept
in scheme: v3
change note: Version 4.1.0

Bisexual websites
comment: Public web pages that primarily address bisexual communities and issues, as well as web pages intended for use by bisexual people.
broader: LGBTQ+ websites
has top concept: LGBTQ+ websites
issued: 2024-04-25
modified: 2025-02-23
type: Concept
in scheme: v3
change note: Version 4.1.0

Transgender websites
comment: Public web pages that primarily address transgender communities and issues, as well as web pages intended for use by transgender people.
broader: LGBTQ+ websites
has top concept: LGBTQ+ websites
issued: 2024-04-25
modified: 2025-02-23
type: Concept
in scheme: v3
change note: Version 4.1.0

Queer websites
comment: Public web pages that primarily address queer communities and issues, as well as web pages intended for use by queer people.
broader: LGBTQ+ websites
has top concept: LGBTQ+ websites
issued: 2024-04-25
modified: 2025-02-23
type: Concept
in scheme: v3
change note: Version 4.1.0

Intersex websites
comment: Public web pages that primarily address intersex communities and issues, as well as web pages intended for use by intersex people.
broader: LGBTQ+ websites
has top concept: LGBTQ+ websites
issued: 2024-04-25
modified: 2025-02-23
type: Concept
in scheme: v3
change note: Version 4.1.0

Aromantic websites
comment: Public web pages that primarily address aromantic communities and issues, as well as web pages intended for use by aromantic people.
broader: LGBTQ+ websites
has top concept: LGBTQ+ websites
issued: 2024-04-25
modified: 2025-02-23
type: Concept
in scheme: v3
change note: Version 4.1.0

Asexual websites
comment: Public web pages that primarily address asexual communities and issues, as well as web pages intended for use by asexual people.
broader: LGBTQ+ websites
has top concept: LGBTQ+ websites
issued: 2024-04-25
modified: 2025-02-23
type: Concept
in scheme: v3
change note: Version 4.1.0

Demisexual websites
comment: Public web pages that primarily address demisexual communities and issues, as well as web pages intended for use by demisexual people.
broader: LGBTQ+ websites
has top concept: LGBTQ+ websites
issued: 2024-04-25
modified: 2025-02-23
type: Concept
in scheme: v3
change note: Version 4.1.0

Greyromantic websites
comment: Public web pages that primarily address greyromantic communities and issues, as well as web pages intended for use by greyromantic people.
broader: LGBTQ+ websites
has top concept: LGBTQ+ websites
issued: 2024-04-25
modified: 2025-02-23
type: Concept
in scheme: v3
change note: Version 4.1.0

Megasexual websites
comment: Public web pages that primarily address megasexual communities and issues, as well as web pages intended for use by megasexual people.
broader: LGBTQ+ websites
has top concept: LGBTQ+ websites
issued: 2024-04-25
modified: 2025-02-23
type: Concept
in scheme: v3
change note: Version 4.1.0

Non-binary websites
alternative label: Nonbinary websites
comment: Public web pages that primarily address non-binary communities and issues, as well as web pages intended for use by non-binary.
broader: LGBTQ+ websites
has top concept: LGBTQ+ websites
issued: 2024-04-25
modified: 2025-02-23
type: Concept
in scheme: v3
change note: Version 4.1.0

Two-Spirit websites
alternative label: 2S websites
alternative label: Two Spirit websites
alternative label: Two Spirited websites
alternative label: Two-Spirited websites
comment: Public web pages that primarily address Two-Spirit communities and issues, as well as web pages intended for use by Two-Spirit people.
related: LGBTQ+ websites
issued: 2024-04-25
modified: 2025-02-23
type: Concept
in scheme: v3
change note: Version 4.1.0

Pregnant men
comment: Pregnant people who are trans or intersex men. For the fandom trope in which cisgender men can become pregnant, use the term "Mpreg."
broader: Males
broader: Pregnant people
has top concept: Gender
issued: 2024-05-24
modified: 2025-02-23
type: Concept
in scheme: v3
change note: Version 4.1.0

Pregnant women
comment: Pregnant people who are women.
broader: Females
broader: Pregnant people
has top concept: Gender
issued: 2024-05-24
modified: 2025-02-23
type: Concept
in scheme: v3
change note: Version 4.1.0

Pregnant intersex people
comment: Pregnant people who are intersex.
broader: Intersex people
broader: Pregnant people
has top concept: LGBTQ+ people
issued: 2024-05-24
modified: 2025-02-23
type: Concept
in scheme: v3
change note: Version 4.1.0

Pregnant transgender people
alternative label: Pregnant trans people
comment: Pregnant people who are transgender.
broader: Transgender people
broader: Pregnant people
has top concept: LGBTQ+ people
issued: 2024-05-24
modified: 2025-02-23
type: Concept
in scheme: v3
change note: Version 4.1.0

Pregnant non-binary people
alternative label: Pregnant nonbinary people
comment: Pregnant people who are non-binary.
broader: Non-binary people
broader: Pregnant people
has top concept: LGBTQ+ people
issued: 2024-05-24
modified: 2025-02-23
type: Concept
in scheme: v3
change note: Version 4.1.0

Lesbian musicals
comment: Musicals created by lesbian directors, depicting lesbians, or that are regarded as important within lesbian culture.
broader: LGBTQ+ musicals
has top concept: Subcultures
issued: 2024-05-24
modified: 2025-02-23
type: Concept
in scheme: v3
change note: Version 4.1.0

Polycules
comment: Networks of polyamorous people who are connected by their or their partners' romantic and/or sexual relationships. Polycule members are not necessarily romantically and/or sexually involved with every member of the group. For example, Member A might be connected to Member B in that Member B is in a relationship with Member A's partner.
related: Relationship orientation
related: Non-monogamous people
related: Polyamorous people
related: Polyamorous families
issued: 2024-05-24
modified: 2025-03-20
type: Concept
in scheme: v3
change note: Version 4.1.0

Pregnant Two-Spirit people
alternative label: Pregnant 2S people
alternative label: Pregnant Two Spirit people
alternative label: Pregnant Two Spirited people
alternative label: Pregnant Two-Spirited people
comment: Pregnant people who are Two-Spirit.
broader: Two-Spirit people
broader: Pregnant people
has top concept: Gender
issued: 2024-05-24
modified: 2025-02-23
type: Concept
in scheme: v3
change note: Version 4.1.0

Pregnant māhū
alternative label: Pregnant mahu
comment: Pregnant people who are māhū.
broader: Māhū
broader: Pregnant people
has top concept: Gender
issued: 2024-05-24
modified: 2025-02-23
type: Concept
in scheme: v3
change note: Version 4.1.0

Palestinian LGBTQ+ people
alternative label: LGBTQ+ Palestinian people
alternative label: LGBTQ+ Palestinians
alternative label: Palestinian people (LGBTQ)
alternative label: Palestinians (LGBTQ)
comment: LGBTQ+ people who were born in, reside in, and/or are descended from those indigenous to the country of Palestine.
broader: Indigenous LGBTQ+ people
broader: Arab LGBTQ+ people
narrower: Palestinian gay men
narrower: Palestinian lesbians
narrower: Palestinian bisexual people
narrower: Palestinian queer people
narrower: Palestinian transgender people
narrower: Palestinian non-binary people
narrower: Palestinian asexual people
narrower: Palestinian intersex people
has top concept: LGBTQ+ people
issued: 2024-05-24
modified: 2025-02-23
type: Concept
in scheme: v3
change note: Version 4.1.0

Palestinian gay men
alternative label: Gay Palestinians
comment: Gay men who were born in, reside in, and/or are descended from those indigenous to the country of Palestine.
broader: Palestinian LGBTQ+ people
has top concept: LGBTQ+ people
issued: 2024-05-24
modified: 2025-02-23
type: Concept
in scheme: v3
change note: Version 4.1.0

Palestinian lesbians
alternative label: Lesbian Palestinians
comment: Lesbians who were born in, reside in, and/or are descended from those indigenous to the country of Palestine.
broader: Palestinian LGBTQ+ people
has top concept: LGBTQ+ people
issued: 2024-05-24
modified: 2025-02-23
type: Concept
in scheme: v3
change note: Version 4.1.0

Palestinian bisexual people
alternative label: Bisexual Palestinians
comment: Bisexual people who were born in, reside in, and/or are descended from those indigenous to the country of Palestine.
broader: Palestinian LGBTQ+ people
has top concept: LGBTQ+ people
issued: 2024-05-24
modified: 2025-02-23
type: Concept
in scheme: v3
change note: Version 4.1.0

Palestinian queer people
alternative label: Queer Palestinians
comment: Queer people who were born in, reside in, and/or are descended from those indigenous to the country of Palestine.
broader: Palestinian LGBTQ+ people
has top concept: LGBTQ+ people
issued: 2024-05-24
modified: 2025-02-23
type: Concept
in scheme: v3
change note: Version 4.1.0

Palestinian transgender people
alternative label: Palestinian trans people
alternative label: Trans Palestinians
alternative label: Transgender Palestinians
comment: Transgender people who were born in, reside in, and/or are descended from those indigenous to the country of Palestine.
broader: Palestinian LGBTQ+ people
has top concept: LGBTQ+ people
issued: 2024-05-24
modified: 2025-02-23
type: Concept
in scheme: v3
change note: Version 4.1.0

Palestinian non-binary people
alternative label: Non-binary Palestinians
alternative label: Nonbinary Palestinians
alternative label: Palestinian nonbinary people
comment: Non-binary people who were born in, reside in, and/or are descended from those indigenous to the country of Palestine.
broader: Palestinian LGBTQ+ people
has top concept: LGBTQ+ people
issued: 2024-05-24
modified: 2025-02-23
type: Concept
in scheme: v3
change note: Version 4.1.0

Palestinian asexual people
alternative label: Ace Palestinians
alternative label: Asexual Palestinians
comment: Asexual people who were born in, reside in, and/or are descended from those indigenous to the country of Palestine.
broader: Palestinian LGBTQ+ people
has top concept: LGBTQ+ people
issued: 2024-05-24
modified: 2025-02-23
type: Concept
in scheme: v3
change note: Version 4.1.0

Palestinian intersex people
alternative label: Intersex Palestinians
comment: Intersex people who were born in, reside in, and/or are descended from those indigenous to the country of Palestine.
broader: Palestinian LGBTQ+ people
has top concept: LGBTQ+ people
issued: 2024-05-24
modified: 2025-02-23
type: Concept
in scheme: v3
change note: Version 4.1.0

Two-Spirit daughters
alternative label: Two Spirit daughters
alternative label: Two Spirited daughters
alternative label: Two-Spirited daughters
comment: Two-Spirit people who are daughters. Only use to describe individuals who identify as daughters.
related: LGBTQ+ daughters
issued: 2024-05-24
modified: 2025-02-23
type: Concept
in scheme: v3
change note: Version 4.1.0

Two-Spirit fathers
alternative label: 2S fathers
alternative label: Two Spirit fathers
alternative label: Two Spirited fathers
alternative label: Two-Spirited fathers
comment: Two-Spirit people who are fathers. Only use to describe individuals who identify as fathers.
broader: Fathers
broader: Two-Spirit parents
related: Two-Spirit families
has top concept: Family members
issued: 2024-05-24
modified: 2025-02-23
type: Concept
in scheme: v3
change note: Version 4.1.0

Two-Spirit mothers
alternative label: 2S mothers
alternative label: Two Spirit mothers
alternative label: Two Spirited mothers
alternative label: Two-Spirited mothers
comment: Two-Spirit people who are mothers. Only use to describe individuals who identify as mothers.
broader: Mothers
broader: Two-Spirit parents
related: Two-Spirit families
has top concept: Family members
issued: 2024-05-24
modified: 2025-02-23
type: Concept
in scheme: v3
change note: Version 4.1.0

Two-Spirit sons
alternative label: 2S sons
alternative label: Two Spirit sons
alternative label: Two Spirited sons
alternative label: Two-Spirited sons
comment: Two-Spirit people who are sons. Only use to describe individuals who identify as sons.
broader: Two-Spirit people
broader: Sons
has top concept: Gender
issued: 2024-05-24
modified: 2025-02-23
type: Concept
in scheme: v3
change note: Version 4.1.0

Drag television programs
alternative label: Drag TV programmes
alternative label: Drag TV programs
alternative label: Drag TV shows
alternative label: Drag television programmes
alternative label: Drag television shows
alternative label: Drag television
comment: Television programs that feature drag queens and/or drag kings and drag performances.
broader: Drag
related: LGBTQ+ television
has top concept: Gender
issued: 2024-05-24
modified: 2025-02-23
type: Concept
in scheme: v3
change note: Version 4.1.0

LGBTQ+ pride flags
alternative label: Pride flags
comment: Flags that represent sexual identities, gender identities, and romantic orientations that fall under the LGBTQ+ umbrella, as well as flags representing LGBTQ+ subcultures and communities.
broader: LGBTQ+ symbols
narrower: Rainbow flags
related: LGBTQ+ pride
has top concept: LGBTQ+ symbols
issued: 2024-05-24
modified: 2025-02-23
type: Concept
in scheme: v3
change note: Version 4.1.0

LGBTQ+ teachers
alternative label: Teachers (LGBTQ)
comment: Teachers who self-identify as LGBTQ+.
broader: LGBTQ+ people
narrower: Aromantic teachers
narrower: Asexual teachers
narrower: Bisexual teachers
narrower: Demisexual teachers
narrower: Gay teachers
narrower: Greyromantic teachers
narrower: Intersex teachers
narrower: Lesbian teachers
narrower: Megasexual teachers
narrower: Non-binary teachers
narrower: Queer teachers
narrower: Transgender teachers
related: Māhū teachers
related: Two-Spirit teachers
related: LGBTQ+ librarians
has top concept: LGBTQ+ people
issued: 2024-05-24
modified: 2025-02-23
type: Concept
in scheme: v3
change note: Version 4.1.0

Aromantic teachers
comment: Teachers who self-identify as aromantic.
broader: LGBTQ+ teachers
related: Aromantic academics
has top concept: LGBTQ+ people
issued: 2024-05-24
modified: 2025-02-23
type: Concept
in scheme: v3
change note: Version 4.1.0

Asexual teachers
comment: Teachers who self-identify as asexual.
broader: LGBTQ+ teachers
has top concept: LGBTQ+ people
issued: 2024-05-24
modified: 2025-02-23
type: Concept
in scheme: v3
change note: Version 4.1.0

Bisexual teachers
alternative label: Bi teachers
comment: Teachers who self-identify as bisexual.
broader: LGBTQ+ teachers
has top concept: LGBTQ+ people
issued: 2024-05-24
modified: 2025-02-23
type: Concept
in scheme: v3
change note: Version 4.1.0

Demisexual teachers
comment: Teachers who self-identify as demisexual.
broader: LGBTQ+ teachers
has top concept: LGBTQ+ people
issued: 2024-05-24
modified: 2025-02-23
type: Concept
in scheme: v3
change note: Version 4.1.0

Gay teachers
comment: Teachers who self-identify as gay men.
broader: LGBTQ+ teachers
has top concept: LGBTQ+ people
issued: 2024-05-24
modified: 2025-02-23
type: Concept
in scheme: v3
change note: Version 4.1.0

Greyromantic teachers
comment: Teachers who self-identify as greyromantic.
broader: LGBTQ+ teachers
has top concept: LGBTQ+ people
issued: 2024-05-24
modified: 2025-02-23
type: Concept
in scheme: v3
change note: Version 4.1.0

Intersex teachers
comment: Teachers who are intersex.
broader: LGBTQ+ teachers
has top concept: LGBTQ+ people
issued: 2024-05-24
modified: 2025-02-23
type: Concept
in scheme: v3
change note: Version 4.1.0

Lesbian teachers
comment: Teachers who self-identify as lesbians.
broader: LGBTQ+ teachers
has top concept: LGBTQ+ people
issued: 2024-05-24
modified: 2025-02-23
type: Concept
in scheme: v3
change note: Version 4.1.0

Māhū teachers
alternative label: Mahu teachers
comment: Teachers who are Māhū.
broader: Māhū
related: LGBTQ+ teachers
has top concept: Gender
issued: 2024-05-24
modified: 2025-02-23
type: Concept
in scheme: v3
change note: Version 4.1.0

Megasexual teachers
comment: Teachers who self-identify as megasexual.
broader: LGBTQ+ teachers
has top concept: LGBTQ+ people
issued: 2024-05-24
modified: 2025-02-23
type: Concept
in scheme: v3
change note: Version 4.1.0

Non-binary teachers
alternative label: Nonbinary teachers
comment: Teachers who self-identify as non-binary.
broader: LGBTQ+ teachers
has top concept: LGBTQ+ people
issued: 2024-05-24
modified: 2025-02-23
type: Concept
in scheme: v3
change note: Version 4.1.0

Queer teachers
comment: Teachers who self-identify as queer.
broader: LGBTQ+ teachers
has top concept: LGBTQ+ people
issued: 2024-05-24
modified: 2025-02-23
type: Concept
in scheme: v3
change note: Version 4.1.0

Transgender teachers
alternative label: Trans teachers
comment: Teachers who self-identify as transgender.
broader: LGBTQ+ teachers
has top concept: LGBTQ+ people
issued: 2024-05-24
modified: 2025-02-23
type: Concept
in scheme: v3
change note: Version 4.1.0

Two-Spirit teachers
alternative label: 2S teachers
alternative label: Two Spirit teachers
alternative label: Two Spirited teachers
alternative label: Two-Sprited teachers
comment: Indigenous teachers who self-identify as Two-Spirit.
broader: Two-Spirit people
related: LGBTQ+ teachers
has top concept: Gender
issued: 2024-05-24
modified: 2025-02-23
type: Concept
in scheme: v3
change note: Version 4.1.0

LGBTQ+ sex tourism
alternative label: Sex tourism (LGBTQ)
comment: The practice of traveling with the intention of soliciting sex work, typically to allow LGBTQ+ or curious people to explore sexual encounters that are illegal or stigmatized in their home countries. Sex tourism often presents ethical concerns, such as the economic gap between tourists and residents, differences in age of consent laws globally, and the selective enforcement of anti-sex work laws by police.
broader: LGBTQ+ tourism
broader: Sex tourism
related: LGBTQ+ sex workers
has top concept: LGBTQ+ tourism
issued: 2024-05-24
modified: 2025-02-23
type: Concept
in scheme: v3
change note: Version 4.1.0

LGBTQ+ academics
alternative label: Academics (LGBTQ)
alternative label: LGBTQ+ college teachers
alternative label: LGBTQ+ professors
alternative label: LGBTQ+ researchers
comment: LGBTQ+ researchers and/or educators working in higher education.
broader: LGBTQ+ people
narrower: Aromantic academics
narrower: Asexual academics
narrower: Bisexual academics
narrower: Demisexual academics
narrower: Gay academics
narrower: Greyromantic academics
narrower: Intersex academics
narrower: Lesbian academics
narrower: Megasexual academics
narrower: Non-binary academics
narrower: Queer academics
narrower: Transgender academics
related: Two-Spirit academics
has top concept: LGBTQ+ people
issued: 2024-05-24
modified: 2025-02-23
type: Concept
in scheme: v3
change note: Version 4.1.0

Aromantic academics
alternative label: Aromantic college teachers
alternative label: Aromantic professors
alternative label: Aromantic researchers
comment: Aromantic researchers and/or educators working in higher education.
broader: LGBTQ+ academics
related: Aromantic teachers
has top concept: LGBTQ+ people
issued: 2024-05-24
modified: 2025-02-23
type: Concept
in scheme: v3
change note: Version 4.1.0

Asexual academics
alternative label: Ace academics
alternative label: Asexual college teachers
alternative label: Asexual professors
alternative label: Asexual researchers
comment: Asexual researchers and/or educators working in higher education.
broader: LGBTQ+ academics
has top concept: LGBTQ+ people
issued: 2024-05-24
modified: 2025-02-23
type: Concept
in scheme: v3
change note: Version 4.1.0

Bisexual academics
alternative label: Bi academics
alternative label: Bisexual college teachers
alternative label: Bisexual professors
alternative label: Bisexual researchers
comment: Bisexual researchers and/or educators working in higher education.
broader: LGBTQ+ academics
has top concept: LGBTQ+ people
issued: 2024-05-24
modified: 2025-02-23
type: Concept
in scheme: v3
change note: Version 4.1.0

Demisexual academics
alternative label: Demi academics
alternative label: Demisexual college teachers
alternative label: Demisexual professors
alternative label: Demisexual researchers
comment: Demisexual researchers and/or educators working in higher education.
broader: LGBTQ+ academics
has top concept: LGBTQ+ people
issued: 2024-05-24
modified: 2025-02-23
type: Concept
in scheme: v3
change note: Version 4.1.0

Gay academics
alternative label: Gay college teachers
alternative label: Gay professors
alternative label: Gay researchers
comment: Gay men working as researchers or educators in higher education.
broader: LGBTQ+ academics
has top concept: LGBTQ+ people
issued: 2024-05-24
modified: 2025-02-23
type: Concept
in scheme: v3
change note: Version 4.1.0

Greyromantic academics
alternative label: Greyromantic college teachers
alternative label: Greyromantic professors
alternative label: Greyromantic researchers
comment: Greyromantic researchers and/or educators working in higher education.
broader: LGBTQ+ academics
has top concept: LGBTQ+ people
issued: 2024-05-24
modified: 2025-02-23
type: Concept
in scheme: v3
change note: Version 4.1.0

Intersex academics
alternative label: Intersex college teachers
alternative label: Intersex professors
alternative label: Intersex researchers
comment: Intersex researchers and/or educators working in higher education.
broader: LGBTQ+ academics
has top concept: LGBTQ+ people
issued: 2024-05-24
modified: 2025-02-23
type: Concept
in scheme: v3
change note: Version 4.1.0

Lesbian academics
alternative label: Lesbian college teachers
alternative label: Lesbian professors
alternative label: Lesbian researchers
comment: Lesbian researchers and/or educators working in higher education.
broader: LGBTQ+ academics
has top concept: LGBTQ+ people
issued: 2024-05-24
modified: 2025-02-23
type: Concept
in scheme: v3
change note: Version 4.1.0

Megasexual academics
alternative label: Megasexual college teachers
alternative label: Megasexual professors
alternative label: Megasexual researchers
comment: Megasexual researchers and/or educators working in higher education.
broader: LGBTQ+ academics
has top concept: LGBTQ+ people
issued: 2024-05-24
modified: 2025-02-23
type: Concept
in scheme: v3
change note: Version 4.1.0

Non-binary academics
alternative label: Non-binary college teachers
alternative label: Non-binary professors
alternative label: Non-binary researchers
alternative label: Nonbinary academics
comment: Non-binary researchers and/or educators working in higher education.
broader: LGBTQ+ academics
has top concept: LGBTQ+ people
issued: 2024-05-24
modified: 2025-02-23
type: Concept
in scheme: v3
change note: Version 4.1.0

Queer academics
alternative label: Queer college teachers
alternative label: Queer professors
alternative label: Queer researchers
comment: Queer researchers and/or educators working in higher education.
broader: LGBTQ+ academics
has top concept: LGBTQ+ people
issued: 2024-05-24
modified: 2025-02-23
type: Concept
in scheme: v3
change note: Version 4.1.0

Transgender academics
alternative label: Trans academics
alternative label: Transgender college teachers
alternative label: Transgender professors
alternative label: Transgender researchers
comment: Transgender researchers and/or educators working in higher education.
broader: LGBTQ+ academics
has top concept: LGBTQ+ people
issued: 2024-05-24
modified: 2025-02-23
type: Concept
in scheme: v3
change note: Version 4.1.0

Two-Spirit academics
alternative label: 2S academics
alternative label: Two spirit academics
alternative label: Two spirited academics
alternative label: Two-Spirit college teachers
alternative label: Two-Spirit professors
alternative label: Two-Spirit researchers
alternative label: Two-sprited academics
comment: Two-spirit researchers and/or educators working in higher education.
broader: Two-Spirit people
related: LGBTQ+ academics
has top concept: Gender
issued: 2024-05-24
modified: 2025-02-23
type: Concept
in scheme: v3
change note: Version 4.1.0

Arab non-binary people
alternative label: Arab nonbinary people
alternative label: Non-binary Arab people
alternative label: Non-binary Arabs
alternative label: Nonbinary Arab people
alternative label: Nonbinary Arabs
comment: Non-binary people who are from Arab countries and/or are descended from Arab peoples. Do not conflate with Muslim people.
broader: Arab LGBTQ+ people
has top concept: LGBTQ+ people
issued: 2024-06-10
modified: 2025-02-23
type: Concept
in scheme: v3
change note: Version 4.1.0

Open marriage
comment: A form of consensual non-monogamy in which spouses agree to engage in sexual and/or romantic relationships with individuals other than their marriage partner, without regarding this as infidelity.
broader: Consensual non-monogamy
has top concept: Relationship orientation
issued: 2024-06-10
modified: 2025-02-23
type: Concept
in scheme: v3
change note: Version 4.1.0

LGBTQ+ travel guides
alternative label: Guide books (LGBTQ)
alternative label: LGBTQ+ guide books
alternative label: LGBTQ+ travel guide books
alternative label: Travel guide books (LGBTQ)
alternative label: Travel guides (LGBTQ)
comment: Books or other resources of information about places designed for the use of LGBTQ+ visitors or tourists, typically to direct travelers to establishments or attractions that are owned by, open to, or frequented by LGBTQ+ people. LGBTQ+ travel guides may also direct travelers to safe houses or businesses in places where LGBTQ+ people are otherwise unsafe or criminalized, as well as locations commonly used for cruising, or picking up casual sex partners.
broader: LGBTQ+ tourism
related: LGBTQ+ survival guides
has top concept: LGBTQ+ tourism
issued: 2024-06-10
modified: 2025-03-20
type: Concept
in scheme: v3
change note: Version 4.1.0

Central American Indigenous LGBTQ+ people
alternative label: Central American Indigenous people (LGBTQ)
alternative label: Central American Native LGBTQ+ people
alternative label: Central American Native people (LGBTQ)
alternative label: Indigenous Central American LGBTQ+ people
alternative label: LGBTQ+ Central American Indigenous people
alternative label: LGBTQ+ Central American Native people
comment: People who are part of the Native peoples of Central America and self-identify as LGBTQ. Use more specific terms when available.
broader: Indigenous LGBTQ+ people
narrower: Central American Indigenous asexual people
narrower: Central American Indigenous bisexual people
narrower: Central American Indigenous gay men
narrower: Central American Indigenous intersex people
narrower: Central American Indigenous lesbians
narrower: Central American Indigenous queer people
narrower: Central American Indigenous transgender people
narrower: Central American Indigenous non-binary people
narrower: Central American Indigenous demisexual people
narrower: Central American Indigenous megasexual people
narrower: Central American Indigenous greyromantic people
narrower: Central American Indigenous aromantic people
has top concept: LGBTQ+ people
issued: 2024-06-10
modified: 2025-02-23
type: Concept
in scheme: v3
change note: Version 4.1.0

Central American Indigenous asexual people
alternative label: Asexual Central American Indigenous people
alternative label: Asexual Central American Native people
alternative label: Central American Native asexual people
alternative label: Indigenous Central American asexual people
comment: People who are part of the Native peoples of Central America and self-identify as asexual.
broader: Central American Indigenous LGBTQ+ people
has top concept: LGBTQ+ people
issued: 2024-06-10
modified: 2025-02-23
type: Concept
in scheme: v3
change note: Version 4.1.0

Central American Indigenous bisexual people
alternative label: Bisexual Central American Indigenous people
alternative label: Bisexual Central American Native people
alternative label: Central American Native bisexual people
alternative label: Indigenous Central American bisexual people
comment: People who are part of the Native peoples of Central America and self-identify as bisexual.
broader: Central American Indigenous LGBTQ+ people
has top concept: LGBTQ+ people
issued: 2024-06-10
modified: 2025-02-23
type: Concept
in scheme: v3
change note: Version 4.1.0

Central American Indigenous gay men
alternative label: Central American Native gay men
alternative label: Gay Central American Indigenous men
alternative label: Gay Central American Native men
alternative label: Indigenous Central American gay men
comment: Men who are part of the Native peoples of Central America and self-identify as gay.
broader: Central American Indigenous LGBTQ+ people
has top concept: LGBTQ+ people
issued: 2024-06-10
modified: 2025-02-23
type: Concept
in scheme: v3
change note: Version 4.1.0

Central American Indigenous intersex people
alternative label: Central American Native intersex people
alternative label: Indigenous Central American intersex people
alternative label: Intersex Central American Indigenous people
alternative label: Intersex Central American Native people
comment: People who are part of the Native peoples of Central America and self-identify as intersex.
broader: Central American Indigenous LGBTQ+ people
has top concept: LGBTQ+ people
issued: 2024-06-10
modified: 2025-02-23
type: Concept
in scheme: v3
change note: Version 4.1.0

Central American Indigenous lesbians
alternative label: Central American Native lesbians
alternative label: Indigenous Central American lesbians
alternative label: Lesbian Central American Indigenous people
alternative label: Lesbian Central American Native people
comment: People who are part of the Native peoples of Central America and self-identify as lesbians.
broader: Central American Indigenous LGBTQ+ people
has top concept: LGBTQ+ people
issued: 2024-06-10
modified: 2025-02-23
type: Concept
in scheme: v3
change note: Version 4.1.0

Central American Indigenous queer people
alternative label: Central American Native queer people
alternative label: Indigenous Central American queer people
alternative label: Queer Central American Indigenous people
alternative label: Queer Central American Native people
comment: People who are part of the Native peoples of Central America and self-identify as queer.
broader: Central American Indigenous LGBTQ+ people
has top concept: LGBTQ+ people
issued: 2024-06-10
modified: 2025-02-23
type: Concept
in scheme: v3
change note: Version 4.1.0

Central American Indigenous transgender people
alternative label: Central American Native transgender people
alternative label: Indigenous Central American transgender people
alternative label: Transgender Central American Indigenous people
alternative label: Transgender Central American Native people
comment: People who are part of the Native peoples of Central America and self-identify as transgender.
broader: Central American Indigenous LGBTQ+ people
has top concept: LGBTQ+ people
issued: 2024-06-10
modified: 2025-02-23
type: Concept
in scheme: v3
change note: Version 4.1.0

Central American Indigenous non-binary people
alternative label: Central American Indigenous nonbinary people
alternative label: Central American Native non-binary people
alternative label: Indigenous Central American non-binary people
alternative label: Non-binary Central American Indigenous people
alternative label: Non-binary Central American Native people
comment: People who are part of the Native peoples of Central America and self-identify as non-binary.
broader: Central American Indigenous LGBTQ+ people
has top concept: LGBTQ+ people
issued: 2024-06-10
modified: 2025-02-23
type: Concept
in scheme: v3
change note: Version 4.1.0

Central American Indigenous demisexual people
alternative label: Central American Native demisexual people
alternative label: Demisexual Central American Indigenous people
alternative label: Demisexual Central American Native people
alternative label: Indigenous Central American demisexual people
comment: People who are part of the Native peoples of Central America and self-identify as demisexual.
broader: Central American Indigenous LGBTQ+ people
has top concept: LGBTQ+ people
issued: 2024-06-10
modified: 2025-02-23
type: Concept
in scheme: v3
change note: Version 4.1.0

Central American Indigenous megasexual people
alternative label: Central American Native megasexual people
alternative label: Indigenous Central American megasexual people
alternative label: Megasexual Central American Indigenous people
alternative label: Megasexual Central American Native people
comment: People who are part of the Native peoples of Central America and self-identify as megasexual.
broader: Central American Indigenous LGBTQ+ people
has top concept: LGBTQ+ people
issued: 2024-06-10
modified: 2025-02-23
type: Concept
in scheme: v3
change note: Version 4.1.0

Central American Indigenous greyromantic people
alternative label: Central American Native greyromantic people
alternative label: Greyromantic Central American Indigenous people
alternative label: Greyromantic Central American Native people
alternative label: Indigenous Central American greyromantic people
comment: People who are part of the Native peoples of Central America and self-identify as greyromantic.
broader: Central American Indigenous LGBTQ+ people
has top concept: LGBTQ+ people
issued: 2024-06-10
modified: 2025-02-23
type: Concept
in scheme: v3
change note: Version 4.1.0

Central American Indigenous aromantic people
alternative label: Aromantic Central American Indigenous people
alternative label: Aromantic Central American Native people
alternative label: Central American Native aromantic people
alternative label: Indigenous Central American aromantic people
comment: People who are part of the Native peoples of Central America and self-identify as aromantic.
broader: Central American Indigenous LGBTQ+ people
has top concept: LGBTQ+ people
issued: 2024-06-10
modified: 2025-02-23
type: Concept
in scheme: v3
change note: Version 4.1.0

South American Indigenous LGBTQ+ people
alternative label: Indigenous South American LGBTQ+ people
alternative label: LGBTQ+ South American Indigenous people
alternative label: LGBTQ+ South American Native people
alternative label: South American Indigenous people (LGBTQ)
alternative label: South American Native LGBTQ+ people
alternative label: South American Native people (LGBTQ)
comment: People who are part of the Native peoples of South America and self-identify as LGBTQ. Use more specific terms when available.
broader: Indigenous LGBTQ+ people
narrower: South American Indigenous asexual people
narrower: South American Indigenous bisexual people
narrower: South American Indigenous gay men
narrower: South American Indigenous intersex people
narrower: South American Indigenous lesbians
narrower: South American Indigenous queer people
narrower: South American Indigenous non-binary people
narrower: South American Indigenous transgender people
narrower: South American Indigenous demisexual people
narrower: South American Indigenous megasexual people
narrower: South American Indigenous greyromantic people
narrower: South American Indigenous aromantic people
related: Warmipangui
has top concept: LGBTQ+ people
issued: 2024-06-10
modified: 2025-04-23
type: Concept
in scheme: v3
change note: Version 4.1.0

South American Indigenous asexual people
alternative label: Asexual South American Indigenous people
alternative label: Asexual South American Native people
alternative label: Indigenous South American asexual people
alternative label: South American Native asexual people
comment: People who are part of the Native peoples of South America and self-identify as asexual.
broader: South American Indigenous LGBTQ+ people
has top concept: LGBTQ+ people
issued: 2024-06-10
modified: 2025-02-23
type: Concept
in scheme: v3
change note: Version 4.1.0

South American Indigenous bisexual people
alternative label: Bisexual South American Indigenous people
alternative label: Bisexual South American Native people
alternative label: Indigenous South American bisexual people
alternative label: South American Native bisexual people
comment: People who are part of the Native peoples of South America and self-identify as bisexual.
broader: South American Indigenous LGBTQ+ people
has top concept: LGBTQ+ people
issued: 2024-06-10
modified: 2025-02-23
type: Concept
in scheme: v3
change note: Version 4.1.0

South American Indigenous gay men
alternative label: Gay South American Indigenous men
alternative label: Gay South American Native men
alternative label: Indigenous South American gay men
alternative label: South American Native gay men
comment: Men who are part of the Native peoples of South America and self-identify as gay.
broader: South American Indigenous LGBTQ+ people
has top concept: LGBTQ+ people
issued: 2024-06-10
modified: 2025-02-23
type: Concept
in scheme: v3
change note: Version 4.1.0

South American Indigenous intersex people
alternative label: Indigenous South American intersex people
alternative label: Intersex South American Indigenous people
alternative label: Intersex South American Native people
alternative label: South American Native intersex people
comment: People who are part of the Native peoples of South America and self-identify as intersex.
broader: South American Indigenous LGBTQ+ people
has top concept: LGBTQ+ people
issued: 2024-06-10
modified: 2025-02-23
type: Concept
in scheme: v3
change note: Version 4.1.0

South American Indigenous lesbians
alternative label: Indigenous South American lesbians
alternative label: Lesbian South American Indigenous people
alternative label: Lesbian South American Native people
alternative label: South American Native lesbians
comment: People who are part of the Native peoples of South America and self-identify as lesbians.
broader: South American Indigenous LGBTQ+ people
has top concept: LGBTQ+ people
issued: 2024-06-10
modified: 2025-02-23
type: Concept
in scheme: v3
change note: Version 4.1.0

South American Indigenous queer people
alternative label: Indigenous South American queer people
alternative label: Queer South American Indigenous people
alternative label: Queer South American Native people
alternative label: South American Native queer people
comment: People who are part of the Native peoples of South America and self-identify as queer.
broader: South American Indigenous LGBTQ+ people
has top concept: LGBTQ+ people
issued: 2024-06-10
modified: 2025-02-23
type: Concept
in scheme: v3
change note: Version 4.1.0

South American Indigenous non-binary people
alternative label: Indigenous South American non-binary people
alternative label: Non-binary South American Indigenous people
alternative label: Non-binary South American Native people
alternative label: South American Indigenous nonbinary people
alternative label: South American Native non-binary people
comment: People who are part of the Native peoples of South America and self-identify as non-binary.
broader: South American Indigenous LGBTQ+ people
has top concept: LGBTQ+ people
issued: 2024-06-10
modified: 2025-02-23
type: Concept
in scheme: v3
change note: Version 4.1.0

South American Indigenous transgender people
alternative label: Indigenous South American transgender people
alternative label: South American Native transgender people
alternative label: Transgender South American Indigenous people
alternative label: Transgender South American Native people
comment: People who are part of the Native peoples of South America and self-identify as transgender.
broader: South American Indigenous LGBTQ+ people
has top concept: LGBTQ+ people
issued: 2024-06-10
modified: 2025-02-23
type: Concept
in scheme: v3
change note: Version 4.1.0

South American Indigenous demisexual people
alternative label: Demisexual South American Indigenous people
alternative label: Demisexual South American Native people
alternative label: Indigenous South American demisexual people
alternative label: South American Native demisexual people
comment: People who are part of the Native peoples of South America and self-identify as demisexual.
broader: South American Indigenous LGBTQ+ people
has top concept: LGBTQ+ people
issued: 2024-06-10
modified: 2025-02-23
type: Concept
in scheme: v3
change note: Version 4.1.0

South American Indigenous megasexual people
alternative label: Indigenous South American megasexual people
alternative label: Megasexual South American Indigenous people
alternative label: Megasexual South American Native people
alternative label: South American Native megasexual people
comment: People who are part of the Native peoples of South America and self-identify as megasexual.
broader: South American Indigenous LGBTQ+ people
has top concept: LGBTQ+ people
issued: 2024-06-10
modified: 2025-02-23
type: Concept
in scheme: v3
change note: Version 4.1.0

South American Indigenous greyromantic people
alternative label: Greyromantic South American Indigenous people
alternative label: Greyromantic South American Native people
alternative label: Indigenous South American greyromantic people
alternative label: South American Native greyromantic people
comment: People who are part of the Native peoples of South America and self-identify as greyromantic.
broader: South American Indigenous LGBTQ+ people
has top concept: LGBTQ+ people
issued: 2024-06-10
modified: 2025-02-23
type: Concept
in scheme: v3
change note: Version 4.1.0

South American Indigenous aromantic people
alternative label: Aromantic South American Indigenous people
alternative label: Aromantic South American Native people
alternative label: Indigenous South American aromantic people
alternative label: South American Native aromantic people
comment: People who are part of the Native peoples of South America and self-identify as aromantic.
broader: South American Indigenous LGBTQ+ people
has top concept: LGBTQ+ people
issued: 2024-06-10
modified: 2025-02-23
type: Concept
in scheme: v3
change note: Version 4.1.0

Belarusian LGBTQ+ people
alternative label: Belarusian people (LGBTQ)
alternative label: Belarusians (LGBTQ)
alternative label: LGBTQ+ Belarusians
comment: LGBTQ+ people who are ethnically Belarusian or have Belarusian nationality.
broader: LGBTQ+ people of shared ethnic or national identities
narrower: Belarusian asexual people
narrower: Belarusian bisexual people
narrower: Belarusian gay men
narrower: Belarusian intersex people
narrower: Belarusian lesbians
narrower: Belarusian queer people
narrower: Belarusian non-binary people
narrower: Belarusian transgender people
narrower: Belarusian demisexual people
narrower: Belarusian megasexual people
narrower: Belarusian greyromantic people
narrower: Belarusian aromantic people
has top concept: LGBTQ+ people
issued: 2024-06-10
modified: 2025-02-23
type: Concept
in scheme: v3
change note: Version 4.1.0

Belarusian asexual people
alternative label: Asexual Belarusians
comment: Asexual people who are ethnically Belarusian or have Belarusian nationality.
broader: Belarusian LGBTQ+ people
has top concept: LGBTQ+ people
issued: 2024-06-10
modified: 2025-02-23
type: Concept
in scheme: v3
change note: Version 4.1.0

Belarusian bisexual people
alternative label: Bi Belarusians
alternative label: Bisexual Belarusians
comment: Bisexual people who are ethnically Belarusian or have Belarusian nationality.
broader: Belarusian LGBTQ+ people
has top concept: LGBTQ+ people
issued: 2024-06-10
modified: 2025-02-23
type: Concept
in scheme: v3
change note: Version 4.1.0

Belarusian gay men
alternative label: Gay Belarusians
comment: Gay men who are ethnically Belarusian or have Belarusian nationality.
broader: Belarusian LGBTQ+ people
has top concept: LGBTQ+ people
issued: 2024-06-10
modified: 2025-02-23
type: Concept
in scheme: v3
change note: Version 4.1.0

Belarusian intersex people
alternative label: Intersex Belarusians
comment: Intersex people who are ethnically Belarusian or have Belarusian nationality.
broader: Belarusian LGBTQ+ people
has top concept: LGBTQ+ people
issued: 2024-06-10
modified: 2025-02-23
type: Concept
in scheme: v3
change note: Version 4.1.0

Belarusian lesbians
alternative label: Lesbian Belarusians
comment: Lesbians who are ethnically Belarusian or have Belarusian nationality.
broader: Belarusian LGBTQ+ people
has top concept: LGBTQ+ people
issued: 2024-06-10
modified: 2025-02-23
type: Concept
in scheme: v3
change note: Version 4.1.0

Belarusian queer people
alternative label: Queer Belarusians
comment: Queer people who are ethnically Belarusian or have Belarusian nationality.
broader: Belarusian LGBTQ+ people
has top concept: LGBTQ+ people
issued: 2024-06-10
modified: 2025-02-23
type: Concept
in scheme: v3
change note: Version 4.1.0

Belarusian non-binary people
alternative label: Belarusian nonbinary people
alternative label: Non-binary Belarusians
alternative label: Nonbinary Belarusians
comment: Non-binary people who are ethnically Belarusian or have Belarusian nationality.
broader: Belarusian LGBTQ+ people
has top concept: LGBTQ+ people
issued: 2024-06-10
modified: 2025-02-23
type: Concept
in scheme: v3
change note: Version 4.1.0

Belarusian transgender people
alternative label: Belarusian trans people
alternative label: Trans Belarusians
alternative label: Transgender Belarusians
comment: Trans people who are ethnically Belarusian or have Belarusian nationality.
broader: Belarusian LGBTQ+ people
has top concept: LGBTQ+ people
issued: 2024-06-10
modified: 2025-02-23
type: Concept
in scheme: v3
change note: Version 4.1.0

Belarusian demisexual people
alternative label: Demisexual Belarusians
comment: Demisexual people who are ethnically Belarusian or have Belarusian nationality.
broader: Belarusian LGBTQ+ people
has top concept: LGBTQ+ people
issued: 2024-06-10
modified: 2025-02-23
type: Concept
in scheme: v3
change note: Version 4.1.0

Belarusian megasexual people
alternative label: Megasexual Belarusians
comment: Megasexual people who are ethnically Belarusian or have Belarusian nationality.
broader: Belarusian LGBTQ+ people
has top concept: LGBTQ+ people
issued: 2024-06-10
modified: 2025-02-23
type: Concept
in scheme: v3
change note: Version 4.1.0

Belarusian greyromantic people
alternative label: Greyromantic Belarusians
comment: Greyromantic people who are ethnically Belarusian or have Belarusian nationality.
broader: Belarusian LGBTQ+ people
has top concept: LGBTQ+ people
issued: 2024-06-10
modified: 2025-02-23
type: Concept
in scheme: v3
change note: Version 4.1.0

Belarusian aromantic people
alternative label: Aromantic Belarusians
comment: Aromantic people who are ethnically Belarusian or have Belarusian nationality.
broader: Belarusian LGBTQ+ people
has top concept: LGBTQ+ people
issued: 2024-06-10
modified: 2025-02-23
type: Concept
in scheme: v3
change note: Version 4.1.0

Russian LGBTQ+ people
alternative label: LGBTQ+ Russians
alternative label: Russians (LGBTQ)
comment: LGBTQ+ people who are ethnically Russian or have Russian nationality.
broader: LGBTQ+ people of shared ethnic or national identities
narrower: Russian asexual people
narrower: Russian bisexual people
narrower: Russian gay men
narrower: Russian intersex people
narrower: Russian lesbians
narrower: Russian queer people
narrower: Russian non-binary people
narrower: Russian transgender people
narrower: Russian demisexual people
narrower: Russian megasexual people
narrower: Russian greyromantic people
narrower: Russian aromantic people
has top concept: LGBTQ+ people
issued: 2024-06-10
modified: 2025-02-23
type: Concept
in scheme: v3
change note: Version 4.1.0

Russian asexual people
alternative label: Asexual Russians
comment: Asexual people who are ethnically Russian or have Russian nationality.
broader: Russian LGBTQ+ people
has top concept: LGBTQ+ people
issued: 2024-06-10
modified: 2025-02-23
type: Concept
in scheme: v3
change note: Version 4.1.0

Russian bisexual people
alternative label: Bisexual Russians
comment: Bisexual people who are ethnically Russian or have Russian nationality.
broader: Russian LGBTQ+ people
has top concept: LGBTQ+ people
issued: 2024-06-10
modified: 2025-02-23
type: Concept
in scheme: v3
change note: Version 4.1.0

Russian gay men
alternative label: Gay Russians
comment: Gay men who are ethnically Russian or have Russian nationality.
broader: Russian LGBTQ+ people
has top concept: LGBTQ+ people
issued: 2024-06-10
modified: 2025-02-23
type: Concept
in scheme: v3
change note: Version 4.1.0

Russian intersex people
alternative label: Intersex Russians
comment: Intersex people who are ethnically Russian or have Russian nationality.
broader: Russian LGBTQ+ people
has top concept: LGBTQ+ people
issued: 2024-06-10
modified: 2025-02-23
type: Concept
in scheme: v3
change note: Version 4.1.0

Russian lesbians
alternative label: Lesbian Russians
comment: Lesbians who are ethnically Russian or have Russian nationality.
broader: Russian LGBTQ+ people
has top concept: LGBTQ+ people
issued: 2024-06-10
modified: 2025-02-23
type: Concept
in scheme: v3
change note: Version 4.1.0

Russian queer people
alternative label: Queer Russians
comment: Queer people who are ethnically Russian or have Russian nationality.
broader: Russian LGBTQ+ people
has top concept: LGBTQ+ people
issued: 2024-06-10
modified: 2025-02-23
type: Concept
in scheme: v3
change note: Version 4.1.0

Russian non-binary people
alternative label: Non-binary Russians
alternative label: Nonbinary Russians
alternative label: Russian nonbinary people
comment: Non-binary people who are ethnically Russian or have Russian nationality.
broader: Russian LGBTQ+ people
has top concept: LGBTQ+ people
issued: 2024-06-10
modified: 2025-02-23
type: Concept
in scheme: v3
change note: Version 4.1.0

Russian transgender people
alternative label: Russian trans people
alternative label: Trans Russians
alternative label: Transgender Russians
comment: Trans people who are ethnically Russian or have Russian nationality.
broader: Russian LGBTQ+ people
has top concept: LGBTQ+ people
issued: 2024-06-10
modified: 2025-02-23
type: Concept
in scheme: v3
change note: Version 4.1.0

Russian demisexual people
alternative label: Demisexual Russians
comment: Demisexual people who are ethnically Russian or have Russian nationality.
broader: Russian LGBTQ+ people
has top concept: LGBTQ+ people
issued: 2024-06-10
modified: 2025-02-23
type: Concept
in scheme: v3
change note: Version 4.1.0

Russian megasexual people
alternative label: Megasexual Russians
comment: Megasexual people who are ethnically Russian or have Russian nationality.
broader: Russian LGBTQ+ people
has top concept: LGBTQ+ people
issued: 2024-06-10
modified: 2025-02-23
type: Concept
in scheme: v3
change note: Version 4.1.0

Russian greyromantic people
alternative label: Greyromantic Russians
comment: Greyromantic people who are ethnically Russian or have Russian nationality.
broader: Russian LGBTQ+ people
has top concept: LGBTQ+ people
issued: 2024-06-10
modified: 2025-02-23
type: Concept
in scheme: v3
change note: Version 4.1.0

Russian aromantic people
alternative label: Aromantic Russians
comment: Aromantic people who are ethnically Russian or have Russian nationality.
broader: Russian LGBTQ+ people
has top concept: LGBTQ+ people
issued: 2024-06-10
modified: 2025-02-23
type: Concept
in scheme: v3
change note: Version 4.1.0

Indigenous non-binary people
alternative label: Indigenous nonbinary people
alternative label: Non-binary Indigenous people
alternative label: Nonbinary Indigenous people
comment: Non-binary people who are part of an Indigenous people, or culturally distinct ethnic group whose members are directly descended from the earliest known inhabitants of a particular region and, to some extent, maintain the language and culture of those people. Only use to describe people who identify as Indigenous; use more specific terms whenever possible.
broader: Indigenous LGBTQ+ people
has top concept: LGBTQ+ people
issued: 2024-06-10
modified: 2025-02-23
type: Concept
in scheme: v3
change note: Version 4.1.0

Ukrainian LGBTQ+ people
alternative label: LGBTQ+ Ukrainians
alternative label: Ukrainians (LGBTQ)
comment: LGBTQ+ people who are ethnically Ukrainian or have Ukrainian nationality.
broader: LGBTQ+ people of shared ethnic or national identities
narrower: Ukrainian asexual people
narrower: Ukrainian bisexual people
narrower: Ukrainian gay men
narrower: Ukrainian intersex people
narrower: Ukrainian lesbians
narrower: Ukrainian queer people
narrower: Ukrainian non-binary people
narrower: Ukrainian transgender people
narrower: Ukrainian demisexual people
narrower: Ukrainian megasexual people
narrower: Ukrainian greyromantic people
narrower: Ukrainian aromantic people
has top concept: LGBTQ+ people
issued: 2024-06-19
modified: 2025-02-23
type: Concept
in scheme: v3
change note: Version 4.1.0

Ukrainian asexual people
alternative label: Asexual Ukrainians
comment: Asexual people who are ethnically Ukrainian or have Ukrainian nationality.
broader: Ukrainian LGBTQ+ people
has top concept: LGBTQ+ people
issued: 2024-06-19
modified: 2025-02-23
type: Concept
in scheme: v3
change note: Version 4.1.0

Ukrainian bisexual people
alternative label: Bi Ukrainians
alternative label: Bisexual Ukrainians
comment: Bisexual people who are ethnically Ukrainian or have Ukrainian nationality.
broader: Ukrainian LGBTQ+ people
has top concept: LGBTQ+ people
issued: 2024-06-19
modified: 2025-02-23
type: Concept
in scheme: v3
change note: Version 4.1.0

Ukrainian gay men
alternative label: Gay Ukrainians
comment: Gay men who are ethnically Ukrainian or have Ukrainian nationality.
broader: Ukrainian LGBTQ+ people
has top concept: LGBTQ+ people
issued: 2024-06-19
modified: 2025-02-23
type: Concept
in scheme: v3
change note: Version 4.1.0

Ukrainian intersex people
alternative label: Intersex Ukrainians
comment: Intersex people who are ethnically Ukrainian or have Ukrainian nationality.
broader: Ukrainian LGBTQ+ people
has top concept: LGBTQ+ people
issued: 2024-06-19
modified: 2025-02-23
type: Concept
in scheme: v3
change note: Version 4.1.0

Ukrainian lesbians
alternative label: Lesbian Ukrainians
comment: Lesbians who are ethnically Ukrainian or have Ukrainian nationality.
broader: Ukrainian LGBTQ+ people
has top concept: LGBTQ+ people
issued: 2024-06-19
modified: 2025-02-23
type: Concept
in scheme: v3
change note: Version 4.1.0

Ukrainian queer people
alternative label: Queer Ukrainians
comment: Queer people who are ethnically Ukrainian or have Ukrainian nationality.
broader: Ukrainian LGBTQ+ people
has top concept: LGBTQ+ people
issued: 2024-06-19
modified: 2025-02-23
type: Concept
in scheme: v3
change note: Version 4.1.0

Ukrainian non-binary people
alternative label: Non-binary Ukrainians
alternative label: Nonbinary Ukrainians
alternative label: Ukrainian nonbinary people
comment: Non-binary people who are ethnically Ukrainian or have Ukrainian nationality.
broader: Ukrainian LGBTQ+ people
has top concept: LGBTQ+ people
issued: 2024-06-19
modified: 2025-02-23
type: Concept
in scheme: v3
change note: Version 4.1.0

Ukrainian transgender people
alternative label: Trans Ukrainians
alternative label: Transgender Ukrainians
alternative label: Ukrainian trans people
comment: Trans people who are ethnically Ukrainian or have Ukrainian nationality.
broader: Ukrainian LGBTQ+ people
has top concept: LGBTQ+ people
issued: 2024-06-19
modified: 2025-02-23
type: Concept
in scheme: v3
change note: Version 4.1.0

Ukrainian demisexual people
alternative label: Demisexual Ukrainians
comment: Demisexual people who are ethnically Ukrainian or have Ukrainian nationality.
broader: Ukrainian LGBTQ+ people
has top concept: LGBTQ+ people
issued: 2024-06-19
modified: 2025-02-23
type: Concept
in scheme: v3
change note: Version 4.1.0

Ukrainian megasexual people
alternative label: Megasexual Ukrainians
comment: Megasexual people who are ethnically Ukrainian or have Ukrainian nationality.
broader: Ukrainian LGBTQ+ people
has top concept: LGBTQ+ people
issued: 2024-06-19
modified: 2025-02-23
type: Concept
in scheme: v3
change note: Version 4.1.0

Ukrainian greyromantic people
alternative label: Greyromantic Ukrainians
comment: Greyromantic people who are ethnically Ukrainian or have Ukrainian nationality.
broader: Ukrainian LGBTQ+ people
has top concept: LGBTQ+ people
issued: 2024-06-19
modified: 2025-02-23
type: Concept
in scheme: v3
change note: Version 4.1.0

Ukrainian aromantic people
alternative label: Aromantic Ukrainians
comment: Aromantic people who are ethnically Ukrainian or have Ukrainian nationality.
broader: Ukrainian LGBTQ+ people
has top concept: LGBTQ+ people
issued: 2024-06-19
modified: 2025-02-23
type: Concept
in scheme: v3
change note: Version 4.1.0

LGBTQ+ Unitarian Universalists
alternative label: LGBTQ Unitarian Universalists
alternative label: Unitarian Universalist LGBTQ+ people
comment: LGBTQ+ people who are members of the Unitarian Universalist church.
broader: LGBTQ+ African religions
narrower: Lesbian Unitarian Universalists
narrower: Gay Unitarian Universalists
narrower: Bisexual Unitarian Universalists
narrower: Transgender Unitarian Universalists
narrower: Queer Unitarian Universalists
narrower: Demisexual Unitarian Universalists
narrower: Megasexual Unitarian Universalists
narrower: Intersex Unitarian Universalists
narrower: Aromantic Unitarian Universalists
narrower: Greyromantic Unitarian Universalists
narrower: Non-binary Unitarian Universalists
has top concept: LGBTQ+ African religions
issued: 2024-06-19
modified: 2025-02-23
type: Concept
in scheme: v3
change note: Version 4.1.0

Lesbian Unitarian Universalists
alternative label: Unitarian Universalist lesbians
comment: Lesbians who are members of the Unitarian Universalist church.
broader: LGBTQ+ Unitarian Universalists
has top concept: LGBTQ+ African religions
issued: 2024-06-19
modified: 2025-02-23
type: Concept
in scheme: v3
change note: Version 4.1.0

Gay Unitarian Universalists
alternative label: Unitarian Universalist gay men
comment: Gay men who are members of the Unitarian Universalist church.
broader: LGBTQ+ Unitarian Universalists
has top concept: LGBTQ+ African religions
issued: 2024-06-19
modified: 2025-02-23
type: Concept
in scheme: v3
change note: Version 4.1.0

Bisexual Unitarian Universalists
alternative label: Unitarian Universalist bisexual people
alternative label: Unitarian Universalist bisexuals
comment: Bisexual people who are members of the Unitarian Universalist church.
broader: LGBTQ+ Unitarian Universalists
has top concept: LGBTQ+ African religions
issued: 2024-06-19
modified: 2025-02-23
type: Concept
in scheme: v3
change note: Version 4.1.0

Transgender Unitarian Universalists
alternative label: Trans Unitarian Universalists
alternative label: Unitarian Universalist trans people
alternative label: Unitarian Universalist transgender people
comment: Transgender people who are members of the Unitarian Universalist church.
broader: LGBTQ+ Unitarian Universalists
has top concept: LGBTQ+ African religions
issued: 2024-06-19
modified: 2025-02-23
type: Concept
in scheme: v3
change note: Version 4.1.0

Queer Unitarian Universalists
alternative label: Unitarian Universalist queer people
comment: Queer people who are members of the Unitarian Universalist church.
broader: LGBTQ+ Unitarian Universalists
has top concept: LGBTQ+ African religions
issued: 2024-06-19
modified: 2025-02-23
type: Concept
in scheme: v3
change note: Version 4.1.0

Demisexual Unitarian Universalists
alternative label: Unitarian Universalist demisexual people
alternative label: Unitarian Universalist demisexuals
comment: Demisexual people who are members of the Unitarian Universalist church.
broader: LGBTQ+ Unitarian Universalists
has top concept: LGBTQ+ African religions
issued: 2024-06-19
modified: 2025-02-23
type: Concept
in scheme: v3
change note: Version 4.1.0

Megasexual Unitarian Universalists
alternative label: Unitarian Universalist megasexual people
alternative label: Unitarian Universalist megasexuals
comment: Megasexual people who are members of the Unitarian Universalist church.
broader: LGBTQ+ Unitarian Universalists
has top concept: LGBTQ+ African religions
issued: 2024-06-19
modified: 2025-02-23
type: Concept
in scheme: v3
change note: Version 4.1.0

Intersex Unitarian Universalists
alternative label: Unitarian Universalist intersex people
comment: Intersex people who are members of the Unitarian Universalist church.
broader: LGBTQ+ Unitarian Universalists
has top concept: LGBTQ+ African religions
issued: 2024-06-19
modified: 2025-02-23
type: Concept
in scheme: v3
change note: Version 4.1.0

Aromantic Unitarian Universalists
alternative label: Unitarian Universalist aromantic people
comment: Aromantic people who are members of the Unitarian Universalist church.
broader: LGBTQ+ Unitarian Universalists
has top concept: LGBTQ+ African religions
issued: 2024-06-19
modified: 2025-02-23
type: Concept
in scheme: v3
change note: Version 4.1.0

Greyromantic Unitarian Universalists
alternative label: Unitarian Universalist greyromantic people
comment: Greyromantic people who are members of the Unitarian Universalist church.
broader: LGBTQ+ Unitarian Universalists
has top concept: LGBTQ+ African religions
issued: 2024-06-19
modified: 2025-02-23
type: Concept
in scheme: v3
change note: Version 4.1.0

Non-binary Unitarian Universalists
alternative label: Nonbinary Unitarian Universalists
alternative label: Unitarian Universalist non-binary people
alternative label: Unitarian Universalist nonbinary people
comment: Non-binary people who are members of the Unitarian Universalist church.
broader: LGBTQ+ Unitarian Universalists
has top concept: LGBTQ+ African religions
issued: 2024-06-19
modified: 2025-02-23
type: Concept
in scheme: v3
change note: Version 4.1.0

Drag shows
alternative label: Drag performances
comment: Performances by a single drag performer or a group of drag performers, which often include singing or lip syncing, dance routines, and comedy skits.
broader: Europride
related: Drag
related: Drag bars
related: Drag performers
related: Female impersonation shows
related: Male impersonation shows
has top concept: Europride
issued: 2024-06-19
modified: 2025-02-23
type: Concept
in scheme: v3
change note: Version 4.1.0

Drag pageants
comment: Events styled after traditional beauty pageants or contests in which contestants, typically drag queens, female impersonators, and trans women, compete in a range of categories to win a prize or title.
broader: Europride
related: Drag
related: Drag bars
related: Drag performers
has top concept: Europride
issued: 2024-06-19
modified: 2025-02-23
type: Concept
in scheme: v3
change note: Version 4.1.0

Reproductive health care for LGBTQ+ people
alternative label: LGBTQ+ reproductive health care
alternative label: Reproductive health care (LGBTQ)
alternative label: Reproductive healthcare for LGBTQ+ people
comment: Access to and experiences with reproductive health care for LGBTQ+ people. Reproductive health care includes birth control, abortion, assisted reproduction, and prenatal and obstetric care.
broader: Health care for LGBTQ+ people
narrower: Reproductive health care for non-binary people
narrower: Reproductive health care for transgender people
narrower: Abortion
narrower: Abortion access for LGBTQ+ people
narrower: Reproductive health care for intersex people
related: Abortion access for LGBTQ+ people
related: Reproductive health care for Two-Spirit people
related: Reproductive rights
related: Reproductive justice
has top concept: Health care for LGBTQ+ people
issued: 2024-06-19
modified: 2026-03-05
type: Concept
in scheme: v3
change note: Version 4.1.0

Reproductive health care for non-binary people
alternative label: Non-binary reproductive health care
alternative label: Reproductive health care for nonbinary people
alternative label: Reproductive healthcare for non-binary people
comment: Access to and experiences with reproductive health care for non-binary people. Reproductive health care includes birth control, abortion, assisted reproduction, and prenatal and obstetric care.
broader: Reproductive health care for LGBTQ+ people
has top concept: Health care for LGBTQ+ people
issued: 2024-06-19
modified: 2025-02-23
type: Concept
in scheme: v3
change note: Version 4.1.0

Reproductive health care for transgender people
alternative label: Reproductive health care for trans people
alternative label: Reproductive healthcare for transgender people
alternative label: Trans reproductive health care
alternative label: Transgender reproductive health care
comment: Access to and experiences with reproductive health care for transgender people. Reproductive health care includes birth control, abortion, assisted reproduction, and prenatal and obstetric care.
broader: Reproductive health care for LGBTQ+ people
has top concept: Health care for LGBTQ+ people
issued: 2024-06-19
modified: 2025-02-23
type: Concept
in scheme: v3
change note: Version 4.1.0

Pregnant people
comment: People who are pregnant, meaning that a fertilized egg is developing in their uterus.
narrower: Pregnant men
narrower: Pregnant women
narrower: Pregnant intersex people
narrower: Pregnant transgender people
narrower: Pregnant non-binary people
narrower: Pregnant Two-Spirit people
narrower: Pregnant māhū
issued: 2024-06-19
modified: 2025-02-23
type: Concept
in scheme: v3
change note: Version 4.1.0

Abortion
alternative label: Pregnancy termination
alternative label: Termination of pregnancy
comment: The termination of a pregnancy.
broader: Reproductive health care for LGBTQ+ people
related: Abortion access for LGBTQ+ people
related: Reproductive rights
has top concept: Health care for LGBTQ+ people
issued: 2024-06-19
modified: 2026-03-03
type: Concept
in scheme: v3
change note: Version 4.1.0

Abortion access for LGBTQ+ people
comment: Term used to describe the various aspects determining whether abortions are accessible to LGBTQ+ people in a given location. Factors determining accessibility include legality, safety, privacy, financial cost, freedom of travel, etc.
broader: Reproductive health care for LGBTQ+ people
related: Reproductive health care for LGBTQ+ people
related: Abortion
related: Bodily autonomy
related: Reproductive health care for Two-Spirit people
has top concept: Health care for LGBTQ+ people
issued: 2024-06-19
modified: 2026-03-03
type: Concept
in scheme: v3
change note: Version 4.1.0

Bodily autonomy
alternative label: Right to bodily autonomy
comment: An individual's right to make informed decisions about their own body without external influence or coercion.
related: Abortion access for LGBTQ+ people
related: Reproductive rights
related: Reproductive justice
issued: 2024-06-19
modified: 2025-02-23
type: Concept
in scheme: v3
change note: Version 4.1.0

Reproductive health care for Two-Spirit people
alternative label: 2S reproductive health care
alternative label: Reproductive health care for 2S people
alternative label: Reproductive health care for Two Spirit people
alternative label: Reproductive health care for Two Spirited people
alternative label: Reproductive health care for Two-Spirited people
alternative label: Two Spirit reproductive health care
alternative label: Two Spirited reproductive health care
alternative label: Two-Spirited reproductive health care
comment: Access to and experiences with reproductive health care for Two-Spirit people. Reproductive health care includes birth control, abortion, assisted reproduction, and prenatal and obstetric care.
related: Reproductive health care for LGBTQ+ people
related: Abortion access for LGBTQ+ people
issued: 2024-06-19
modified: 2026-03-05
type: Concept
in scheme: v3
change note: Version 4.1.0

Reproductive rights
comment: Legal, social, or ethical principles of freedom around reproductive healthcare and decision-making. Often used to refer to an individual's right to bodily autonomy and access to legal and safe birth control, abortion, assisted reproduction, and prenatal and obstetric care.
related: Reproductive health care for LGBTQ+ people
related: Abortion
related: Bodily autonomy
related: Reproductive justice
issued: 2024-07-11
modified: 2025-02-23
type: Concept
in scheme: v3
change note: Version 4.1.0

Rural LGBTQ+ people
alternative label: Rural LGBTQ people
alternative label: Rural people (LGBTQ+)
comment: LGBTQ+ people who are currently living in or consider themselves to be from agricultural or forested areas with low population densities.
broader: LGBTQ+ people
narrower: Rural lesbians
narrower: Rural gay men
narrower: Rural bisexual people
narrower: Rural transgender people
narrower: Rural queer people
narrower: Rural asexual people
narrower: Rural aromantic people
narrower: Rural intersex people
narrower: Rural non-binary people
related: Rural Two-Spirit people
has top concept: LGBTQ+ people
issued: 2024-07-11
modified: 2025-02-23
type: Concept
in scheme: v3
change note: Version 4.1.0

Rural lesbians
comment: Lesbians who are currently living in or consider themselves to be from agricultural or forested areas with low population densities.
broader: Rural LGBTQ+ people
has top concept: LGBTQ+ people
issued: 2024-07-11
modified: 2025-02-23
type: Concept
in scheme: v3
change note: Version 4.1.0

Rural gay men
alternative label: Gay rural men
comment: Gay men who are currently living in or consider themselves to be from agricultural or forested areas with low population densities.
broader: Rural LGBTQ+ people
has top concept: LGBTQ+ people
issued: 2024-07-11
modified: 2025-02-23
type: Concept
in scheme: v3
change note: Version 4.1.0

Rural bisexual people
alternative label: Bisexual rural people
comment: Bisexual people who are currently living in or consider themselves to be from agricultural or forested areas with low population densities.
broader: Rural LGBTQ+ people
has top concept: LGBTQ+ people
issued: 2024-07-11
modified: 2025-02-23
type: Concept
in scheme: v3
change note: Version 4.1.0

Rural transgender people
alternative label: Rural trans people
alternative label: Trans rural people
alternative label: Transgender rural people
comment: Transgender people who are currently living in or consider themselves to be from agricultural or forested areas with low population densities.
broader: Rural LGBTQ+ people
has top concept: LGBTQ+ people
issued: 2024-07-11
modified: 2025-02-23
type: Concept
in scheme: v3
change note: Version 4.1.0

Rural queer people
alternative label: Queer rural people
comment: Queer people who are currently living in or consider themselves to be from agricultural or forested areas with low population densities.
broader: Rural LGBTQ+ people
has top concept: LGBTQ+ people
issued: 2024-07-11
modified: 2025-02-23
type: Concept
in scheme: v3
change note: Version 4.1.0

Rural asexual people
alternative label: Asexual rural people
comment: Asexual people who are currently living in or consider themselves to be from agricultural or forested areas with low population densities.
broader: Rural LGBTQ+ people
has top concept: LGBTQ+ people
issued: 2024-07-11
modified: 2025-02-23
type: Concept
in scheme: v3
change note: Version 4.1.0

Rural aromantic people
alternative label: Aromantic rural people
comment: Aromantic people who are currently living in or consider themselves to be from agricultural or forested areas with low population densities.
broader: Rural LGBTQ+ people
has top concept: LGBTQ+ people
issued: 2024-07-11
modified: 2025-02-23
type: Concept
in scheme: v3
change note: Version 4.1.0

Rural intersex people
alternative label: Intersex rural people
comment: Intersex people who are currently living in or consider themselves to be from agricultural or forested areas with low population densities.
broader: Rural LGBTQ+ people
has top concept: LGBTQ+ people
issued: 2024-07-11
modified: 2025-02-23
type: Concept
in scheme: v3
change note: Version 4.1.0

Rural non-binary people
alternative label: Non-binary rural people
alternative label: Nonbinary rural people
alternative label: Rural nonbinary people
comment: Non-binary people who are currently living in or consider themselves to be from agricultural or forested areas with low population densities.
broader: Rural LGBTQ+ people
has top concept: LGBTQ+ people
issued: 2024-07-11
modified: 2025-02-23
type: Concept
in scheme: v3
change note: Version 4.1.0

Rural Two-Spirit people
alternative label: 2S rural people
alternative label: Rural 2S people
alternative label: Rural Two Spirit people
alternative label: Rural Two Spirited people
alternative label: Rural Two-Spirited people
alternative label: Two Spirit rural people
alternative label: Two Spirited rural people
alternative label: Two-Spirit rural people
alternative label: Two-Spirited rural people
comment: Two-Spirit people who are currently living in or consider themselves to be from agricultural or forested areas with low population densities.
broader: Two-Spirit people
related: Rural LGBTQ+ people
has top concept: Gender
issued: 2024-07-11
modified: 2025-02-23
type: Concept
in scheme: v3
change note: Version 4.1.0

White non-binary people
alternative label: Non-binary Caucasian people
alternative label: Non-binary Caucasians
alternative label: Non-binary white people
alternative label: Nonbinary Caucasian people
alternative label: Nonbinary Caucasians
alternative label: Nonbinary white people
alternative label: White nonbinary people
comment: Non-binary people who are white.
broader: White LGBTQ+ people
has top concept: White LGBTQ+ people
issued: 2024-07-11
modified: 2025-02-23
type: Concept
in scheme: v3
change note: Version 4.1.0

Arab American LGBTQ+ people
alternative label: Arab American people (LGBTQ
alternative label: Arab Americans (LGBTQ)
alternative label: LGBTQ+ Arab Americans
comment: LGBTQ+ people who are descended from Arab peoples and were born in the United States, or LGBTQ+ people born in Arab countries who live in or have a strong connection to the United States. Do not conflate with Muslim people.
broader: Arab LGBTQ+ people
narrower: Arab American lesbians
narrower: Arab American gay men
narrower: Arab American bisexual people
narrower: Arab American transgender people
narrower: Arab American queer people
narrower: Arab American non-binary people
narrower: Arab American asexual people
narrower: Arab American intersex people
narrower: Arab American aromantic people
has top concept: LGBTQ+ people
issued: 2024-07-11
modified: 2025-02-23
type: Concept
in scheme: v3
change note: Version 4.1.0

Arab American lesbians
alternative label: Lesbian Arab American people
alternative label: Lesbian Arab Americans
comment: Lesbians who are descended from Arab peoples and were born in the United States, or lesbians born in Arab countries who live in or have a strong connection to the United States. Do not conflate with Muslim people.
broader: Arab American LGBTQ+ people
has top concept: LGBTQ+ people
issued: 2024-07-11
modified: 2025-02-23
type: Concept
in scheme: v3
change note: Version 4.1.0

Arab American gay men
alternative label: Gay Arab American men
alternative label: Gay Arab Americans
comment: Gay men who are descended from Arab peoples and were born in the United States, or gay men born in Arab countries who live in or have a strong connection to the United States. Do not conflate with Muslim people.
broader: Arab American LGBTQ+ people
has top concept: LGBTQ+ people
issued: 2024-07-11
modified: 2025-02-23
type: Concept
in scheme: v3
change note: Version 4.1.0

Arab American bisexual people
alternative label: Bisexual Arab American people
alternative label: Bisexual Arab Americans
comment: Bisexual people who are descended from Arab peoples and were born in the United States, or bisexual people born in Arab countries who live in or have a strong connection to the United States. Do not conflate with Muslim people.
broader: Arab American LGBTQ+ people
has top concept: LGBTQ+ people
issued: 2024-07-11
modified: 2025-02-23
type: Concept
in scheme: v3
change note: Version 4.1.0

Arab American transgender people
alternative label: Transgender Arab American people
alternative label: Transgender Arab Americans
comment: Transgender people who are descended from Arab peoples and were born in the United States, or transgender people born in Arab countries who live in or have a strong connection to the United States. Do not conflate with Muslim people.
broader: Arab American LGBTQ+ people
has top concept: LGBTQ+ people
issued: 2024-07-11
modified: 2025-02-23
type: Concept
in scheme: v3
change note: Version 4.1.0

Arab American queer people
alternative label: Queer Arab American people
alternative label: Queer Arab Americans
comment: Queer people who are descended from Arab peoples and were born in the United States, or Queer people born in Arab countries who live in or have a strong connection to the United States. Do not conflate with Muslim people.
broader: Arab American LGBTQ+ people
has top concept: LGBTQ+ people
issued: 2024-07-11
modified: 2025-02-23
type: Concept
in scheme: v3
change note: Version 4.1.0

Arab American non-binary people
alternative label: Arab American nonbinary people
alternative label: Non-binary Arab American people
alternative label: Non-binary Arab Americans
alternative label: Nonbinary Arab American people
alternative label: Nonbinary Arab Americans
comment: Non-binary people who are descended from Arab peoples and were born in the United States, or non-binary people born in Arab countries who live in or have a strong connection to the United States. Do not conflate with Muslim people.
broader: Arab American LGBTQ+ people
has top concept: LGBTQ+ people
issued: 2024-07-11
modified: 2025-02-23
type: Concept
in scheme: v3
change note: Version 4.1.0

Arab American asexual people
alternative label: Asexual Arab American people
alternative label: Asexual Arab Americans
comment: Asexual people who are descended from Arab peoples and were born in the United States, or asexual people born in Arab countries who live in or have a strong connection to the United States. Do not conflate with Muslim people.
broader: Arab American LGBTQ+ people
has top concept: LGBTQ+ people
issued: 2024-07-11
modified: 2025-02-23
type: Concept
in scheme: v3
change note: Version 4.1.0

Arab American intersex people
alternative label: Intersex Arab American people
alternative label: Intersex Arab Americans
comment: Intersex people who are descended from Arab peoples and were born in the United States, or intersex people born in Arab countries who live in or have a strong connection to the United States. Do not conflate with Muslim people.
broader: Arab American LGBTQ+ people
has top concept: LGBTQ+ people
issued: 2024-07-11
modified: 2025-02-23
type: Concept
in scheme: v3
change note: Version 4.1.0

Arab American aromantic people
alternative label: Aromantic Arab American people
alternative label: Aromantic Arab Americans
comment: Aromantic people who are descended from Arab peoples and were born in the United States, or aromantic people born in Arab countries who live in or have a strong connection to the United States. Do not conflate with Muslim people.
broader: Arab American LGBTQ+ people
has top concept: LGBTQ+ people
issued: 2024-07-11
modified: 2025-02-23
type: Concept
in scheme: v3
change note: Version 4.1.0

Arab aromantic people
alternative label: Aromantic Arab people
alternative label: Aromantic Arabs
comment: Aromantic people who are from Arab countries and/or are descended from Arab peoples. Do not conflate with Muslim people.
broader: Arab LGBTQ+ people
has top concept: LGBTQ+ people
issued: 2024-07-11
modified: 2025-02-23
type: Concept
in scheme: v3
change note: Version 4.1.0

Aboriginal Australian non-binary people
alternative label: Non-binary Aboriginal Australian people
alternative label: Non-binary Aboriginal Australians
alternative label: Nonbinary Aboriginal Australian people
alternative label: Nonbinary Aboriginal Australians
comment: Non-binary people who belong to one or more of the various Indigenous peoples of Australia; do not use to refer to the Indigenous people of the Torres Strait Islands, who are considered ethnically and culturally distinct. Only use to describe people who identify as Aboriginal Australian.
broader: Aboriginal Australian LGBTQ+ people
has top concept: LGBTQ+ people
issued: 2024-07-11
modified: 2025-02-23
type: Concept
in scheme: v3
change note: Version 4.1.0

Assamese non-binary people
alternative label: Non-binary Asomiya
alternative label: Non-binary Assamese people
alternative label: Nonbinary Asomiya
alternative label: Nonbinary Assamese people
comment: Non-binary people who are a part of the socio-ethnic Assamese peoples, speak the Assamese language, or reside in the Indian state of Assam.
broader: Assamese LGBTQ+ people
has top concept: LGBTQ+ people
issued: 2024-07-11
modified: 2025-02-23
type: Concept
in scheme: v3
change note: Version 4.1.0

Awadhi non-binary people
alternative label: Non-binary Awadhi people
alternative label: Non-binary Awadhis
alternative label: Nonbinary Awadhi people
alternative label: Nonbinary Awadhis
comment: Non-binary people who speak the Awadhi dialect and reside in or are descended from those who resided in the Awadh region of Uttar Pradesh.
broader: Awadhi LGBTQ+ people
has top concept: LGBTQ+ people
issued: 2024-07-11
modified: 2025-02-23
type: Concept
in scheme: v3
change note: Version 4.1.0

Bengali non-binary people
alternative label: Non-binary Bengali people
alternative label: Non-binary Bengalis
alternative label: Nonbinary Bengali people
alternative label: Nonbinary Bengalis
comment: Non-binary people who speak the Bengali language or are of Bengali descent.
broader: Bengali LGBTQ+ people
has top concept: LGBTQ+ people
issued: 2024-07-11
modified: 2025-02-23
type: Concept
in scheme: v3
change note: Version 4.1.0

Bhil non-binary people
alternative label: Bheel non-binary people
alternative label: Bheel nonbinary people
alternative label: Non-binary Bhils
alternative label: Nonbinary Bhils
comment: Non-binary people who speak the Bhil language and belong to or are descended from the Bhil tribal group.
broader: Bhil LGBTQ+ people
has top concept: LGBTQ+ people
issued: 2024-07-11
modified: 2025-02-23
type: Concept
in scheme: v3
change note: Version 4.1.0

Bhojpuri non-binary people
alternative label: Non-binary Bhojpuri people
alternative label: Non-binary Bhojpuriyas
alternative label: Nonbinary Bhojpuri people
alternative label: Nonbinary Bhojpuriyas
comment: Non-binary people who speak the Bhojpuri language and live in or are descended from those who inhabited the Bhojpuri-Purvanchal region of India and Nepal.
broader: Bhojpuri LGBTQ+ people
has top concept: LGBTQ+ people
issued: 2024-07-11
modified: 2025-02-23
type: Concept
in scheme: v3
change note: Version 4.1.0

Biracial non-binary people
alternative label: Bi-racial non-binary people
alternative label: Bi-racial nonbinary people
alternative label: Non-binary bi-racial people
alternative label: Non-binary biracial people
alternative label: Nonbinary bi-racial people
alternative label: Nonbinary biracial people
comment: Non-binary people who belong to two or more racial groups. Only use to describe people who self-identify as biracial.
broader: Biracial LGBTQ+ people
has top concept: LGBTQ+ people
issued: 2024-07-11
modified: 2025-02-23
type: Concept
in scheme: v3
change note: Version 4.1.0

Black non-binary people
alternative label: Black nonbinary people
alternative label: Non-binary Black people
alternative label: Nonbinary Black people
comment: Black people who are non-binary. Use only for individuals who self-identity as Black. Follow the individual’s preference for African American or Black whenever possible.
broader: Black LGBTQ+ people
has top concept: LGBTQ+ people
issued: 2024-07-11
modified: 2025-02-23
type: Concept
in scheme: v3
change note: Version 4.1.0

Chakma non-binary people
alternative label: Chakma nonbinary people
alternative label: Non-binary Chakma people
alternative label: Nonbinary Chakma people
comment: Non-binary people who belong to or are descended from the Chakma tribal group.
broader: Chakma LGBTQ+ people
has top concept: LGBTQ+ people
issued: 2024-07-11
modified: 2025-02-23
type: Concept
in scheme: v3
change note: Version 4.1.0

Chicano/a/x non-binary people
alternative label: Chicana non-binary people
alternative label: Chicano non-binary people
alternative label: Chicanx non-binary people
alternative label: Non-binary Chicanas
alternative label: Non-binary Chicanos
alternative label: Non-binary Chicanx people
alternative label: Nonbinary Chicanas
alternative label: Nonbinary Chicanos
alternative label: Nonbinary Chicanx people
comment: Non-binary people of Mexican descent born in the United States; only use to describe people who self-identify as Chicano, Chicana, or Chicanx. Do not conflate with Latino/a/x or Hispanic people.
broader: Chicano/a/x LGBTQ+ people
has top concept: LGBTQ+ people
issued: 2024-07-11
modified: 2025-02-23
type: Concept
in scheme: v3
change note: Version 4.1.0

Closeted non-binary people
alternative label: Closeted nonbinary people
comment: Non-binary people who do not identify as such to others.
broader: Closeted LGBTQ+ people
has top concept: LGBTQ+ people
issued: 2024-07-11
modified: 2025-02-23
type: Concept
in scheme: v3
change note: Version 4.1.0

Daughters of non-binary people
alternative label: Daughters of nonbinary people
comment: Daughters who have one or more non-binary parent.
broader: Daughters of LGBTQ+ people
has top concept: Family members
issued: 2024-07-11
modified: 2025-02-23
type: Concept
in scheme: v3
change note: Version 4.1.0

Dogra non-binary people
alternative label: Dogra nonbinary people
alternative label: Non-binary Dogra people
alternative label: Non-binary Dogras
alternative label: Nonbinary Dogra people
alternative label: Nonbinary Dogras
comment: Non-binary people who are of the Dogra people of India and Pakistan and speak the Dogri language.
broader: Dogra LGBTQ+ people
has top concept: LGBTQ+ people
issued: 2024-07-11
modified: 2025-02-23
type: Concept
in scheme: v3
change note: Version 4.1.0

Fathers of non-binary people
alternative label: Fathers of nonbinary people
comment: People who assume the role of father to non-binary people. Only use to describe individuals who identify as fathers.
broader: Fathers of LGBTQ+ people
has top concept: Family members
issued: 2024-07-11
modified: 2025-02-23
type: Concept
in scheme: v3
change note: Version 4.1.0

Garhwali non-binary people
alternative label: Garhwali nonbinary people
alternative label: Non-binary Garhwali people
alternative label: Non-binary Garhwalis
alternative label: Nonbinary Garhwali people
alternative label: Nonbinary Garhwalis
comment: Non-binary people who belong to or are descended from those native to Garhwal in Uttarakhand and who speak Garhwali.
broader: Garhwali LGBTQ+ people
has top concept: LGBTQ+ people
issued: 2024-07-11
modified: 2025-02-23
type: Concept
in scheme: v3
change note: Version 4.1.0

Gujarati non-binary people
alternative label: Gujarati nonbinary people
alternative label: Non-binary Gujarati people
alternative label: Non-binary Gujaratis
alternative label: Nonbinary Gujarati people
alternative label: Nonbinary Gujaratis
comment: Non-binary people who reside in or are descended from those indigenous to the Indian state of Gujarat.
broader: Gujarati LGBTQ+ people
has top concept: LGBTQ+ people
issued: 2024-07-11
modified: 2025-02-23
type: Concept
in scheme: v3
change note: Version 4.1.0

Haryanvi non-binary people
alternative label: Haryanvi nonbinary people
alternative label: Non-binary Haryanvi people
alternative label: Non-binary Haryanvis
alternative label: Nonbinary Haryanvi people
alternative label: Nonbinary Haryanvis
comment: Non-binary people who are indigenous to or descended from those indigenous to what is now the Indian state of Haryana. This term can also apply to those who currently reside in Haryana.
broader: Haryanvi LGBTQ+ people
has top concept: LGBTQ+ people
issued: 2024-07-11
modified: 2025-02-23
type: Concept
in scheme: v3
change note: Version 4.1.0

Inuit non-binary people
alternative label: Inuit nonbinary people
alternative label: Non-binary Inuit people
alternative label: Non-binary Inuit
alternative label: Nonbinary Inuit people
alternative label: Nonbinary Inuit
comment: Non-binary people who are Inuit, or part of several Indigenous peoples inhabiting the Inuit homeland in the Arctic and subarctic regions of Greenland, Canada, and Alaska. Only use for people who identify as Inuit.
broader: Inuit LGBTQ+ people
has top concept: LGBTQ+ people
issued: 2024-07-11
modified: 2025-02-23
type: Concept
in scheme: v3
change note: Version 4.1.0

Jewish non-binary people
alternative label: Jewish nonbinary people
alternative label: Non-binary Jewish people
alternative label: Non-binary Jews
alternative label: Nonbinary Jewish people
alternative label: Nonbinary Jews
comment: Non-binary people who are Jewish.
broader: Jewish LGBTQ+ people
has top concept: LGBTQ+ people
issued: 2024-07-11
modified: 2025-02-23
type: Concept
in scheme: v3
change note: Version 4.1.0

Kalash non-binary people
alternative label: Kalash nonbinary people
alternative label: Non-binary Kalash people
alternative label: Non-binary Kalasha
alternative label: Nonbinary Kalash people
alternative label: Nonbinary Kalasha
comment: Non-binary people who belong to the indigenous Kalasha people and reside in the Chitral District of Khyber-Pakhtunkhwa province in Pakistan.
broader: Kalash LGBTQ+ people
has top concept: LGBTQ+ people
issued: 2024-07-11
modified: 2025-02-23
type: Concept
in scheme: v3
change note: Version 4.1.0

Kānaka Maoli non-binary people
alternative label: Kanaka Maoli non-binary people
alternative label: Kanaka Maoli nonbinary people
alternative label: Kānaka Maoli nonbinary people
alternative label: Non-binary Kanaka Maoli
alternative label: Non-binary Kānaka Maoli
alternative label: Nonbinary Kanaka Maoli
alternative label: Nonbinary Kānaka Maoli
comment: Non-binary people who are part of the Indigenous people of Mokupuni o Hawai‘i, or the Hawaiian Islands; only use to refer to people who identify as Kanaka Maoli.
broader: Kānaka Maoli LGBTQ+ people
has top concept: LGBTQ+ people
issued: 2024-07-11
modified: 2025-02-23
type: Concept
in scheme: v3
change note: Version 4.1.0

Kashmiri non-binary people
alternative label: Kashmiri nonbinary people
alternative label: Non-binary Kashmiri people
alternative label: Non-binary Kashmiris
alternative label: Nonbinary Kashmiri people
alternative label: Nonbinary Kashmiris
comment: Non-binary people who live in or are descended from those native to the Kashmir Valley in the Indian subcontinent.
broader: Kashmiri LGBTQ+ people
has top concept: LGBTQ+ people
issued: 2024-07-11
modified: 2025-02-23
type: Concept
in scheme: v3
change note: Version 4.1.0

Kho non-binary people
alternative label: Chitrali non-binary people
alternative label: Chitrali nonbinary people
alternative label: Kho nonbinary people
alternative label: Non-binary Kho people
alternative label: Nonbinary Kho people
comment: Non-binary people who belong to or are descended from the people indigenous to the Chitral and Ghizer districts of modern-day Pakistan.
broader: Kho LGBTQ+ people
has top concept: LGBTQ+ people
issued: 2024-07-11
modified: 2025-02-23
type: Concept
in scheme: v3
change note: Version 4.1.0

Konkan non-binary people
alternative label: Konkan nonbinary people
alternative label: Non-binary Konkani people
alternative label: Non-binary Konkani
alternative label: Nonbinary Konkani people
alternative label: Nonbinary Konkani
comment: Non-binary people who are from or descended from those native to the Konkan region of the Indian subcontinent, and who speak any of the dialects of the Konkani language.
broader: Konkan LGBTQ+ people
has top concept: LGBTQ+ people
issued: 2024-07-11
modified: 2025-02-23
type: Concept
in scheme: v3
change note: Version 4.1.0

Kumaoni non-binary people
alternative label: Kumain non-binary people
alternative label: Kumain nonbinary people
alternative label: Kumaiye non-binary people
alternative label: Kumaiye nonbinary people
alternative label: Kumaoni nonbinary people
comment: Non-binary people who live mostly in Kumaon region in the Indian Himalayas. They might also speak the Kumaoni language as their first language.
broader: Kumaoni LGBTQ+ people
has top concept: LGBTQ+ people
issued: 2024-07-11
modified: 2025-02-23
type: Concept
in scheme: v3
change note: Version 4.1.0

Kutchi non-binary people
alternative label: Kutchi nonbinary people
alternative label: Non-binary Kutchi people
alternative label: Nonbinary Kutchi people
comment: Non-binary people who are from or are descended from those native to the Kutch district of the Indian state of Gujarat and the Sindh region of Pakistan.
broader: Kutchi LGBTQ+ people
has top concept: LGBTQ+ people
issued: 2024-07-11
modified: 2025-02-23
type: Concept
in scheme: v3
change note: Version 4.1.0

Latino/a/x non-binary people
alternative label: Latina non-binary people
alternative label: Latina nonbinary people
alternative label: Latino non-binary people
alternative label: Latino nonbinary people
alternative label: Latino/a/x nonbinary people
alternative label: Latinx non-binary people
alternative label: Latinx nonbinary people
alternative label: Non-binary Latinas
alternative label: Non-binary Latino/a/x people
alternative label: Non-binary Latinos
alternative label: Non-binary Latinx
alternative label: Nonbinary Latinas
alternative label: Nonbinary Latino/a/x people
alternative label: Nonbinary Latinos
alternative label: Nonbinary Latinx
comment: Latin American people who are non-binary; only use to describe individuals who self-identify as Latino, Latina, or Latinx. Do not conflate with Chicano/a/x or Hispanic.
broader: Latino/a/x LGBTQ+ people
has top concept: LGBTQ+ people
issued: 2024-07-11
modified: 2025-02-23
type: Concept
in scheme: v3
change note: Version 4.1.0

Maldivian non-binary people
alternative label: Dhivehin non-binary people
alternative label: Dhivehin nonbinary people
alternative label: Maldivian nonbinary people
alternative label: Non-binary Maldivians
alternative label: Nonbinary Maldivians
comment: Non-binary people who belong to or are descended from the people native to the Maldives (including the island of Minicoy) and speak the Maldivian language.
broader: Maldivian LGBTQ+ people
has top concept: LGBTQ+ people
issued: 2024-07-11
modified: 2025-02-23
type: Concept
in scheme: v3
change note: Version 4.1.0

Multiracial non-binary people
alternative label: Non-binary muti-racial people
alternative label: Multi-racial nonbinary people
alternative label: Multiracial nonbinary people
alternative label: Muti-racial non-binary people
alternative label: Non-binary multiracial people
alternative label: Nonbinary multi-racial people
alternative label: Nonbinary multiracial people
comment: Non-binary people who belong to two or more racial groups.
broader: Multiracial LGBTQ+ people
has top concept: LGBTQ+ people
issued: 2024-07-11
modified: 2025-02-23
type: Concept
in scheme: v3
change note: Version 4.1.0

Native American non-binary people
alternative label: American Indian non-binary people
alternative label: American Indian nonbinary people
alternative label: Native American nonbinary people
alternative label: Non-binary American Indians
alternative label: Non-binary Native Americans
alternative label: Nonbinary American Indians
alternative label: Nonbinary Native Americans
comment: People who are part of the Native peoples of the continental United States and Canada (excluding Inuit people) and self-identity as Non-binary. Do not conflate with Two-Spirit people. Use more specific terms when available.
broader: Native American LGBTQ+ people
has top concept: LGBTQ+ people
issued: 2024-07-11
modified: 2025-02-23
type: Concept
in scheme: v3
change note: Version 4.1.0

Pacific Islander American non-binary people
alternative label: Non-binary Pacific Islander Americans
alternative label: Nonbinary Pacific Islander Americans
alternative label: Pacific Islander American nonbinary people
comment: Non-binary people who identify as both Pacific Islanders (or of Pacific Islander ancestry) and American.
broader: Pacific Islander American LGBTQ+ people
has top concept: LGBTQ+ people
issued: 2024-07-11
modified: 2025-02-23
type: Concept
in scheme: v3
change note: Version 4.1.0

Papuan non-binary people
alternative label: Non-binary Papuans
alternative label: Nonbinary Papuans
alternative label: Papuan nonbinary people
comment: Non-binary people who are Papuan, or part of the Indigenous peoples of new Guinea; only use for people who identify as Papuan.
broader: Papuan LGBTQ+ people
has top concept: LGBTQ+ people
issued: 2024-07-11
modified: 2025-02-23
type: Concept
in scheme: v3
change note: Version 4.1.0

Romani non-binary people
alternative label: Non-binary Roma
alternative label: Nonbinary Roma
alternative label: Romani nonbinary people
comment: Non-binary people who are Romani, or part of the traditionally nomadic Indo-European people.
broader: Romani LGBTQ+ people
has top concept: LGBTQ+ people
issued: 2024-07-11
modified: 2026-02-23
type: Concept
in scheme: v3
change note: Version 4.1.0

South Asian non-binary people
alternative label: Non-binary South Asian people
alternative label: Non-binary South Asians
alternative label: Nonbinary South Asian people
alternative label: Nonbinary South Asians
alternative label: South Asian nonbinary people
comment: Non-binary people who belong to or are descended from the ethnolinguistic groups of South Asia.
broader: South Asian LGBTQ+ people
has top concept: LGBTQ+ people
issued: 2024-07-11
modified: 2025-02-23
type: Concept
in scheme: v3
change note: Version 4.1.0

Gay graphic novels
comment: Works consisting of sequential images often accompanied by text that generally contain stand-alone stories; used in reference to graphic novels focusing on gay male characters or themes.
broader: LGBTQ+ graphic novels
has top concept: Subcultures
issued: 2024-07-21
modified: 2025-02-23
type: Concept
in scheme: v3
change note: Version 4.1.0

Lesbian graphic novels
comment: Works consisting of sequential images often accompanied by text that generally contain stand-alone stories; used in reference to graphic novels focusing on lesbian characters or themes.
broader: LGBTQ+ graphic novels
has top concept: Subcultures
issued: 2024-07-21
modified: 2025-02-23
type: Concept
in scheme: v3
change note: Version 4.1.0

Bisexual graphic novels
comment: Works consisting of sequential images often accompanied by text that generally contain stand-alone stories. Use in reference to graphic novels focusing on bisexual characters or themes.
broader: LGBTQ+ graphic novels
has top concept: Subcultures
issued: 2024-07-21
modified: 2025-02-23
type: Concept
in scheme: v3
change note: Version 4.1.0

Megasexual graphic novels
comment: Works consisting of sequential images often accompanied by text that generally contain stand-alone stories; used in reference to graphic novels focusing on megasexual characters or themes.
broader: LGBTQ+ graphic novels
has top concept: Subcultures
issued: 2024-07-21
modified: 2025-02-23
type: Concept
in scheme: v3
change note: Version 4.1.0

Transgender graphic novels
comment: Works consisting of sequential images often accompanied by text that generally contain stand-alone stories; used in reference to graphic novels focusing on transgender characters or themes.
broader: LGBTQ+ graphic novels
has top concept: Subcultures
issued: 2024-07-21
modified: 2025-02-23
type: Concept
in scheme: v3
change note: Version 4.1.0

Queer graphic novels
comment: Works consisting of sequential images often accompanied by text that generally contain stand-alone stories; used in reference to graphic novels focusing on queer characters or themes.
broader: LGBTQ+ graphic novels
has top concept: Subcultures
issued: 2024-07-21
modified: 2025-02-23
type: Concept
in scheme: v3
change note: Version 4.1.0

Child sexual abuse content
alternative label: CSA content
alternative label: CSA materials
alternative label: Child pornography
alternative label: Child sexual abuse materials
comment: Images and videos that show children and youth who are under the age of consent engaged in sexual activities. While this term is not otherwise within the scope of the Homosaurus vocabulary, it is provided as an alternative to commonly used terms such as "Child pornography" in order to highlight that the production of such materials is a direct product of and contributes to the sexual abuse of children.
broader: Sexual violence
has top concept: Sexual violence
issued: 2024-07-21
modified: 2025-02-23
type: Concept
in scheme: v3
change note: Version 4.1.0

Queer painters
comment: Queer people who paint, either professionally or as a hobby.
broader: LGBTQ+ painters
has top concept: LGBTQ+ people
issued: 2024-07-31
modified: 2025-02-23
type: Concept
in scheme: v3
change note: Version 4.1.0

Intersex painters
comment: Intersex people who paint, either professionally or as a hobby.
broader: LGBTQ+ painters
has top concept: LGBTQ+ people
issued: 2024-07-31
modified: 2025-02-23
type: Concept
in scheme: v3
change note: Version 4.1.0

Two-Spirit painters
alternative label: 2S painters
alternative label: Two Spirit painters
alternative label: Two-Spirited painters
comment: Two-Spirit people who paint, either professionally or as a hobby.
broader: Two-Spirit artists
related: LGBTQ+ painters
has top concept: Gender
issued: 2024-07-31
modified: 2025-02-23
type: Concept
in scheme: v3
change note: Version 4.1.0

Non-binary painters
alternative label: Nonbinary painters
comment: Non-binary people who paint, either professionally or as a hobby.
broader: LGBTQ+ painters
has top concept: LGBTQ+ people
issued: 2024-07-31
modified: 2025-02-23
type: Concept
in scheme: v3
change note: Version 4.1.0

Aromantic painters
comment: Aromantic people who paint, either professionally or as a hobby.
broader: LGBTQ+ painters
has top concept: LGBTQ+ people
issued: 2024-07-31
modified: 2025-02-23
type: Concept
in scheme: v3
change note: Version 4.1.0

Asexual painters
comment: Asexual people who paint, either professionally or as a hobby.
broader: LGBTQ+ painters
has top concept: LGBTQ+ people
issued: 2024-07-31
modified: 2025-02-23
type: Concept
in scheme: v3
change note: Version 4.1.0

Demisexual painters
comment: Demisexual people who paint, either professionally or as a hobby.
broader: LGBTQ+ painters
has top concept: LGBTQ+ people
issued: 2024-07-31
modified: 2025-02-23
type: Concept
in scheme: v3
change note: Version 4.1.0

Greyromantic painters
comment: Greyromantic people who paint, either professionally or as a hobby.
broader: LGBTQ+ painters
has top concept: LGBTQ+ people
issued: 2024-07-31
modified: 2025-02-23
type: Concept
in scheme: v3
change note: Version 4.1.0

Megasexual painters
comment: Megasexual people who paint, either professionally or as a hobby.
broader: LGBTQ+ painters
has top concept: LGBTQ+ people
issued: 2024-07-31
modified: 2025-02-23
type: Concept
in scheme: v3
change note: Version 4.1.0

Non-binary athletes
alternative label: Non-binary sports players
alternative label: Non-binary sportspeople
alternative label: Non-binary sportspersons
alternative label: Nonbinary athletes
alternative label: Nonbinary sports players
alternative label: Nonbinary sportspeople
alternative label: Nonbinary sportspersons
comment: Professional or amateur/recreational sports players who are non-binary.
broader: LGBTQ+ athletes
has top concept: LGBTQ+ people
issued: 2024-07-31
modified: 2026-02-24
type: Concept
in scheme: v3
change note: Version 4.1.0

Rape culture
alternative label: Rape-supportive culture
comment: A term used in gender studies and feminist writing to describe a setting or culture in which sexual violence is pervasive and normalized due to attitudes about gender and sexuality.
broader: Feminist theory
related: Corrective rape
related: Sexual assault
related: Sexual violence
has top concept: Theories
issued: 2024-07-31
modified: 2025-02-23
type: Concept
in scheme: v3
change note: Version 4.1.0

Bicuriosity
alternative label: Bi-curiosity
alternative label: Bi-curious
alternative label: Bicurious
comment: A term used to describe the phenomena of heterosexual or hetero-presenting individuals expressing curiosity about exploring sexual relationships or experiences with other people of the same gender.
broader: Bisexuality
related: Heteronormativity
related: Heterosexuality
related: Questioning
has top concept: Sexual orientation
issued: 2024-07-31
modified: 2025-02-23
type: Concept
in scheme: v3
change note: Version 4.1.0

LGBTQ+ photographers
alternative label: LGBTQ photographers
alternative label: Photographers (LGBTQ)
comment: LGBTQ+ people who take photographs, either professionally or as a hobby.
broader: LGBTQ+ artists
narrower: Lesbian photographers
narrower: Gay photographers
narrower: Bisexual photographers
narrower: Transgender photographers
narrower: Queer photographers
narrower: Intersex photographers
narrower: Non-binary photographers
narrower: Aromantic photographers
narrower: Asexual photographers
narrower: Demisexual photographers
narrower: Greyromantic photographers
narrower: Megasexual photographers
related: Two-Spirit photographers
has top concept: LGBTQ+ people
issued: 2024-07-31
modified: 2025-02-23
type: Concept
in scheme: v3
change note: Version 4.1.0

Lesbian photographers
comment: Lesbians who take photographs, either professionally or as a hobby.
broader: LGBTQ+ photographers
has top concept: LGBTQ+ people
issued: 2024-07-31
modified: 2025-02-23
type: Concept
in scheme: v3
change note: Version 4.1.0

Gay photographers
preferred label: Parejas gay @es
comment: Gay men who take photographs, either professionally or as a hobby.
comment: Hombres gay que son compañeros románticos, sexuales o de juego de otra persona o personas. @es
broader: LGBTQ+ photographers
has top concept: LGBTQ+ people
issued: 2024-07-31
modified: 2025-02-23
type: Concept
in scheme: v3
change note: Version 4.1.0

Bisexual photographers
comment: Bisexual people who take photographs, either professionally or as a hobby.
broader: LGBTQ+ photographers
has top concept: LGBTQ+ people
issued: 2024-07-31
modified: 2025-02-23
type: Concept
in scheme: v3
change note: Version 4.1.0

Transgender photographers
alternative label: Trans photographers
comment: Trans people who take photographs, either professionally or as a hobby.
broader: LGBTQ+ photographers
has top concept: LGBTQ+ people
issued: 2024-07-31
modified: 2025-02-23
type: Concept
in scheme: v3
change note: Version 4.1.0

Queer photographers
comment: Queer people who take photographs, either professionally or as a hobby.
broader: LGBTQ+ photographers
has top concept: LGBTQ+ people
issued: 2024-07-31
modified: 2025-02-23
type: Concept
in scheme: v3
change note: Version 4.1.0

Intersex photographers
comment: Intersex people who take photographs, either professionally or as a hobby.
broader: LGBTQ+ photographers
has top concept: LGBTQ+ people
issued: 2024-07-31
modified: 2025-02-23
type: Concept
in scheme: v3
change note: Version 4.1.0

Two-Spirit photographers
alternative label: 2S photographers
alternative label: Two Spirit photographers
alternative label: Two-Spirited photographers
comment: Two-Spirit people who take photographs, either professionally or as a hobby.
broader: Two-Spirit artists
related: LGBTQ+ photographers
has top concept: Gender
issued: 2024-07-31
modified: 2025-02-23
type: Concept
in scheme: v3
change note: Version 4.1.0

Non-binary photographers
alternative label: Nonbinary photographers
comment: Non-binary people who take photographs, either professionally or as a hobby.
broader: LGBTQ+ photographers
has top concept: LGBTQ+ people
issued: 2024-07-31
modified: 2025-02-23
type: Concept
in scheme: v3
change note: Version 4.1.0

Aromantic photographers
comment: Aromantic people who take photographs, either professionally or as a hobby.
broader: LGBTQ+ photographers
has top concept: LGBTQ+ people
issued: 2024-07-31
modified: 2025-02-23
type: Concept
in scheme: v3
change note: Version 4.1.0

Asexual photographers
comment: Asexual people who take photographs, either professionally or as a hobby.
broader: LGBTQ+ photographers
has top concept: LGBTQ+ people
issued: 2024-07-31
modified: 2025-02-23
type: Concept
in scheme: v3
change note: Version 4.1.0

Demisexual photographers
comment: Demisexual people who take photographs, either professionally or as a hobby.
broader: LGBTQ+ photographers
has top concept: LGBTQ+ people
issued: 2024-07-31
modified: 2025-02-23
type: Concept
in scheme: v3
change note: Version 4.1.0

Greyromantic photographers
comment: Greyromantic people who take photographs, either professionally or as a hobby.
broader: LGBTQ+ photographers
has top concept: LGBTQ+ people
issued: 2024-07-31
modified: 2025-02-23
type: Concept
in scheme: v3
change note: Version 4.1.0

Megasexual photographers
comment: Megasexual people who take photographs, either professionally or as a hobby.
broader: LGBTQ+ photographers
has top concept: LGBTQ+ people
issued: 2024-07-31
modified: 2025-02-23
type: Concept
in scheme: v3
change note: Version 4.1.0

LGBTQ+ youth survivors of bullying
alternative label: Survivors of bullying (LGBTQ+)
comment: LGBTQ+ youth between the ages of 12-18 who have experienced and survived bullying due to their gender or sexual identity. Follow the individual's preference for "victims" or "survivors" whenever possible.
broader: LGBTQ+ youth
broader: LGBTQ+ survivors of bullying
narrower: Gay youth survivors of bullying
narrower: Lesbian youth survivors of bullying
narrower: Bisexual youth survivors of bullying
narrower: Queer youth survivors of bullying
narrower: Intersex youth survivors of bullying
narrower: Non-binary youth survivors of bullying
narrower: Transgender youth survivors of bullying
narrower: Asexual youth survivors of bullying
narrower: Aromantic youth survivors of bullying
narrower: Greyromantic youth survivors of bullying
related: Two-Spirit youth survivors of bullying
related: Social work with LGBTQ+ youth
has top concept: Youth
issued: 2024-07-31
modified: 2025-04-29
type: Concept
in scheme: v3
change note: Version 4.1.0

Gay youth survivors of bullying
comment: Gay male youth between the ages of 12-18 who have experienced and survived bullying due to their gender or sexual identity. Follow the individual's preference for "victims" or "survivors" whenever possible.
broader: LGBTQ+ youth survivors of bullying
has top concept: Youth
issued: 2024-07-31
modified: 2025-02-23
type: Concept
in scheme: v3
change note: Version 4.1.0

Lesbian youth survivors of bullying
comment: Lesbian youth between the ages of 12-18 who have experienced and survived bullying due to their gender or sexual identity. Follow the individual's preference for "victims" or "survivors" whenever possible.
broader: LGBTQ+ youth survivors of bullying
has top concept: Youth
issued: 2024-07-31
modified: 2025-02-23
type: Concept
in scheme: v3
change note: Version 4.1.0

Bisexual youth survivors of bullying
comment: Bisexual youth between the ages of 12-18 who have experienced and survived bullying due to their gender or sexual identity. Follow the individual's preference for "victims" or "survivors" whenever possible.
broader: LGBTQ+ youth survivors of bullying
has top concept: Youth
issued: 2024-07-31
modified: 2025-02-23
type: Concept
in scheme: v3
change note: Version 4.1.0

Queer youth survivors of bullying
comment: Queer youth between the ages of 12-18 who have experienced and survived bullying due to their gender or sexual identity. Follow the individual's preference for "victims" or "survivors" whenever possible.
broader: LGBTQ+ youth survivors of bullying
has top concept: Youth
issued: 2024-07-31
modified: 2025-02-23
type: Concept
in scheme: v3
change note: Version 4.1.0

Intersex youth survivors of bullying
comment: Intersex youth between the ages of 12-18 who have experienced and survived bullying due to their gender or sexual identity. Follow the individual's preference for "victims" or "survivors" whenever possible.
broader: LGBTQ+ youth survivors of bullying
has top concept: Youth
issued: 2024-07-31
modified: 2026-02-27
type: Concept
in scheme: v3
change note: Version 4.1.0

Non-binary youth survivors of bullying
alternative label: Nonbinary youth survivors of bullying
comment: Non-binary youth between the ages of 12-18 who have experienced and survived bullying due to their gender or sexual identity. Follow the individual's preference for "victims" or "survivors" whenever possible.
broader: LGBTQ+ youth survivors of bullying
has top concept: Youth
issued: 2024-07-31
modified: 2025-02-23
type: Concept
in scheme: v3
change note: Version 4.1.0

Transgender youth survivors of bullying
comment: Transgender youth between the ages of 12-18 who have experienced and survived bullying due to their gender or sexual identity. Follow the individual's preference for "victims" or "survivors" whenever possible.
broader: LGBTQ+ youth survivors of bullying
has top concept: Youth
issued: 2024-07-31
modified: 2025-02-23
type: Concept
in scheme: v3
change note: Version 4.1.0

Asexual youth survivors of bullying
comment: Asexual youth between the ages of 12-18 who have experienced and survived bullying due to their sexual identity. Follow the individual's preference for "victims" or "survivors" whenever possible.
broader: LGBTQ+ youth survivors of bullying
has top concept: Youth
issued: 2024-07-31
modified: 2025-02-23
type: Concept
in scheme: v3
change note: Version 4.1.0

Aromantic youth survivors of bullying
comment: Aromantic youth between the ages of 12-18 who have experienced and survived bullying due to their sexual identity. Follow the individual's preference for "victims" or "survivors" whenever possible.
broader: LGBTQ+ youth survivors of bullying
has top concept: Youth
issued: 2024-07-31
modified: 2025-02-23
type: Concept
in scheme: v3
change note: Version 4.1.0

Greyromantic youth survivors of bullying
comment: Greyromantic youth between the ages of 12-18 who have experienced and survived bullying due to their gender or sexual identity. Follow the individual's preference for "victims" or "survivors" whenever possible.
broader: LGBTQ+ youth survivors of bullying
has top concept: Youth
issued: 2024-07-31
modified: 2025-02-23
type: Concept
in scheme: v3
change note: Version 4.1.0

Two-Spirit youth survivors of bullying
alternative label: 2S youth survivors of bullying
alternative label: Two Spirited youth survivors of bullying
alternative label: Two-Spirited youth survivors of bullying
comment: Two Spirit youth between the ages of 12-18 who have experienced and survived bullying due to their gender or sexual identity; follow the individual's preference for "victims" or "survivors" whenever possible.
broader: Two-Spirit survivors of bullying
broader: Two-Spirit youth
related: LGBTQ+ youth survivors of bullying
has top concept: Gender
issued: 2024-07-31
modified: 2025-02-23
type: Concept
in scheme: v3
change note: Version 4.1.0

LGBTQ+ youth victims of bullying
comment: LGBTQ+ youth between the ages of 12-18 who have experienced bullying due to their gender or sexual identity and may or may not have survived; follow the individual's preference for "victims" or "survivors" whenever possible.
broader: LGBTQ+ youth
broader: LGBTQ+ victims of bullying
narrower: Asexual victims of bullying
narrower: Gay youth victims of bullying
narrower: Lesbian youth victims of bullying
narrower: Bisexual youth victims of bullying
narrower: Queer youth victims of bullying
narrower: Intersex youth victims of bullying
narrower: Non-binary youth victims of bullying
narrower: Transgender youth victims of bullying
narrower: Asexual youth victims of bullying
narrower: Aromantic youth victims of bullying
narrower: Greyromantic youth victims of bullying
related: Two-Spirit youth victims of bullying
related: Social work with LGBTQ+ youth
has top concept: Youth
issued: 2024-07-31
modified: 2025-04-29
type: Concept
in scheme: v3
change note: Version 4.1.0

Gay youth victims of bullying
comment: Gay male youth between the ages of 12-18 who have experienced bullying due to their gender or sexual identity and may or may not have survived. Follow the individual's preference for "victims" or "survivors" whenever possible.
broader: LGBTQ+ youth victims of bullying
has top concept: Youth
issued: 2024-07-31
modified: 2025-02-23
type: Concept
in scheme: v3
change note: Version 4.1.0

Lesbian youth victims of bullying
comment: Lesbian youth between the ages of 12-18 who have experienced bullying due to their gender or sexual identity and may or may not have survived. Follow the individual's preference for "victims" or "survivors" whenever possible.
broader: LGBTQ+ youth victims of bullying
has top concept: Youth
issued: 2024-07-31
modified: 2025-02-23
type: Concept
in scheme: v3
change note: Version 4.1.0

Bisexual youth victims of bullying
comment: Bisexual youth between the ages of 12-18 who have experienced bullying due to their gender or sexual identity and may or may not have survived. Follow the individual's preference for "victims" or "survivors" whenever possible.
broader: LGBTQ+ youth victims of bullying
has top concept: Youth
issued: 2024-07-31
modified: 2025-02-23
type: Concept
in scheme: v3
change note: Version 4.1.0

Queer youth victims of bullying
comment: Queer youth between the ages of 12-18 who have experienced bullying due to their gender or sexual identity and may or may not have survived. Follow the individual's preference for "victims" or "survivors" whenever possible.
broader: LGBTQ+ youth victims of bullying
has top concept: Youth
issued: 2024-07-31
modified: 2025-02-23
type: Concept
in scheme: v3
change note: Version 4.1.0

Intersex youth victims of bullying
comment: Intersex youth between the ages of 12-18 who have experienced bullying due to their gender or sexual identity and may or may not have survived. Follow the individual's preference for "victims" or "survivors" whenever possible.
broader: LGBTQ+ youth victims of bullying
has top concept: Youth
issued: 2024-07-31
modified: 2025-02-23
type: Concept
in scheme: v3
change note: Version 4.1.0

Non-binary youth victims of bullying
alternative label: Nonbinary youth victims of bullying
comment: Non-binary youth between the ages of 12-18 who have experienced bullying due to their gender or sexual identity and may or may not have survived. Follow the individual's preference for "victims" or "survivors" whenever possible.
broader: LGBTQ+ youth victims of bullying
has top concept: Youth
issued: 2024-07-31
modified: 2025-02-23
type: Concept
in scheme: v3
change note: Version 4.1.0

Transgender youth victims of bullying
comment: Transgender youth between the ages of 12-18 who have experienced bullying due to their gender or sexual identity and may or may not have survived. Follow the individual's preference for "victims" or "survivors" whenever possible.
broader: LGBTQ+ youth victims of bullying
has top concept: Youth
issued: 2024-07-31
modified: 2025-02-23
type: Concept
in scheme: v3
change note: Version 4.1.0

Asexual youth victims of bullying
comment: Asexual youth between the ages of 12-18 who have experienced bullying due to their sexual identity and may or may not have survived. Follow the individual's preference for "victims" or "survivors" whenever possible.
broader: LGBTQ+ youth victims of bullying
has top concept: Youth
issued: 2024-07-31
modified: 2025-02-23
type: Concept
in scheme: v3
change note: Version 4.1.0

Aromantic youth victims of bullying
comment: Aromantic youth between the ages of 12-18 who have experienced bullying due to their sexual identity and may or may not have survived. Follow the individual's preference for "victims" or "survivors" whenever possible.
broader: LGBTQ+ youth victims of bullying
has top concept: Youth
issued: 2024-07-31
modified: 2025-02-23
type: Concept
in scheme: v3
change note: Version 4.1.0

Greyromantic youth victims of bullying
comment: Greyromantic youth between the ages of 12-18 who have experienced bullying due to their gender or sexual identity and may or may not have survived. Follow the individual's preference for "victims" or "survivors" whenever possible.
broader: LGBTQ+ youth victims of bullying
has top concept: Youth
issued: 2024-07-31
modified: 2025-02-23
type: Concept
in scheme: v3
change note: Version 4.1.0

Two-Spirit youth victims of bullying
alternative label: 2S youth victims of bullying
alternative label: Two Spirited youth victims of bullying
alternative label: Two-Spirited youth victims of bullying
comment: Two Spirit youth between the ages of 12-18 who have experienced bullying due to their gender or sexual identity and may or may not have survived; follow the individual's preference for "victims" or "survivors" whenever possible.
broader: Two-Spirit victims of bullying
broader: Two-Spirit youth
related: LGBTQ+ victims of bullying
related: LGBTQ+ youth victims of bullying
has top concept: Gender
issued: 2024-07-31
modified: 2025-02-23
type: Concept
in scheme: v3
change note: Version 4.1.0

LGBTQ+ children's literature
alternative label: Children's literature (LGBTQ+)
alternative label: LGBTQ+ juvenile literature
alternative label: LGBTQ+ kid lit
comment: Written literary works for an audience of readers up to 12 years of age, also known as kid lit or juvenile literature. Use in reference to children's literature focusing on LGBTQ+ characters or themes.
broader: LGBTQ+ literature
narrower: Gay children's literature
narrower: Lesbian children's literature
narrower: Bisexual children's literature
narrower: Transgender children's literature
narrower: Queer children's literature
narrower: Non-binary children's literature
narrower: Asexual children's literature
narrower: Aromantic children's literature
narrower: Intersex children's literature
related: Two-Spirit children's literature
has top concept: Subcultures
issued: 2024-07-31
modified: 2025-02-23
type: Concept
in scheme: v3
change note: Version 4.1.0

Gay children's literature
alternative label: Gay juvenile literature
alternative label: Gay kid lit
comment: Written literary works for an audience of readers up to 12 years of age, also known as kid lit or juvenile literature. Use in reference to children's literature focusing on gay male characters or themes.
broader: LGBTQ+ children's literature
has top concept: Subcultures
issued: 2024-07-31
modified: 2025-02-23
type: Concept
in scheme: v3
change note: Version 4.1.0

Lesbian children's literature
alternative label: Lesbian juvenile literature
alternative label: Lesbian kid lit
comment: Written literary works for an audience of readers up to 12 years of age, also known as kid lit or juvenile literature. Use in reference to children's literature focusing on lesbian characters or themes.
broader: LGBTQ+ children's literature
has top concept: Subcultures
issued: 2024-07-31
modified: 2025-02-23
type: Concept
in scheme: v3
change note: Version 4.1.0

Bisexual children's literature
alternative label: Bisexual juvenile literature
alternative label: Bisexual kid lit
comment: Written literary works for an audience of readers up to 12 years of age, also known as kid lit or juvenile literature. Use in reference to children's literature focusing on bisexual characters or themes.
broader: LGBTQ+ children's literature
has top concept: Subcultures
issued: 2024-07-31
modified: 2025-02-23
type: Concept
in scheme: v3
change note: Version 4.1.0

Transgender children's literature
alternative label: Trans children's literature
alternative label: Transgender juvenile literature
alternative label: Transgender kid lit
comment: Written literary works for an audience of readers up to 12 years of age, also known as kid lit or juvenile literature. Use in reference to children's literature focusing on transgender characters or themes.
broader: LGBTQ+ children's literature
has top concept: Subcultures
issued: 2024-07-31
modified: 2025-02-23
type: Concept
in scheme: v3
change note: Version 4.1.0

Queer children's literature
alternative label: Queer juvenile literature
alternative label: Queer kid lit
comment: Written literary works for an audience of readers up to 12 years of age, also known as kid lit or juvenile literature. Use in reference to children's literature focusing on queer characters or themes.
broader: LGBTQ+ children's literature
has top concept: Subcultures
issued: 2024-07-31
modified: 2025-02-23
type: Concept
in scheme: v3
change note: Version 4.1.0

Non-binary children's literature
alternative label: Non-binary juvenile literature
alternative label: Non-binary kit lit
alternative label: Nonbinary children's literature
alternative label: Nonbinary juvenile literature
alternative label: Nonbinary kid lit
comment: Written literary works for an audience of readers up to 12 years of age, also known as kid lit or juvenile literature. Use in reference to children's literature focusing on non-binary characters or themes.
broader: LGBTQ+ children's literature
has top concept: Subcultures
issued: 2024-07-31
modified: 2025-02-23
type: Concept
in scheme: v3
change note: Version 4.1.0

Asexual children's literature
alternative label: Asexual juvenile literature
alternative label: Asexual kid lit
comment: Written literary works for an audience of readers up to 12 years of age, also known as kid lit or juvenile literature. Use in reference to children's literature focusing on asexual characters or themes.
broader: LGBTQ+ children's literature
has top concept: Subcultures
issued: 2024-07-31
modified: 2025-02-23
type: Concept
in scheme: v3
change note: Version 4.1.0

Aromantic children's literature
alternative label: Aromantic juvenile literature
alternative label: Aromantic kid lit
comment: Written literary works for an audience of readers up to 12 years of age, also known as kid lit or juvenile literature. Use in reference to children's literature focusing on aromantic characters or themes.
broader: LGBTQ+ children's literature
has top concept: Subcultures
issued: 2024-07-31
modified: 2025-02-23
type: Concept
in scheme: v3
change note: Version 4.1.0

Intersex children's literature
alternative label: Intersex juvenile literature
alternative label: Intersex kid lit
comment: Written literary works for an audience of readers up to 12 years of age, also known as kid lit or juvenile literature. Use in reference to children's literature focusing on intersex characters or themes.
broader: LGBTQ+ children's literature
has top concept: Subcultures
issued: 2024-07-31
modified: 2025-02-23
type: Concept
in scheme: v3
change note: Version 4.1.0

Two-Spirit children's literature
alternative label: 2S children's literature
alternative label: Two Spirit children's literature
alternative label: Two Spirited children's literature
alternative label: Two-Spirit juvenile literature
alternative label: Two-Spirit kid lit
alternative label: Two-Spirited children's literature
comment: Written literary works for an audience of readers up to 12 years of age, also known as kid lit or juvenile literature. Use in reference to children's literature focusing on Two-Spirit characters or themes.
broader: Two-Spirit literature
related: LGBTQ+ children's literature
has top concept: Two-Spirit literature
issued: 2024-07-31
modified: 2025-02-23
type: Concept
in scheme: v3
change note: Version 4.1.0

Anti-transgender legislation
alternative label: Anti-trans law-making
alternative label: Anti-trans legislation
alternative label: Anti-transgender law-making
comment: Efforts to propose, enact, amend, or strike down laws as a means of restricting the legal rights of transgender people. This includes legislation regarding access to gender-affirming healthcare, participation in sporting events, administrative and judicial procedures such as sex and name registration, and policies affecting the medical treatment, education, and mental health care of transgender youth.
broader: Law
narrower: Bathroom bans
narrower: Transgender health care bans for children and youth
narrower: Gender marker change bans
narrower: Transgender health care bans
narrower: Sports bans
related: Anti-transgender discrimination
related: Criminalization
related: Transphobia
related: Trans exclusivity
has top concept: Law
issued: 2024-07-31
modified: 2025-02-23
type: Concept
in scheme: v3
change note: Version 4.1.0

Danmei
alternative label: Dānměi
comment: A genre focusing on the romantic or sexual relationships between male characters in Chinese novels, comics, movies, animation, and dramas.
broader: Boys' Love (Genre)
has top concept: Subcultures
issued: 2024-07-31
modified: 2025-02-23
type: Concept
in scheme: v3
change note: Version 4.1.0

Turkey baster babies
comment: Babies conceived through at-home artificial insemination, specifically by injecting semen into one's vagina using a turkey baster. There is an extensive history of at-home artificial insemination undertaken by LGBTQ+ people, including gay men contributing semen to aid lesbian couples in conceiving.
broader: Children
related: Artificial insemination
has top concept: Family members
issued: 2024-07-31
modified: 2025-02-23
type: Concept
in scheme: v3
change note: Version 4.1.0

Transgender health care bans for children and youth
comment: Laws or policies instituted that prevent trans and non-binary youth and children from seeking and/or obtaining medical treatment or gender-affirming care, including but not limited to surgery, hormone treatment, and mental health care.
broader: Anti-transgender legislation
related: Transgender children
related: Transgender youth
related: Health care for transgender children and youth
has top concept: Law
issued: 2024-07-31
modified: 2025-02-23
type: Concept
in scheme: v3
change note: Version 4.1.0

Gender marker change bans
alternative label: Legal documents change ban
comment: Laws or policies instituted to prevent trans and non-binary people from changing the gender marker on their birth certificate, driver's license, passport, or other legal documents.
broader: Anti-transgender legislation
related: Legal name change
related: Gender markers
has top concept: Law
issued: 2024-07-31
modified: 2025-03-20
type: Concept
in scheme: v3
change note: Version 4.1.0

Transgender health care bans
comment: Laws or policies instituted to prevent trans and non-binary individuals from seeking medical treatment or gender-affirming care, including but not limited to surgery, hormone treatment, and mental health care.
broader: Anti-transgender legislation
related: Gender-affirming surgery
related: Health care for LGBTQ+ people
has top concept: Law
issued: 2024-07-31
modified: 2026-02-26
type: Concept
in scheme: v3
change note: Version 4.1.0

Kiki (Social Gathering)
alternative label: Kikiing (Social gathering)
alternative label: Kiking (Social gathering)
comment: A slang term to describe a gathering of friends for the purpose of chatting and gossiping. The term evolved out of the 1990s ballroom scene in New York City and was further popularized by the 2012 song "Let's Have a Kiki" by the Scissor Sisters. Do not conflate with the term "Ky-ky (Gender role)," sometimes also spelled "Kiki," which refers to lesbians who do not identify as either butches or femmes.
broader: LGBTQ+ slang
related: Ball culture
related: Friendships
has top concept: LGBTQ+ slang
issued: 2024-07-31
modified: 2025-02-23
type: Concept
in scheme: v3
change note: Version 4.1.0

Ky-ky (Gender role)
alternative label: Kiki (Gender role)
alternative label: Kyky (Gender role)
comment: A slang term that emerged in the 1940s to describe lesbians who do not identify as butch or femme. Do not conflate with the term "Kiki (Social gathering), which refers to a gathering of friends.
broader: Gender roles
broader: Sexual identity
broader: Sexual roles
has top concept: Role behavior
issued: 2024-07-31
modified: 2025-02-23
type: Concept
in scheme: v3
change note: Version 4.1.0

Girls’ Love (Genre)
alternative label: GL (Genre)
comment: A genre focusing on the romantic or sexual relationships between female characters in anime, dramas, comics, novels, and movies. The term is usually used to describe media originating from Asia.
broader: Anime and manga fandom
narrower: Yuri fandom
narrower: Baihe
related: Lesbian fiction
has top concept: Subcultures
issued: 2024-07-31
modified: 2025-02-23
type: Concept
in scheme: v3
change note: Version 4.1.0

Baihe
alternative label: Bǎihé
comment: A genre focusing on the romantic or sexual relationships between female characters in Chinese novels, comics, movies, animation, and dramas.
broader: Girls’ Love (Genre)
related: Lesbian fiction
has top concept: Subcultures
issued: 2024-07-31
modified: 2025-02-23
type: Concept
in scheme: v3
change note: Version 4.1.0

Questioning
comment: A term used to describe individuals who are in the process of determining their sexual orientation and/or gender identity.
related: Coming out
related: Bicuriosity
issued: 2024-07-31
modified: 2025-02-23
type: Concept
in scheme: v3
change note: Version 4.1.0

Sports bans
alternative label: Sport bans
comment: Laws or policies instituted to prevent trans and non-binary individuals from participating in gendered sports leagues or competitions, typically to force players to compete as their sex assigned at birth rather than as their gender. This ranges from criminalizing schools and programs that allow trans and non-binary youth participation to banning players, particularly trans women, from competing in gendered leagues or competitions.
broader: Anti-transgender legislation
related: Transgender athletes
has top concept: Law
issued: 2024-07-31
modified: 2025-02-23
type: Concept
in scheme: v3
change note: Version 4.1.0

LGBTQ+ painters
alternative label: Painters (LGBTQ)
comment: LGBTQ+ people who paint, either professionally or as a hobby.
broader: LGBTQ+ artists
narrower: Queer painters
narrower: Intersex painters
narrower: Non-binary painters
narrower: Aromantic painters
narrower: Asexual painters
narrower: Demisexual painters
narrower: Greyromantic painters
narrower: Megasexual painters
narrower: Gay painters
narrower: Lesbian painters
narrower: Bisexual painters
narrower: Transgender painters
related: Two-Spirit painters
has top concept: LGBTQ+ people
issued: 2024-07-31
modified: 2025-02-23
type: Concept
in scheme: v3
change note: Version 4.1.0

Gender conversion therapy
alternative label: Conversion therapy for gender
alternative label: Conversion therapy for trans people
alternative label: Conversion therapy for transgender people
alternative label: Gender reorientation therapy
alternative label: Trans conversion therapy
alternative label: Transgender conversion therapy
comment: Efforts to change the gender identity of a transgender or non-binary person to meet cisgender norms, typically under the belief that their identity is dangerous and/or the result of mental illness or trauma. The processes involved in conversion therapy include visualization training, spiritual interventions, and other aversion treatments.
broader: Conversion therapy
has top concept: Medical care
issued: 2024-07-31
modified: 2025-02-23
type: Concept
in scheme: v3
change note: Version 4.1.0

Gay painters
comment: Gay men who paint, either professionally or as a hobby.
broader: LGBTQ+ painters
has top concept: LGBTQ+ people
issued: 2024-07-31
modified: 2025-02-23
type: Concept
in scheme: v3
change note: Version 4.1.0

Health care for transgender children and youth
alternative label: Health care for trans children and youth
alternative label: Trans health care for children and youth
alternative label: Transgender health care for children and youth
comment: Organized measures taken for the maintenance or improvement of health via the prevention, diagnosis, and/or treatment of physical and mental health issues faced by transgender children and youth. This includes but is not limited to access to safe, legal therapy and counseling, hormone treatment, and gender-affirming surgery.
broader: Health care for LGBTQ+ people
related: Transgender children
related: Transgender youth
related: Transgender health care bans for children and youth
has top concept: Health care for LGBTQ+ people
issued: 2024-07-31
modified: 2025-02-23
type: Concept
in scheme: v3
change note: Version 4.1.0

Lavender linguistics
alternative label: LGBTQ+ linguistics
alternative label: Linguistics (LGBTQ)
comment: The study of language as used by members of LGBTQ+ communities.
broader: Theories
related: LGBTQ+ slang
has top concept: Theories
issued: 2024-07-31
modified: 2025-02-23
type: Concept
in scheme: v3
change note: Version 4.1.0

Lesbian painters
comment: Lesbians who paint, either professionally or as a hobby.
broader: LGBTQ+ painters
has top concept: LGBTQ+ people
issued: 2024-07-31
modified: 2025-02-23
type: Concept
in scheme: v3
change note: Version 4.1.0

Bisexual painters
comment: Bisexual people who paint, either professionally or as a hobby.
broader: LGBTQ+ painters
has top concept: LGBTQ+ people
issued: 2024-07-31
modified: 2025-02-23
type: Concept
in scheme: v3
change note: Version 4.1.0

Transgender painters
alternative label: Trans painters
comment: Trans people who paint, either professionally or as a hobby.
broader: LGBTQ+ painters
has top concept: LGBTQ+ people
issued: 2024-07-31
modified: 2025-02-23
type: Concept
in scheme: v3
change note: Version 4.1.0

Patriarchy
alternative label: Androcracy
comment: A cultural system in which positions of dominance and privilege are held by men, while women and other gender minorities are largely excluded from access to power.
related: Essentialism
related: Genderism
related: Sexism
issued: 2024-07-31
modified: 2025-02-23
type: Concept
in scheme: v3
change note: Version 4.1.0

Queer linguistics
comment: A field of linguistics that analyzes the effect of heteronormativity on the expression of sexual identity through language.
broader: Theories
related: LGBTQ+ slang
has top concept: Theories
issued: 2024-07-31
modified: 2025-02-23
type: Concept
in scheme: v3
change note: Version 4.1.0

LGBTQ+ political groups
alternative label: Political groups (LGBTQ)
comment: Organized groups centered on political change and action for LGBTQ+ rights that may or may not be aligned with major political parties.
narrower: Bisexual political groups
narrower: Queer political groups
narrower: Megasexual political groups
narrower: Demisexual political groups
narrower: Intersex political groups
narrower: Asexual political groups
narrower: Non-binary political groups
narrower: Aromantic political groups
narrower: Transgender political groups
narrower: Greyromantic political groups
narrower: Lesbian political groups
related: Two-Spirit political groups
issued: 2024-09-19
modified: 2025-02-23
type: Concept
in scheme: v3
change note: Version 4.1.0

Bisexual political groups
comment: Organized groups centered on political change and action for bisexual people's rights.
broader: LGBTQ+ political groups
has top concept: LGBTQ+ political groups
issued: 2024-09-19
modified: 2025-02-23
type: Concept
in scheme: v3
change note: Version 4.1.0

Queer political groups
comment: Organized groups centered on political change and action for queer people's rights; may include advocacy and other political efforts for LGBTQ+ people's rights more broadly.
broader: LGBTQ+ political groups
has top concept: LGBTQ+ political groups
issued: 2024-09-19
modified: 2025-02-23
type: Concept
in scheme: v3
change note: Version 4.1.0

Megasexual political groups
comment: Organized groups centered on political change and action for megasexual people's rights.
broader: LGBTQ+ political groups
has top concept: LGBTQ+ political groups
issued: 2024-09-19
modified: 2025-02-23
type: Concept
in scheme: v3
change note: Version 4.1.0

Demisexual political groups
comment: Organized groups centered on political change and action for demisexual people's rights.
broader: LGBTQ+ political groups
has top concept: LGBTQ+ political groups
issued: 2024-09-19
modified: 2025-02-23
type: Concept
in scheme: v3
change note: Version 4.1.0

Intersex political groups
comment: Organized groups centered on political change and action for intersex people's rights.
broader: LGBTQ+ political groups
has top concept: LGBTQ+ political groups
issued: 2024-09-19
modified: 2025-02-23
type: Concept
in scheme: v3
change note: Version 4.1.0

Asexual political groups
comment: Organized groups centered on political change and action for asexual people's rights.
broader: LGBTQ+ political groups
has top concept: LGBTQ+ political groups
issued: 2024-09-19
modified: 2025-02-23
type: Concept
in scheme: v3
change note: Version 4.1.0

Non-binary political groups
alternative label: Nonbinary political groups
comment: Organized groups centered on political change and action for non-binary people's rights.
broader: LGBTQ+ political groups
has top concept: LGBTQ+ political groups
issued: 2024-09-19
modified: 2025-02-23
type: Concept
in scheme: v3
change note: Version 4.1.0

Aromantic political groups
comment: Organized groups centered on political change and action for aromantic people's rights.
broader: LGBTQ+ political groups
has top concept: LGBTQ+ political groups
issued: 2024-09-19
modified: 2025-02-23
type: Concept
in scheme: v3
change note: Version 4.1.0

Transgender political groups
alternative label: Trans political groups
comment: Organized groups centered on political change and action for trans people's rights.
broader: LGBTQ+ political groups
has top concept: LGBTQ+ political groups
issued: 2024-09-19
modified: 2025-02-23
type: Concept
in scheme: v3
change note: Version 4.1.0

Two-Spirit political groups
alternative label: Two-Spirited political groups
alternative label: 2S political groups
alternative label: Two Spirit political groups
alternative label: Two Spirited political groups
comment: Organized groups centered on political change and action for Two-Spirit people's rights.
related: Two-Spirit activism
related: LGBTQ+ political groups
issued: 2024-09-19
modified: 2025-02-23
type: Concept
in scheme: v3
change note: Version 4.1.0

Greyromantic political groups
comment: Organized groups centered on political change and action for greyromantic people's rights.
broader: LGBTQ+ political groups
has top concept: LGBTQ+ political groups
issued: 2024-09-19
modified: 2025-02-23
type: Concept
in scheme: v3
change note: Version 4.1.0

LGBTQ+ students
alternative label: Students (LGBTQ)
comment: LGBTQ+ people who are formally engaged in learning at an educational institution of some kind.
broader: LGBTQ+ people
narrower: LGBTQ+ college students
narrower: Aromantic students
narrower: Asexual students
narrower: Bisexual students
narrower: Demisexual students
narrower: Gay students
narrower: Intersex students
narrower: Greyromantic students
narrower: Lesbian students
narrower: Megasexual students
narrower: Non-binary students
narrower: Queer students
narrower: Transgender students
narrower: LGBTQ+ high school students
narrower: LGBTQ+ middle school students
narrower: LGBTQ+ elementary school students
related: Two-Spirit students
related: LGBTQ+ student organizations
has top concept: LGBTQ+ people
issued: 2024-09-19
modified: 2025-02-23
type: Concept
in scheme: v3
change note: Version 4.1.0

Aromantic students
comment: Aromantic people who are formally engaged in learning at an educational institution of some kind.
broader: LGBTQ+ students
has top concept: LGBTQ+ people
issued: 2024-09-19
modified: 2025-02-23
type: Concept
in scheme: v3
change note: Version 4.1.0

Asexual students
comment: Asexual people who are formally engaged in learning at an educational institution of some kind.
broader: LGBTQ+ students
has top concept: LGBTQ+ people
issued: 2024-09-19
modified: 2025-02-23
type: Concept
in scheme: v3
change note: Version 4.1.0

Bisexual students
comment: Bisexual people who are formally engaged in learning at an educational institution of some kind.
broader: LGBTQ+ students
has top concept: LGBTQ+ people
issued: 2024-09-19
modified: 2025-02-23
type: Concept
in scheme: v3
change note: Version 4.1.0

Demisexual students
comment: Demisexual people who are formally engaged in learning at an educational institution of some kind.
broader: LGBTQ+ students
has top concept: LGBTQ+ people
issued: 2024-09-19
modified: 2025-02-23
type: Concept
in scheme: v3
change note: Version 4.1.0

Gay students
comment: Gay men who are formally engaged in learning at an educational institution of some kind.
broader: LGBTQ+ students
has top concept: LGBTQ+ people
issued: 2024-09-19
modified: 2025-02-23
type: Concept
in scheme: v3
change note: Version 4.1.0

Intersex students
comment: Intersex people who are formally engaged in learning at an educational institution of some kind.
broader: LGBTQ+ students
has top concept: LGBTQ+ people
issued: 2024-09-19
modified: 2025-02-23
type: Concept
in scheme: v3
change note: Version 4.1.0

Greyromantic students
comment: Greyromantic people who are formally engaged in learning at an educational institution of some kind.
broader: LGBTQ+ students
has top concept: LGBTQ+ people
issued: 2024-09-19
modified: 2025-02-23
type: Concept
in scheme: v3
change note: Version 4.1.0

Lesbian students
comment: Lesbians who are formally engaged in learning at an educational institution of some kind.
broader: LGBTQ+ students
has top concept: LGBTQ+ people
issued: 2024-09-19
modified: 2025-02-23
type: Concept
in scheme: v3
change note: Version 4.1.0

Megasexual students
comment: Megasexual people who are formally engaged in learning at an educational institution of some kind.
broader: LGBTQ+ students
has top concept: LGBTQ+ people
issued: 2024-09-19
modified: 2025-02-23
type: Concept
in scheme: v3
change note: Version 4.1.0

Non-binary students
alternative label: Nonbinary students
comment: Non-binary people who are formally engaged in learning at an educational institution of some kind.
broader: LGBTQ+ students
has top concept: LGBTQ+ people
issued: 2024-09-19
modified: 2025-02-23
type: Concept
in scheme: v3
change note: Version 4.1.0

Queer students
comment: Queer people who are formally engaged in learning at an educational institution of some kind.
broader: LGBTQ+ students
has top concept: LGBTQ+ people
issued: 2024-09-19
modified: 2025-02-23
type: Concept
in scheme: v3
change note: Version 4.1.0

Transgender students
alternative label: Trans students
comment: Transgender people who are formally engaged in learning at an educational institution of some kind.
broader: LGBTQ+ students
has top concept: LGBTQ+ people
issued: 2024-09-19
modified: 2025-02-23
type: Concept
in scheme: v3
change note: Version 4.1.0

Two-Spirit students
alternative label: 2S students
alternative label: Two Spirited students
alternative label: Two-Spirited students
alternative label: Two Spirit students
comment: Two-Spirit people who are formally engaged in learning at an educational institution of some kind.
broader: Two-Spirit people
narrower: Two-Spirit high school students
narrower: Two-Spirit middle school students
narrower: Two-Spirit elementary school students
related: LGBTQ+ students
has top concept: Gender
issued: 2024-09-19
modified: 2025-02-23
type: Concept
in scheme: v3
change note: Version 4.1.0

LGBTQ+ archivists
alternative label: Archivists (LGBTQ+)
comment: LGBTQ+ people who assess, curate, manage, process, preserve, steward, and/or provide access to records and archives of enduring historical value.
broader: LGBTQ+ information professionals
narrower: Lesbian archivists
narrower: Gay archivists
narrower: Bisexual archivists
narrower: Transgender archivists
narrower: Queer archivists
narrower: Intersex archivists
narrower: Asexual archivists
narrower: Non-binary archivists
narrower: Aromantic archivists
narrower: Demisexual archivists
narrower: Greyromantic archivists
narrower: Megasexual archivists
related: LGBTQ+ libraries
related: LGBTQ+ special collections
related: Two-Spirit archivists
has top concept: LGBTQ+ information professionals
issued: 2024-10-22
modified: 2025-02-23
type: Concept
in scheme: v3
change note: Version 4.1.0

Lesbian archivists
comment: Lesbians who assess, curate, manage, process, preserve, steward, and/or provide access to records and archives of enduring historical value.
broader: LGBTQ+ archivists
has top concept: LGBTQ+ information professionals
issued: 2024-10-22
modified: 2025-02-23
type: Concept
in scheme: v3
change note: Version 4.1.0

Gay archivists
comment: Gay men who assess, curate, manage, process, preserve, steward, and/or provide access to records and archives of enduring historical value.
broader: LGBTQ+ archivists
has top concept: LGBTQ+ information professionals
issued: 2024-10-22
modified: 2025-02-23
type: Concept
in scheme: v3
change note: Version 4.1.0

Bisexual archivists
comment: Bisexual people who assess, curate, manage, process, preserve, steward, and/or provide access to records and archives of enduring historical value.
broader: LGBTQ+ archivists
has top concept: LGBTQ+ information professionals
issued: 2024-10-22
modified: 2025-02-23
type: Concept
in scheme: v3
change note: Version 4.1.0

Transgender archivists
alternative label: Trans archivists
comment: Transgender people who assess, curate, manage, process, preserve, steward, and/or provide access to records and archives of enduring historical value.
broader: LGBTQ+ archivists
has top concept: LGBTQ+ information professionals
issued: 2024-10-22
modified: 2025-02-23
type: Concept
in scheme: v3
change note: Version 4.1.0

Queer archivists
comment: Queer people who assess, curate, manage, process, preserve, steward, and/or provide access to records and archives of enduring historical value.
broader: LGBTQ+ archivists
has top concept: LGBTQ+ information professionals
issued: 2024-10-22
modified: 2025-02-23
type: Concept
in scheme: v3
change note: Version 4.1.0

Intersex archivists
comment: Intersex people who assess, curate, manage, process, preserve, steward, and/or provide access to records and archives of enduring historical value.
broader: LGBTQ+ archivists
has top concept: LGBTQ+ information professionals
issued: 2024-10-22
modified: 2025-02-23
type: Concept
in scheme: v3
change note: Version 4.1.0

Asexual archivists
comment: Asexual people who assess, curate, manage, process, preserve, steward, and/or provide access to records and archives of enduring historical value.
broader: LGBTQ+ archivists
has top concept: LGBTQ+ information professionals
issued: 2024-10-22
modified: 2025-02-23
type: Concept
in scheme: v3
change note: Version 4.1.0

Non-binary archivists
alternative label: Nonbinary archivists
comment: Non-binary people who assess, curate, manage, process, preserve, steward, and/or provide access to records and archives of enduring historical value.
broader: LGBTQ+ archivists
has top concept: LGBTQ+ information professionals
issued: 2024-10-22
modified: 2025-02-23
type: Concept
in scheme: v3
change note: Version 4.1.0

Two-Spirit archivists
alternative label: Two Spirit archivists
alternative label: Two Spirited archivists
alternative label: Two-Spirited archivists
alternative label: 2S archivists
comment: Two-Spirit people who assess, curate, manage, process, preserve, steward, and/or provide access to records and archives of enduring historical value.
broader: Two-Spirit information professionals
related: LGBTQ+ archivists
has top concept: Gender
issued: 2024-10-22
modified: 2025-02-23
type: Concept
in scheme: v3
change note: Version 4.1.0

Non-binary people of color
preferred label: Non-binary people of colour
alternative label: Nonbinary people of color
comment: Primarily used in the United States, this term refers to non-binary people who are not white and who identify as people of color.
broader: LGBTQ+ people of color
has top concept: LGBTQ+ people
issued: 2024-10-22
modified: 2025-02-23
type: Concept
in scheme: v3
change note: Version 4.1.0

African American non-binary people
alternative label: Non-binary African Americans
alternative label: Non-binary African American people
alternative label: African American nonbinary people
alternative label: Nonbinary African American people
alternative label: Nonbinary African Americans
comment: Non-binary people of African descent born in the United States or non-binary people born in African countries who live in or have a strong connection to the United States. Use for individuals who self-identity as African American. Follow the individual’s preference for African American or Black whenever possible.
broader: African American LGBTQ+ people
has top concept: LGBTQ+ people
issued: 2024-10-22
modified: 2025-02-23
type: Concept
in scheme: v3
change note: Version 4.1.0

Asian non-binary people
alternative label: Non-binary Asians
alternative label: Non-binary Asian people
alternative label: Nonbinary Asians
alternative label: Nonbinary Asian people
alternative label: Asian nonbinary people
comment: Non-binary people of Asian heritage or descent, living in Asia or part of the Asian diaspora. Only use for people who self-identify as Asian.
broader: Asian LGBTQ+ people
has top concept: LGBTQ+ people
issued: 2024-10-22
modified: 2025-02-23
type: Concept
in scheme: v3
change note: Version 4.1.0

LGBTQ+ high school students
alternative label: High school students (LGBTQ)
alternative label: LGBTQ+ secondary school students
alternative label: Secondary school students (LGBTQ)
comment: LGBTQ+ people who attend high school, generally consisting of grades 9-12 (sometimes referred to as freshman through senior year) with students between the ages of 14 and 18.
broader: LGBTQ+ students
narrower: Lesbian high school students
narrower: Gay high school students
narrower: Bisexual high school students
narrower: Transgender high school students
narrower: Queer high school students
narrower: Intersex high school students
narrower: Asexual high school students
narrower: Aromantic high school students
narrower: Non-binary high school students
narrower: Demisexual high school students
narrower: Greyromantic high school students
related: Two-Spirit high school students
has top concept: LGBTQ+ people
issued: 2024-10-22
modified: 2025-02-23
type: Concept
in scheme: v3
change note: Version 4.1.0

Lesbian high school students
alternative label: Lesbian secondary school students
comment: Lesbians who who attend high school, generally consisting of grades 9-12 (sometimes referred to as freshman through senior year) with students between the ages of 14 and 18.
broader: LGBTQ+ high school students
has top concept: LGBTQ+ people
issued: 2024-10-22
modified: 2025-02-23
type: Concept
in scheme: v3
change note: Version 4.1.0

Gay high school students
alternative label: Gay secondary school students
comment: Gay people who attend high school, generally consisting of grades 9-12 (sometimes referred to as freshman through senior year) with students between the ages of 14 and 18.
broader: LGBTQ+ high school students
has top concept: LGBTQ+ people
issued: 2024-10-22
modified: 2025-02-23
type: Concept
in scheme: v3
change note: Version 4.1.0

Bisexual high school students
alternative label: Bisexual secondary school students
comment: Bisexual people who attend high school, generally consisting of grades 9-12 (sometimes referred to as freshman through senior year) with students between the ages of 14 and 18.
broader: LGBTQ+ high school students
has top concept: LGBTQ+ people
issued: 2024-10-22
modified: 2025-02-23
type: Concept
in scheme: v3
change note: Version 4.1.0

Transgender high school students
alternative label: Trans high school students
alternative label: Transgender secondary school students
alternative label: Trans secondary school students
comment: Transgender people who attend high school, generally consisting of grades 9-12 (sometimes referred to as freshman through senior year) with students between the ages of 14 and 18.
broader: LGBTQ+ high school students
has top concept: LGBTQ+ people
issued: 2024-10-22
modified: 2025-02-23
type: Concept
in scheme: v3
change note: Version 4.1.0

Queer high school students
alternative label: Queer secondary school students
comment: Queer people who attend high school, generally consisting of grades 9-12 (sometimes referred to as freshman through senior year) with students between the ages of 14 and 18.
broader: LGBTQ+ high school students
has top concept: LGBTQ+ people
issued: 2024-10-22
modified: 2025-02-23
type: Concept
in scheme: v3
change note: Version 4.1.0

Intersex high school students
alternative label: Intersex secondary school students
comment: Intersex people who attend high school, generally consisting of grades 9-12 (sometimes referred to as freshman through senior year) with students between the ages of 14 and 18.
broader: LGBTQ+ high school students
has top concept: LGBTQ+ people
issued: 2024-10-22
modified: 2025-02-23
type: Concept
in scheme: v3
change note: Version 4.1.0

Asexual high school students
alternative label: Asexual secondary school students
comment: Asexual people who attend high school, generally consisting of grades 9-12 (sometimes referred to as freshman through senior year) with students between the ages of 14 and 18.
broader: LGBTQ+ high school students
has top concept: LGBTQ+ people
issued: 2024-10-22
modified: 2025-02-23
type: Concept
in scheme: v3
change note: Version 4.1.0

Aromantic high school students
alternative label: Aromantic secondary school students
comment: Aromantic people who attend high school, generally consisting of grades 9-12 (sometimes referred to as freshman through senior year) with students between the ages of 14 and 18.
broader: LGBTQ+ high school students
has top concept: LGBTQ+ people
issued: 2024-10-22
modified: 2025-02-23
type: Concept
in scheme: v3
change note: Version 4.1.0

Non-binary high school students
alternative label: Nonbinary high school students
alternative label: Non-binary secondary school students
alternative label: Nonbinary secondary school students
comment: Non-binary people who attend high school, generally consisting of grades 9-12 (sometimes referred to as freshman through senior year) with students between the ages of 14 and 18.
broader: LGBTQ+ high school students
has top concept: LGBTQ+ people
issued: 2024-10-22
modified: 2025-02-23
type: Concept
in scheme: v3
change note: Version 4.1.0

Two-Spirit high school students
alternative label: 2S high school students
alternative label: Two Spirit high school students
alternative label: Two-Spirited high school students
alternative label: Two Spirited high school students
alternative label: 2S secondary school students
alternative label: Two Spirit secondary school students
alternative label: Two-Spirited secondary school students
alternative label: Two Spirited secondary school students
comment: Two-Spirit people who attend high school, generally consisting of grades 9-12 (sometimes referred to as freshman through senior year) with students between the ages of 14 and 18.
broader: Two-Spirit students
related: LGBTQ+ high school students
has top concept: Gender
issued: 2024-10-22
modified: 2025-02-23
type: Concept
in scheme: v3
change note: Version 4.1.0

Demisexual high school students
alternative label: Demisexual secondary school students
comment: Demisexual people who attend high school, generally consisting of grades 9-12 (sometimes referred to as freshman through senior year) with students between the ages of 14 and 18.
broader: LGBTQ+ high school students
has top concept: LGBTQ+ people
issued: 2024-10-22
modified: 2025-02-23
type: Concept
in scheme: v3
change note: Version 4.1.0

Greyromantic high school students
alternative label: Greyromantic secondary school students
comment: Greyromantic people who attend high school, generally consisting of grades 9-12 (sometimes referred to as freshman through senior year) with students between the ages of 14 and 18.
broader: LGBTQ+ high school students
has top concept: LGBTQ+ people
issued: 2024-10-22
modified: 2025-02-23
type: Concept
in scheme: v3
change note: Version 4.1.0

LGBTQ+ middle school students
alternative label: Middle school students (LGBTQ)
alternative label: LGBTQ+ junion high students
alternative label: Junior high students (LGBTQ)
comment: LGBTQ+ people who attend middle school, generally consisting of grades 6 through 8 with students between the ages of 11 and 14.
broader: LGBTQ+ students
narrower: Lesbian middle school students
narrower: Gay middle school students
narrower: Bisexual middle school students
narrower: Transgender middle school students
narrower: Queer middle school students
narrower: Intersex middle school students
narrower: Asexual middle school students
narrower: Aromantic middle school students
narrower: Non-binary middle school students
narrower: Demisexual middle school students
narrower: Greyromantic middle school students
related: Two-Spirit middle school students
has top concept: LGBTQ+ people
issued: 2024-10-22
modified: 2025-02-23
type: Concept
in scheme: v3
change note: Version 4.1.0

Lesbian middle school students
alternative label: Lesbian junior high school students
comment: Lesbians who attend middle school, generally consisting of grades 6 through 8 with students between the ages of 11 and 14.
broader: LGBTQ+ middle school students
has top concept: LGBTQ+ people
issued: 2024-10-22
modified: 2025-02-23
type: Concept
in scheme: v3
change note: Version 4.1.0

Gay middle school students
alternative label: Gay junior high school students
comment: Gay people who attend middle school, generally consisting of grades 6 through 8 with students between the ages of 11 and 14.
broader: LGBTQ+ middle school students
has top concept: LGBTQ+ people
issued: 2024-10-22
modified: 2025-02-23
type: Concept
in scheme: v3
change note: Version 4.1.0

Bisexual middle school students
alternative label: Bi middle school students
alternative label: Bisexual junior high school students
comment: Bisexual people who attend middle school, generally consisting of grades 6 through 8 with students between the ages of 11 and 14.
broader: LGBTQ+ middle school students
has top concept: LGBTQ+ people
issued: 2024-10-22
modified: 2025-02-23
type: Concept
in scheme: v3
change note: Version 4.1.0

Transgender middle school students
alternative label: Trans middle school students
alternative label: Trans junior high school students
alternative label: Transgender junior high school students
comment: Transgender people who attend middle school, generally consisting of grades 6 through 8 with students between the ages of 11 and 14.
broader: LGBTQ+ middle school students
has top concept: LGBTQ+ people
issued: 2024-10-22
modified: 2025-02-23
type: Concept
in scheme: v3
change note: Version 4.1.0

Queer middle school students
alternative label: Queer junior high school students
comment: Queer people who attend middle school, generally consisting of grades 6 through 8 with students between the ages of 11 and 14.
broader: LGBTQ+ middle school students
has top concept: LGBTQ+ people
issued: 2024-10-22
modified: 2025-02-23
type: Concept
in scheme: v3
change note: Version 4.1.0

Intersex middle school students
alternative label: Intersex junior high school students
comment: Intersex people who attend middle school, generally consisting of grades 6 through 8 with students between the ages of 11 and 14.
broader: LGBTQ+ middle school students
has top concept: LGBTQ+ people
issued: 2024-10-22
modified: 2025-02-23
type: Concept
in scheme: v3
change note: Version 4.1.0

Asexual middle school students
alternative label: Asexual junior high school students
comment: Asexual people who attend middle school, generally consisting of grades 6 through 8 with students between the ages of 11 and 14.
broader: LGBTQ+ middle school students
has top concept: LGBTQ+ people
issued: 2024-10-22
modified: 2025-02-23
type: Concept
in scheme: v3
change note: Version 4.1.0

Aromantic middle school students
alternative label: Aromantic junior high school students
comment: Aromantic people who attend middle school, generally consisting of grades 6 through 8 with students between the ages of 11 and 14.
broader: LGBTQ+ middle school students
has top concept: LGBTQ+ people
issued: 2024-10-22
modified: 2025-02-23
type: Concept
in scheme: v3
change note: Version 4.1.0

Non-binary middle school students
alternative label: Nonbinary middle school students
alternative label: Non-binary junior high school students
alternative label: Nonbinary junion high school students
comment: Non-binary people who attend middle school, generally consisting of grades 6 through 8 with students between the ages of 11 and 14.
broader: LGBTQ+ middle school students
has top concept: LGBTQ+ people
issued: 2024-10-22
modified: 2025-02-23
type: Concept
in scheme: v3
change note: Version 4.1.0

Demisexual middle school students
alternative label: Demisexual junior high school students
comment: Demisexual people who attend middle school, generally consisting of grades 6 through 8 with students between the ages of 11 and 14.
broader: LGBTQ+ middle school students
has top concept: LGBTQ+ people
issued: 2024-10-22
modified: 2025-02-23
type: Concept
in scheme: v3
change note: Version 4.1.0

Greyromantic middle school students
comment: Greyromantic people who attend middle school, generally consisting of grades 6 through 8 with students between the ages of 11 and 14.
broader: LGBTQ+ middle school students
has top concept: LGBTQ+ people
issued: 2024-10-22
modified: 2025-02-23
type: Concept
in scheme: v3
change note: Version 4.1.0

Two-Spirit middle school students
alternative label: Two-Spirit junior high school students
alternative label: Two Spirit junior high school students
alternative label: Two Spirited junior high school students
alternative label: Two-Spirited junior high school students
alternative label: 2S junior high school students
alternative label: Two Spirit middle school students
alternative label: Two-Spirited middle school students
alternative label: Two Spirited middle school students
alternative label: 2S middle school students
comment: Two-Spirit people who attend middle school, generally consisting of grades 6 through 8 with students between the ages of 11 and 14.
broader: Two-Spirit students
related: LGBTQ+ middle school students
has top concept: Gender
issued: 2024-10-22
modified: 2025-02-23
type: Concept
in scheme: v3
change note: Version 4.1.0

LGBTQ+ elementary school students
alternative label: Elementary school students (LGBTQ)
alternative label: LGBTQ+ primary school students
alternative label: Primary school students (LGBTQ)
comment: LGBTQ+ people who attend elementary school, generally consisting of grades k through 5 with students between the ages of 4 and 10.
broader: LGBTQ+ students
narrower: Transgender elementary school students
narrower: Intersex elementary school students
narrower: Non-binary elementary school students
related: Two-Spirit elementary school students
has top concept: LGBTQ+ people
issued: 2024-10-22
modified: 2025-02-23
type: Concept
in scheme: v3
change note: Version 4.1.0

Transgender elementary school students
alternative label: Trans elementary school students
alternative label: Transgender primary school students
alternative label: Trans primary school students
comment: Transgender people who attend elementary school, generally consisting of grades k through 5 with students between the ages of 4 and 10.
broader: LGBTQ+ elementary school students
has top concept: LGBTQ+ people
issued: 2024-10-22
modified: 2025-02-23
type: Concept
in scheme: v3
change note: Version 4.1.0

Intersex elementary school students
alternative label: Intersex primary school students
comment: Intersex people who attend elementary school, generally consisting of grades k through 5 with students between the ages of 4 and 10.
broader: LGBTQ+ elementary school students
has top concept: LGBTQ+ people
issued: 2024-10-22
modified: 2025-02-23
type: Concept
in scheme: v3
change note: Version 4.1.0

Non-binary elementary school students
alternative label: Nonbinary elementary school students
alternative label: Non-binary primary school students
alternative label: Nonbinary primary school students
comment: Non-binary people who attend elementary school, generally consisting of grades k through 5 with students between the ages of 4 and 10.
broader: LGBTQ+ elementary school students
has top concept: LGBTQ+ people
issued: 2024-10-22
modified: 2025-02-23
type: Concept
in scheme: v3
change note: Version 4.1.0

Two-Spirit elementary school students
alternative label: Two Spirit elementary school students
alternative label: Two Spirited elementary school students
alternative label: Two-Spirited elementary school students
alternative label: 2S elementary school students
alternative label: Two-Spirit primary school students
alternative label: Two Spirit primary school students
alternative label: Two Spirited primary school students
alternative label: Two-Spirited primary school students
alternative label: 2S primary school students
comment: Two-Spirit people who attend elementary school, generally consisting of grades k through 5 with students between the ages of 4 and 10.
broader: Two-Spirit students
related: LGBTQ+ elementary school students
has top concept: Gender
issued: 2024-10-22
modified: 2025-02-23
type: Concept
in scheme: v3
change note: Version 4.1.0

Queerplatonic relationships
alternative label: QPR
alternative label: Queerplatonic partnerships
alternative label: QPP
comment: A term that originated in aromantic and asexual spaces to describe committed intimate relationships between significant others that are not romantic in nature.
broader: Relationship satisfaction
related: LGBTQ+ platonic love
has top concept: Relationship satisfaction
issued: 2024-10-22
modified: 2025-02-23
type: Concept
in scheme: v3
change note: Version 4.1.0

Reproductive justice
comment: Organized efforts to secure reproductive rights, including the legal, social, and ethical principles of freedom around reproductive healthcare and decision-making.
related: Reproductive rights
related: Reproductive health care for LGBTQ+ people
related: Bodily autonomy
issued: 2024-10-22
modified: 2025-02-23
type: Concept
in scheme: v3
change note: Version 4.1.0

Lesbian events
comment: Organized public or social occasions for lesbians and lesbian communities.
broader: Europride
has top concept: Europride
issued: 2024-10-22
modified: 2025-02-23
type: Concept
in scheme: v3
change note: Version 4.1.0

Gay events
comment: Organized public or social occasions for gay men and gay communities.
broader: Europride
has top concept: Europride
issued: 2024-10-22
modified: 2025-02-23
type: Concept
in scheme: v3
change note: Version 4.1.0

Bisexual events
comment: Organized public or social occasions for bisexual people and communities.
broader: Europride
has top concept: Europride
issued: 2024-10-22
modified: 2025-02-23
type: Concept
in scheme: v3
change note: Version 4.1.0

Transgender events
alternative label: Trans events
comment: Organized public or social occasions for trans people and communities.
broader: Europride
has top concept: Europride
issued: 2024-10-22
modified: 2025-02-23
type: Concept
in scheme: v3
change note: Version 4.1.0

Queer events
comment: Organized public or social occasions for queer people and communities.
broader: Europride
has top concept: Europride
issued: 2024-10-22
modified: 2025-02-23
type: Concept
in scheme: v3
change note: Version 4.1.0

Non-binary events
alternative label: Nonbinary events
comment: Organized public or social occasions for non-binary people and communities.
broader: Europride
has top concept: Europride
issued: 2024-10-22
modified: 2025-02-23
type: Concept
in scheme: v3
change note: Version 4.1.0

Intersex events
comment: Organized public or social occasions for intersex people and communities.
broader: Europride
has top concept: Europride
issued: 2024-10-22
modified: 2025-02-23
type: Concept
in scheme: v3
change note: Version 4.1.0

Two-Spirit events
alternative label: Two Spirit events
alternative label: Two-Spirited events
alternative label: Two Spirited events
alternative label: 2S events
comment: Organized public or social occasions for Two-Spirit people and communities.
narrower: Two-Spirit film festivals
related: Europride
issued: 2024-10-22
modified: 2025-02-23
type: Concept
in scheme: v3
change note: Version 4.1.0

Asexual events
comment: Organized public or social occasions for asexual people and communities.
broader: Europride
has top concept: Europride
issued: 2024-10-22
modified: 2025-02-23
type: Concept
in scheme: v3
change note: Version 4.1.0

Aromantic events
comment: Organized public or social occasions for aromantic people and communities.
broader: Europride
has top concept: Europride
issued: 2024-10-22
modified: 2025-02-23
type: Concept
in scheme: v3
change note: Version 4.1.0

Demisexual events
comment: Organized public or social occasions for demisexual people and communities.
broader: Europride
has top concept: Europride
issued: 2024-10-22
modified: 2025-02-23
type: Concept
in scheme: v3
change note: Version 4.1.0

Greyromantic events
comment: Organized public or social occasions for greyromantic people and communities.
broader: Europride
has top concept: Europride
issued: 2024-10-22
modified: 2025-02-23
type: Concept
in scheme: v3
change note: Version 4.1.0

Megasexual events
comment: Organized public or social occasions for megasexual people and communities.
broader: Europride
has top concept: Europride
issued: 2024-10-22
modified: 2025-02-23
type: Concept
in scheme: v3
change note: Version 4.1.0

Women's events
comment: Organized public or social occasions for women.
narrower: Women's music festivals
related: Europride
issued: 2024-10-22
modified: 2025-02-23
type: Concept
in scheme: v3
change note: Version 4.1.0

Black queer archives
alternative label: Queer Black archives
comment: Collections of records and materials relating to Black queer people and communities, or collections of records and materials relating to Black people and communities that are curated, organized, and presented from a queer perspective. Can include a variety of organizations and institutions from community to government archives.
broader: LGBTQ+ archives
related: Black queer people
has top concept: LGBTQ+ cultural heritage institutions
issued: 2024-10-22
modified: 2025-02-23
type: Concept
in scheme: v3
change note: Version 4.1.0

LGBTQ+-affirming religious services
alternative label: LGBTQ+ affirming religious services
alternative label: LGBTQ+ religious services
alternative label: Religious services (LGBTQ)
comment: Religious services, or gatherings of people belonging to the same religious group or belief system, that are accepting and supportive of LGBTQ+ people and their identities. Includes services specifically intended for LGBTQ+ people within a denomination or sect that is otherwise not LGBTQ+-affirming.
related: LGBTQ+-affirming religious groups
related: LGBTQ+ African religions
issued: 2024-10-22
modified: 2026-02-23
type: Concept
in scheme: v3
change note: Version 4.1.0

LGBTQ+ music
alternative label: Music (LGBTQ)
comment: Music created by LGBTQ+ artists, for LGBTQ+ audiences, and/or that expresses an LGBTQ+ sensibility.
broader: LGBTQ+ arts
narrower: LGBTQ+ country music
narrower: LGBTQ+ rap music
narrower: LGBTQ+ pop music
related: LGBTQ+ musicians
has top concept: Subcultures
issued: 2024-10-22
modified: 2025-02-23
type: Concept
in scheme: v3
change note: Version 4.1.0

LGBTQ+ rap music
alternative label: Rap music (LGBTQ)
alternative label: Rap (LGBTQ)
comment: Rap music created by LGBTQ+ artists, for LGBTQ+ audiences, and/or that expresses an LGBTQ+ sensibility.
broader: LGBTQ+ music
has top concept: Subcultures
issued: 2024-10-22
modified: 2025-02-23
type: Concept
in scheme: v3
change note: Version 4.1.0

LGBTQ+ pop music
alternative label: Pop music (LGBTQ)
alternative label: Pop (LGBTQ)
alternative label: LGBTQ+ popular music
alternative label: Popular music (LGBTQ)
comment: Pop music created by LGBTQ+ artists, for LGBTQ+ audiences, and/or that expresses an LGBTQ+ sensibility.
broader: LGBTQ+ music
has top concept: Subcultures
issued: 2024-10-22
modified: 2025-02-23
type: Concept
in scheme: v3
change note: Version 4.1.0

Women's sexuality
alternative label: Female sexuality
comment: Term used to describe the ways in which women experience and express themselves sexually, including the types of people and practices they are sexually interested in.
broader: Sexuality
related: WLW (Women Loving Women)
related: Women who have sex with women
has top concept: Sexuality
issued: 2024-10-22
modified: 2025-02-23
type: Concept
in scheme: v3
change note: Version 4.1.0

Queer architecture
alternative label: Queer design
comment: A school of architecture that seeks to create spaces that critique normative conceptions of gender and sexuality.
broader: Queer art
broader: Queer theory
has top concept: Subcultures
issued: 2024-10-22
modified: 2026-03-03
type: Concept
in scheme: v3
change note: Version 4.1.0

Queer ecology
alternative label: Queer ecologies
comment: A school of ecology that seeks to understand nature, biology, and sexuality through the framing of queer theory. Queer ecology rejects the presumption of heterosexuality and cisgenderedness as natural, as well as notions of human exceptionalism and anthropocentrism.
broader: Queer theory
has top concept: Theories
issued: 2024-10-22
modified: 2025-02-23
type: Concept
in scheme: v3
change note: Version 4.1.0

Decolonial theory
alternative label: Decoloniality
alternative label: Decolonizing theory
alternative label: Postcolonial theory
alternative label: Postcolonialism
comment: A school of thought that rejects Eurocentric knowledge hierarchies and ways of being, including the presumed superiority of white Western culture.
broader: Theories
has top concept: Theories
issued: 2024-10-22
modified: 2025-02-23
type: Concept
in scheme: v3
change note: Version 4.1.0

LGBTQ+ information professionals
alternative label: Information professionals (LGBTQ+)
comment: LGBTQ+ people whose profession involves managing information by collecting, organizing, storing and disseminating it. This can include but is not limited to librarians, archivists, metadata and IT workers, web developers, and chief information officers. Use more specific terms when possible.
narrower: LGBTQ+ archivists
narrower: LGBTQ+ librarians
related: Information provision
related: LGBTQ+ book censorship
related: Two-Spirit information professionals
issued: 2024-10-22
modified: 2025-02-23
type: Concept
in scheme: v3
change note: Version 4.1.0

LGBTQ+ librarians
alternative label: Librarians (LGBTQ+)
comment: LGBTQ+ people, typically with degrees in library science, who work, manage, or assist in a library setting.
broader: LGBTQ+ information professionals
narrower: Lesbian librarians
narrower: Gay librarians
narrower: Bisexual librarians
narrower: Transgender librarians
narrower: Queer librarians
narrower: Non-binary librarians
narrower: Intersex librarians
narrower: Asexual librarians
narrower: Aromantic librarians
narrower: Demisexual librarians
narrower: Greyromantic librarians
narrower: Megasexual librarians
related: LGBTQ+ libraries
related: LGBTQ+ literature
related: LGBTQ+ teachers
related: Two-Spirit librarians
has top concept: LGBTQ+ information professionals
issued: 2024-10-22
modified: 2026-02-26
type: Concept
in scheme: v3
change note: Version 4.1.0

Two-Spirit information professionals
alternative label: Two Spirit information professionals
alternative label: Two-Spirited information professionals
alternative label: Two Spirited information professionals
alternative label: 2s information professionals
comment: Two-Spirit people whose profession involves managing information by collecting, organizing, storing and disseminating it. This can include but is not limited to librarians, archivists, metadata and IT workers, web developers, and chief information officers. Use more specific terms when possible.
broader: Two-Spirit people
narrower: Two-Spirit archivists
narrower: Two-Spirit librarians
related: LGBTQ+ information professionals
has top concept: Gender
issued: 2024-10-22
modified: 2025-02-23
type: Concept
in scheme: v3
change note: Version 4.1.0

Lesbian librarians
comment: Lesbians, typically with degrees in library science, who work, manage, or assist in a library setting.
broader: LGBTQ+ librarians
has top concept: LGBTQ+ information professionals
issued: 2024-10-22
modified: 2025-02-23
type: Concept
in scheme: v3
change note: Version 4.1.0

Gay librarians
comment: Gay people, typically with degrees in library science, who work, manage, or assist in a library setting.
broader: LGBTQ+ librarians
has top concept: LGBTQ+ information professionals
issued: 2024-10-22
modified: 2025-02-23
type: Concept
in scheme: v3
change note: Version 4.1.0

Bisexual librarians
comment: Bisexual people, typically with degrees in library science, who work, manage, or assist in a library setting.
broader: LGBTQ+ librarians
has top concept: LGBTQ+ information professionals
issued: 2024-10-22
modified: 2025-02-23
type: Concept
in scheme: v3
change note: Version 4.1.0

Transgender librarians
alternative label: Trans librarians
comment: Transgender people, typically with degrees in library science, who work, manage, or assist in a library setting.
broader: LGBTQ+ librarians
has top concept: LGBTQ+ information professionals
issued: 2024-10-22
modified: 2025-02-23
type: Concept
in scheme: v3
change note: Version 4.1.0

Queer librarians
comment: Queer people, typically with degrees in library science, who work, manage, or assist in a library setting.
broader: LGBTQ+ librarians
has top concept: LGBTQ+ information professionals
issued: 2024-10-22
modified: 2025-02-23
type: Concept
in scheme: v3
change note: Version 4.1.0

Non-binary librarians
alternative label: Nonbinary librarians
comment: Non-binary people, typically with degrees in library science, who work, manage, or assist in a library setting.
broader: LGBTQ+ librarians
has top concept: LGBTQ+ information professionals
issued: 2024-10-22
modified: 2025-02-23
type: Concept
in scheme: v3
change note: Version 4.1.0

Intersex librarians
comment: Intersex people, typically with degrees in library science, who work, manage, or assist in a library setting.
broader: LGBTQ+ librarians
has top concept: LGBTQ+ information professionals
issued: 2024-10-22
modified: 2025-02-23
type: Concept
in scheme: v3
change note: Version 4.1.0

Two-Spirit librarians
alternative label: 2S librarians
alternative label: Two Spirit librarians
alternative label: Two-Spirited librarians
alternative label: Two Spirited librarians
comment: Two-Spirit people, typically with degrees in library science, who work, manage, or assist in a library setting.
broader: Two-Spirit information professionals
related: LGBTQ+ librarians
has top concept: Gender
issued: 2024-10-22
modified: 2025-02-23
type: Concept
in scheme: v3
change note: Version 4.1.0

Asexual librarians
comment: Asexual people, typically with degrees in library science, who work, manage, or assist in a library setting.
broader: LGBTQ+ librarians
has top concept: LGBTQ+ information professionals
issued: 2024-10-22
modified: 2025-02-23
type: Concept
in scheme: v3
change note: Version 4.1.0

Aromantic librarians
comment: Aromantic people, typically with degrees in library science, who work, manage, or assist in a library setting.
broader: LGBTQ+ librarians
has top concept: LGBTQ+ information professionals
issued: 2024-10-22
modified: 2025-02-23
type: Concept
in scheme: v3
change note: Version 4.1.0

Demisexual librarians
comment: Demisexual people, typically with degrees in library science, who work, manage, or assist in a library setting.
broader: LGBTQ+ librarians
has top concept: LGBTQ+ information professionals
issued: 2024-10-22
modified: 2025-02-23
type: Concept
in scheme: v3
change note: Version 4.1.0

Greyromantic librarians
comment: Greyromantic people, typically with degrees in library science, who work, manage, or assist in a library setting.
broader: LGBTQ+ librarians
has top concept: LGBTQ+ information professionals
issued: 2024-10-22
modified: 2025-02-23
type: Concept
in scheme: v3
change note: Version 4.1.0

Megasexual librarians
comment: Megasexual people, typically with degrees in library science, who work, manage, or assist in a library setting.
broader: LGBTQ+ librarians
has top concept: LGBTQ+ information professionals
issued: 2024-10-22
modified: 2025-02-23
type: Concept
in scheme: v3
change note: Version 4.1.0

Aromantic archivists
comment: Aromantic people who assess, curate, manage, process, preserve, steward, and/or provide access to records and archives of enduring historical value.
broader: LGBTQ+ archivists
has top concept: LGBTQ+ information professionals
issued: 2024-10-22
modified: 2025-02-23
type: Concept
in scheme: v3
change note: Version 4.1.0

Demisexual archivists
comment: Demisexual people who assess, curate, manage, process, preserve, steward, and/or provide access to records and archives of enduring historical value.
broader: LGBTQ+ archivists
has top concept: LGBTQ+ information professionals
issued: 2024-10-22
modified: 2025-02-23
type: Concept
in scheme: v3
change note: Version 4.1.0

Greyromantic archivists
comment: Greyromantic people who assess, curate, manage, process, preserve, steward, and/or provide access to records and archives of enduring historical value.
broader: LGBTQ+ archivists
has top concept: LGBTQ+ information professionals
issued: 2024-10-22
modified: 2025-02-23
type: Concept
in scheme: v3
change note: Version 4.1.0

Megasexual archivists
comment: Megasexual people who assess, curate, manage, process, preserve, steward, and/or provide access to records and archives of enduring historical value.
broader: LGBTQ+ archivists
has top concept: LGBTQ+ information professionals
issued: 2024-10-22
modified: 2025-02-23
type: Concept
in scheme: v3
change note: Version 4.1.0

LGBTQ+ scientists
alternative label: Scientists (LGBTQ+)
comment: LGBTQ+ people who either study or have expert knowledge in one of the fields of the physical and/or natural sciences, including but not limited to chemists, biologists, physicists, psychologists, and multidisciplinary researchers.
broader: LGBTQ+ people
narrower: Lesbian scientists
narrower: Gay scientists
narrower: Bisexual scientists
narrower: Transgender scientists
narrower: Queer scientists
narrower: Intersex scientists
narrower: Asexual scientists
narrower: Aromantic scientists
narrower: Non-binary scientists
narrower: Greyromantic scientists
narrower: Demisexual scientists
narrower: Megasexual scientists
related: Two-Spirit scientists
has top concept: LGBTQ+ people
issued: 2024-10-22
modified: 2025-02-23
type: Concept
in scheme: v3
change note: Version 4.1.0

Lesbian scientists
comment: Lesbians who either study or have expert knowledge in one of the fields of the physical and/or natural sciences, including but not limited to chemists, biologists, physicists, psychologists, and multidisciplinary researchers.
broader: LGBTQ+ scientists
has top concept: LGBTQ+ people
issued: 2024-10-22
modified: 2025-02-23
type: Concept
in scheme: v3
change note: Version 4.1.0

Gay scientists
comment: Gay men who either study or have expert knowledge in one of the fields of the physical and/or natural sciences, including but not limited to chemists, biologists, physicists, psychologists, and multidisciplinary researchers.
broader: LGBTQ+ scientists
has top concept: LGBTQ+ people
issued: 2024-10-22
modified: 2025-02-23
type: Concept
in scheme: v3
change note: Version 4.1.0

Bisexual scientists
comment: Bisexual people who either study or have expert knowledge in one of the fields of the physical and/or natural sciences, including but not limited to chemists, biologists, physicists, psychologists, and multidisciplinary researchers.
broader: LGBTQ+ scientists
has top concept: LGBTQ+ people
issued: 2024-10-22
modified: 2025-02-23
type: Concept
in scheme: v3
change note: Version 4.1.0

Transgender scientists
alternative label: Trans scientists
comment: Transgender people who either study or have expert knowledge in one of the fields of the physical and/or natural sciences, including but not limited to chemists, biologists, physicists, psychologists, and multidisciplinary researchers.
broader: LGBTQ+ scientists
has top concept: LGBTQ+ people
issued: 2024-10-22
modified: 2025-02-23
type: Concept
in scheme: v3
change note: Version 4.1.0

Queer scientists
comment: Queer people who either study or have expert knowledge in one of the fields of the physical and/or natural sciences, including but not limited to chemists, biologists, physicists, psychologists, and multidisciplinary researchers.
broader: LGBTQ+ scientists
has top concept: LGBTQ+ people
issued: 2024-10-22
modified: 2025-02-23
type: Concept
in scheme: v3
change note: Version 4.1.0

Intersex scientists
comment: Intersex people who either study or have expert knowledge in one of the fields of the physical and/or natural sciences, including but not limited to chemists, biologists, physicists, psychologists, and multidisciplinary researchers.
broader: LGBTQ+ scientists
has top concept: LGBTQ+ people
issued: 2024-10-22
modified: 2025-02-23
type: Concept
in scheme: v3
change note: Version 4.1.0

Asexual scientists
comment: Asexual people who either study or have expert knowledge in one of the fields of the physical and/or natural sciences, including but not limited to chemists, biologists, physicists, psychologists, and multidisciplinary researchers.
broader: LGBTQ+ scientists
has top concept: LGBTQ+ people
issued: 2024-10-22
modified: 2025-02-23
type: Concept
in scheme: v3
change note: Version 4.1.0

Aromantic scientists
comment: Aromantic people who either study or have expert knowledge in one of the fields of the physical and/or natural sciences, including but not limited to chemists, biologists, physicists, psychologists, and multidisciplinary researchers.
broader: LGBTQ+ scientists
has top concept: LGBTQ+ people
issued: 2024-10-22
modified: 2025-02-23
type: Concept
in scheme: v3
change note: Version 4.1.0

Two-Spirit scientists
alternative label: Two-Spirited scientists
alternative label: Two Spirit scientists
alternative label: 2S scientists
comment: Two-Spirit people who either study or have expert knowledge in one of the fields of the physical and/or natural sciences, including but not limited to chemists, biologists, physicists, psychologists, and multidisciplinary researchers.
broader: Two-Spirit people
related: LGBTQ+ scientists
has top concept: Gender
issued: 2024-10-22
modified: 2025-02-23
type: Concept
in scheme: v3
change note: Version 4.1.0

Non-binary scientists
alternative label: Nonbinary scientists
comment: Non-binary people who either study or have expert knowledge in one of the fields of the physical and/or natural sciences, including but not limited to chemists, biologists, physicists, psychologists, and multidisciplinary researchers.
broader: LGBTQ+ scientists
has top concept: LGBTQ+ people
issued: 2024-10-22
modified: 2025-02-23
type: Concept
in scheme: v3
change note: Version 4.1.0

Greyromantic scientists
comment: Greyromantic people who either study or have expert knowledge in one of the fields of the physical and/or natural sciences, including but not limited to chemists, biologists, physicists, psychologists, and multidisciplinary researchers.
broader: LGBTQ+ scientists
has top concept: LGBTQ+ people
issued: 2024-10-22
modified: 2025-02-23
type: Concept
in scheme: v3
change note: Version 4.1.0

Demisexual scientists
comment: Demisexual people who either study or have expert knowledge in one of the fields of the physical and/or natural sciences, including but not limited to chemists, biologists, physicists, psychologists, and multidisciplinary researchers.
broader: LGBTQ+ scientists
has top concept: LGBTQ+ people
issued: 2024-10-22
modified: 2025-02-23
type: Concept
in scheme: v3
change note: Version 4.1.0

Megasexual scientists
comment: Megasexual people who either study or have expert knowledge in one of the fields of the physical and/or natural sciences, including but not limited to chemists, biologists, physicists, psychologists, and multidisciplinary researchers.
broader: LGBTQ+ scientists
has top concept: LGBTQ+ people
issued: 2024-10-22
modified: 2025-02-23
type: Concept
in scheme: v3
change note: Version 4.1.0

Pride events
alternative label: LGBTQ+ pride events
comment: Events that recognize and celebrate LGBTQ+ people and culture, thereby affirming the visibility, dignity, and diversity of LGBTQ+ communities.
broader: Europride
narrower: Pride parades
narrower: Pride Month
related: No Police at Pride
has top concept: Europride
issued: 2024-10-22
modified: 2025-04-23
type: Concept
in scheme: v3
change note: Version 4.1.0

Pride parades
alternative label: LGBTQ+ pride parades
comment: Processions of LGBTQ+ people and allies, usually organized along a public street, that recognize and celebrate LGBTQ+ people and culture. For political marches and rallies, use the term "LGBTQ+ demonstrations."
broader: Pride events
related: LGBTQ+ demonstrations
has top concept: Europride
issued: 2024-10-22
modified: 2025-04-17
type: Concept
in scheme: v3
change note: Version 4.1.0

LGBTQ+ pride
alternative label: Pride (LGBTQ)
comment: The recognition and celebration of LGBTQ+ people and culture, thereby affirming the visibility, dignity, and diversity of LGBTQ+ communities.
narrower: Gay pride
narrower: Lesbian pride
narrower: Pride Month
narrower: Transgender pride
narrower: Bisexual pride
narrower: Queer pride
narrower: Intersex pride
narrower: Non-binary pride
narrower: Asexual pride
related: LGBTQ+ pride flags
related: No Police at Pride
related: Two-Spirit pride
issued: 2024-10-22
modified: 2025-04-23
type: Concept
in scheme: v3
change note: Version 4.1.0

Pride Month
alternative label: LGBTQ+ Pride Month
comment: A period of public recognition and celebration of LGBTQ+ people and culture, usually organized over the course of a month with local events, parades, marches, and rallies. Pride occurs at different times during the year in different places but is typically held in June in the United States to commemorate the Stonewall uprising.
broader: LGBTQ+ pride
broader: Pride events
narrower: Gay Pride Week
related: LGBTQ+ History Month
has top concept: LGBTQ+ pride
issued: 2024-10-22
modified: 2025-02-23
type: Concept
in scheme: v3
change note: Version 4.1.0

Transgender pride
alternative label: Trans pride
comment: The recognition and celebration of transgender people and culture, thereby affirming the visibility, dignity, and diversity of transgender communities.
broader: LGBTQ+ pride
has top concept: LGBTQ+ pride
issued: 2024-10-22
modified: 2025-04-17
type: Concept
in scheme: v3
change note: Version 4.1.0

LGBTQ+ History Month
alternative label: Gay History Month
comment: An annual, month-long observance of LGBTQ+ history and related civil rights movements. The month in which LGBTQ+ History Month is observed differs depending on the country.
broader: Europride
related: LGBTQ+ history
related: Pride Month
has top concept: Europride
issued: 2024-10-22
modified: 2025-02-23
type: Concept
in scheme: v3
change note: Version 4.1.0

Gender-affirming care
alternative label: Gender affirming care
comment: Social, psychological, behavioral, and medical interventions designed to support and affirm an individual's gender identity. Gender-affirming care includes but is not limited to equal access to health care facilities, counseling, puberty blockers, hormone therapy, and gender-affirming surgeries. It can also include resources to aid in social transition, such as affirming policies regarding name and pronoun changes, access to non-gendered restrooms and facilities, etc.
broader: Health care for LGBTQ+ people
narrower: Gender-affirming surgery
narrower: Intersex-affirming care
narrower: Transgender-affirming care
has top concept: Health care for LGBTQ+ people
issued: 2024-10-22
modified: 2026-02-23
type: Concept
in scheme: v3
change note: Version 4.1.0

Intersex-affirming care
alternative label: Intersex affirming care
comment: Social, psychological, behavioral, and medical interventions designed to support and affirm individuals belonging to the intersex community. Intersex-affirming care includes but is not limited to equal access to health care facilities, access to medical records and information about one's intersex status and traits, and informed consent regarding medical procedures or treatments related to intersex traits.
broader: Gender-affirming care
has top concept: Health care for LGBTQ+ people
issued: 2024-10-22
modified: 2025-02-23
type: Concept
in scheme: v3
change note: Version 4.1.0

Transgender-affirming care
alternative label: Trans-affirming care
alternative label: Transgender affirming care
alternative label: Trans affirming care
comment: Social, psychological, behavioral, and medical interventions designed to support and affirm a transgender individual's gender identity. Transgender-affirming care includes but is not limited to equal access to health care facilities, counseling, puberty blockers, hormone therapy, and gender-affirming surgeries. It can also include resources to aid in social transition, such as affirming policies regarding name and pronoun changes, access to non-gendered restrooms and facilities, etc.
broader: Gender-affirming care
has top concept: Health care for LGBTQ+ people
issued: 2024-10-22
modified: 2025-02-23
type: Concept
in scheme: v3
change note: Version 4.1.0

LGBTQ+ superheroes
alternative label: Superheroes (LGBTQ)
alternative label: LGBTQ+ super heroes
alternative label: LGBTQ+ comic book heroes
alternative label: Super heroes (LGBTQ)
comment: Benevolent fictional characters who possess superhuman powers or abilities beyond those of ordinary people which they use to fight evil and help the public. Use to refer to superheroes who are explicitly identified as LGBTQ+ within their source material.
broader: LGBTQ+ characters
related: LGBTQ+ comics
has top concept: LGBTQ+ characters
issued: 2024-10-22
modified: 2025-02-23
type: Concept
in scheme: v3
change note: Version 4.1.0

LGBTQ+ supervillains
alternative label: Supervillains (LGBTQ)
alternative label: LGBTQ+ super villains
alternative label: Super villains (LGBTQ)
alternative label: LGBTQ+ comic book villains
comment: Villainous fictional characters who possess superhuman powers or abilities beyond those of ordinary people which they use to do evil and harm the public. Use to refer to supervillains who are explicitly identified as LGBTQ+ within their source material.
broader: LGBTQ+ characters
related: LGBTQ+ comics
has top concept: LGBTQ+ characters
issued: 2024-10-22
modified: 2025-02-23
type: Concept
in scheme: v3
change note: Version 4.1.0

LGBTQ+ video games
alternative label: Video games (LGBTQ)
alternative label: LGBTQ+ computer games
alternative label: Computer games (LGBTQ)
comment: Games played by electronically manipulating images produced by a computer program on a display screen. Use in reference to video games intended for LGBTQ+ audiences and/or focusing on LGBTQ+ characters or themes.
broader: LGBTQ+ arts
related: Slash vidding
has top concept: Subcultures
issued: 2024-10-22
modified: 2025-02-23
type: Concept
in scheme: v3
change note: Version 4.1.0

LGBTQ+ poets
alternative label: Poets (LGBTQ)
comment: Creators of written or spoken verse who identify as LGBTQ+.
broader: LGBTQ+ authors
narrower: Lesbian poets
narrower: Gay poets
narrower: Bisexual poets
narrower: Transgender poets
narrower: Queer poets
narrower: Non-binary poets
narrower: Intersex poets
narrower: Asexual poets
narrower: Aromantic poets
narrower: Demisexual poets
narrower: Greyromantic poets
narrower: Megasexual poets
related: Two-Spirit poets
has top concept: LGBTQ+ people
issued: 2024-10-22
modified: 2025-02-23
type: Concept
in scheme: v3
change note: Version 4.1.0

Lesbian poets
comment: Creators of written or spoken verse who identify as lesbian.
broader: LGBTQ+ poets
has top concept: LGBTQ+ people
issued: 2024-10-22
modified: 2025-02-23
type: Concept
in scheme: v3
change note: Version 4.1.0

Gay poets
comment: Creators of written or spoken verse who identify as gay.
broader: LGBTQ+ poets
has top concept: LGBTQ+ people
issued: 2024-10-22
modified: 2025-02-23
type: Concept
in scheme: v3
change note: Version 4.1.0

Bisexual poets
comment: Creators of written or spoken verse who identify as bisexual.
broader: LGBTQ+ poets
has top concept: LGBTQ+ people
issued: 2024-10-22
modified: 2025-02-23
type: Concept
in scheme: v3
change note: Version 4.1.0

Transgender poets
alternative label: Trans poets
comment: Creators of written or spoken verse who identify as transgender.
broader: LGBTQ+ poets
has top concept: LGBTQ+ people
issued: 2024-10-22
modified: 2025-02-23
type: Concept
in scheme: v3
change note: Version 4.1.0

Queer poets
comment: Creators of written or spoken verse who identify as queer.
broader: LGBTQ+ poets
has top concept: LGBTQ+ people
issued: 2024-10-22
modified: 2025-02-23
type: Concept
in scheme: v3
change note: Version 4.1.0

Non-binary poets
alternative label: Nonbinary poets
comment: Creators of written or spoken verse who identify as non-binary.
broader: LGBTQ+ poets
has top concept: LGBTQ+ people
issued: 2024-10-22
modified: 2025-02-23
type: Concept
in scheme: v3
change note: Version 4.1.0

Intersex poets
comment: Creators of written or spoken verse who identify as intersex.
broader: LGBTQ+ poets
has top concept: LGBTQ+ people
issued: 2024-10-22
modified: 2025-02-23
type: Concept
in scheme: v3
change note: Version 4.1.0

Two-Spirit poets
alternative label: Two-Spirited poets
alternative label: Two Spirit poets
alternative label: Two Spirited poets
alternative label: 2S poets
comment: Creators of written or spoken verse who identify as Two-Spirit.
broader: Two-Spirit authors
related: LGBTQ+ poets
has top concept: Gender
issued: 2024-10-22
modified: 2025-02-23
type: Concept
in scheme: v3
change note: Version 4.1.0

Asexual poets
comment: Creators of written or spoken verse who identify as asexual.
broader: LGBTQ+ poets
has top concept: LGBTQ+ people
issued: 2024-10-22
modified: 2025-02-23
type: Concept
in scheme: v3
change note: Version 4.1.0

Aromantic poets
comment: Creators of written or spoken verse who identify as aromantic.
broader: LGBTQ+ poets
has top concept: LGBTQ+ people
issued: 2024-10-22
modified: 2025-02-23
type: Concept
in scheme: v3
change note: Version 4.1.0

Demisexual poets
comment: Creators of written or spoken verse who identify as demisexual.
broader: LGBTQ+ poets
has top concept: LGBTQ+ people
issued: 2024-10-22
modified: 2025-02-23
type: Concept
in scheme: v3
change note: Version 4.1.0

Greyromantic poets
comment: Creators of written or spoken verse who identify as greyromantic.
broader: LGBTQ+ poets
has top concept: LGBTQ+ people
issued: 2024-10-22
modified: 2025-02-23
type: Concept
in scheme: v3
change note: Version 4.1.0

Megasexual poets
comment: Creators of written or spoken verse who identify as megasexual.
broader: LGBTQ+ poets
has top concept: LGBTQ+ people
issued: 2024-10-22
modified: 2025-02-23
type: Concept
in scheme: v3
change note: Version 4.1.0

LGBTQ+ television personalities
alternative label: Television personalities (LGBTQ)
alternative label: LGBTQ+ TV personalities
alternative label: TV personalities (LGBTQ)
comment: LGBTQ+ people who are well-known to the public through their appearances on television shows, typically as themselves rather than in scripted roles.
broader: LGBTQ+ people
broader: LGBTQ+ celebrities
narrower: Lesbian television personalities
narrower: Gay television personalities
narrower: Bisexual television personalities
narrower: Transgender television personalities
narrower: Queer television personalities
narrower: Intersex television personalities
narrower: Asexual television personalities
narrower: Aromantic television personalities
narrower: Non-binary television personalities
narrower: Demisexual television personalities
narrower: Greyromantic television personalities
narrower: Megasexual television personalities
related: Two-Spirit television personalities
has top concept: LGBTQ+ people
issued: 2024-10-22
modified: 2025-03-20
type: Concept
in scheme: v3
change note: Version 4.1.0

Lesbian television personalities
alternative label: Lesbian TV personalities
comment: Lesbians who are well-known to the public through their appearances on television shows, typically as themselves rather than in scripted roles.
broader: LGBTQ+ television personalities
has top concept: LGBTQ+ people
issued: 2024-10-22
modified: 2025-02-23
type: Concept
in scheme: v3
change note: Version 4.1.0

Gay television personalities
alternative label: Gay TV personalities
comment: Gay men who are well-known to the public through their appearances on television shows, typically as themselves rather than in scripted roles.
broader: LGBTQ+ television personalities
has top concept: LGBTQ+ people
issued: 2024-10-22
modified: 2025-02-23
type: Concept
in scheme: v3
change note: Version 4.1.0

Bisexual television personalities
alternative label: Bisexual TV personalities
comment: Bisexual people who are well-known to the public through their appearances on television shows, typically as themselves rather than in scripted roles.
broader: LGBTQ+ television personalities
has top concept: LGBTQ+ people
issued: 2024-10-22
modified: 2025-02-23
type: Concept
in scheme: v3
change note: Version 4.1.0

Transgender television personalities
alternative label: Trans television personalities
alternative label: Transgender TV personalities
alternative label: Trans TV personalities
comment: Transgender people who are well-known to the public through their appearances on television shows, typically as themselves rather than in scripted roles.
broader: LGBTQ+ television personalities
has top concept: LGBTQ+ people
issued: 2024-10-22
modified: 2025-02-23
type: Concept
in scheme: v3
change note: Version 4.1.0

Queer television personalities
alternative label: Queer TV personalities
comment: Queer people who are well-known to the public through their appearances on television shows, typically as themselves rather than in scripted roles.
broader: LGBTQ+ television personalities
has top concept: LGBTQ+ people
issued: 2024-10-22
modified: 2025-02-23
type: Concept
in scheme: v3
change note: Version 4.1.0

Intersex television personalities
alternative label: Intersex TV personalities
comment: Intersex people who are well-known to the public through their appearances on television shows, typically as themselves rather than in scripted roles.
broader: LGBTQ+ television personalities
has top concept: LGBTQ+ people
issued: 2024-10-22
modified: 2025-02-23
type: Concept
in scheme: v3
change note: Version 4.1.0

Asexual television personalities
alternative label: Asexual TV personalities
comment: Asexual people who are well-known to the public through their appearances on television shows, typically as themselves rather than in scripted roles.
broader: LGBTQ+ television personalities
has top concept: LGBTQ+ people
issued: 2024-10-22
modified: 2025-02-23
type: Concept
in scheme: v3
change note: Version 4.1.0

Aromantic television personalities
alternative label: Aromantic TV personalities
comment: Aromantic people who are well-known to the public through their appearances on television shows, typically as themselves rather than in scripted roles.
broader: LGBTQ+ television personalities
has top concept: LGBTQ+ people
issued: 2024-10-22
modified: 2025-02-23
type: Concept
in scheme: v3
change note: Version 4.1.0

Two-Spirit television personalities
alternative label: Two-Spirited television personalities
alternative label: Two Spirit television personalities
alternative label: Two Spirited television personalities
alternative label: 2S television personalities
alternative label: Two-Spirited TV personalities
alternative label: Two Spirit TV personalities
alternative label: Two Spirited TV personalities
alternative label: 2S TV personalities
comment: Two-Spirit people who are well-known to the public through their appearances on television shows, typically as themselves rather than in scripted roles.
broader: Two-Spirit people
broader: Two-Spirit celebrities
related: LGBTQ+ television personalities
has top concept: Gender
issued: 2024-10-22
modified: 2025-03-20
type: Concept
in scheme: v3
change note: Version 4.1.0

Non-binary television personalities
alternative label: Nonbinary television personalities
alternative label: Non-binary TV personalities
alternative label: Nonbinary TV personalities
comment: Non-binary people who are well-known to the public through their appearances on television shows, typically as themselves rather than in scripted roles.
broader: LGBTQ+ television personalities
has top concept: LGBTQ+ people
issued: 2024-10-22
modified: 2025-02-23
type: Concept
in scheme: v3
change note: Version 4.1.0

Demisexual television personalities
alternative label: Demisexual TV personalities
comment: Demisexual people who are well-known to the public through their appearances on television shows, typically as themselves rather than in scripted roles.
broader: LGBTQ+ television personalities
has top concept: LGBTQ+ people
issued: 2024-10-22
modified: 2025-02-23
type: Concept
in scheme: v3
change note: Version 4.1.0

Greyromantic television personalities
alternative label: Greyromantic TV personalities
comment: Greyromantic people who are well-known to the public through their appearances on television shows, typically as themselves rather than in scripted roles.
broader: LGBTQ+ television personalities
has top concept: LGBTQ+ people
issued: 2024-10-22
modified: 2025-02-23
type: Concept
in scheme: v3
change note: Version 4.1.0

Megasexual television personalities
alternative label: Megasexual TV personalities
comment: Megasexual people who are well-known to the public through their appearances on television shows, typically as themselves rather than in scripted roles.
broader: LGBTQ+ television personalities
has top concept: LGBTQ+ people
issued: 2024-10-22
modified: 2025-02-23
type: Concept
in scheme: v3
change note: Version 4.1.0

Gentrification
comment: A process of economic and demographic change within a historically disinvested neighborhood by means of real estate investment and an influx of new, higher-income residents, typically resulting in the displacement of long-time, lower-income residents.
related: LGBTQ+ discrimination
related: Anti-Blackness
related: Anti-kink discrimination
related: Racism
related: Redlining
issued: 2024-10-22
modified: 2025-02-23
type: Concept
in scheme: v3
change note: Version 4.1.0

Redlining
alternative label: Red lining
alternative label: Credit card redlining
comment: A discriminatory practice in which financial services are withheld from neighborhoods that have significant numbers of racial and ethnic minorities. Redlining includes but is not limited to denial of credit, insurance, and healthcare; inflated mortgage and interest rates; and the development of food deserts. The term has its roots in the New Deal when color-coded maps were made of metropolitan areas in the United States to indicate where it was considered safe to insure mortgages. Black neighborhoods and surrounding areas were colored red to indicate mortgages should not be insured there.
related: Anti-Blackness
related: Racism
related: Gentrification
issued: 2024-10-22
modified: 2025-02-23
type: Concept
in scheme: v3
change note: Version 4.1.0

LGBTQ+ safe spaces
alternative label: Safe spaces (LGBTQ)
alternative label: Safe places (LGBTQ)
alternative label: LGBTQ+ safe places
alternative label: LGBTQ+ safe zones
alternative label: Safe zones (LGBTQ)
comment: Public spaces designated as safe for, or accepting and affirming of, LGBTQ+ people, often by allies. LGBTQ+ safe spaces are sometimes identified through the display of stickers or placards.
broader: LGBTQ+ spaces
related: Allies
related: Gay-straight alliances
related: LGBTQ+ friendliness
has top concept: LGBTQ+ meeting places
issued: 2024-10-22
modified: 2025-02-23
type: Concept
in scheme: v3
change note: Version 4.1.0

Impact of COVID-19 pandemic on LGBTQ+ people
alternative label: COVID-19 pandemic impact on LGBTQ+ people
alternative label: Impact of pandemic on LGBTQ+ people
alternative label: Pandemic impact on LGBTQ+ people
alternative label: COVID-19 pandemic and LGBTQ+ people
alternative label: COVID-19 and LGBTQ+ people
comment: The particular impact of the COVID-19 pandemic on LGBTQ+ people and communities, including changes in access to health care, intimate relationship dynamics and safer sex practices, financial stability, social connectedness, and mental health.
related: Health care for LGBTQ+ people
related: LGBTQ+ social processes
issued: 2024-10-23
modified: 2025-02-23
type: Concept
in scheme: v3
change note: Version 4.1.0

LGBTQ+ philanthropy
alternative label: Philanthropy (LGBTQ)
alternative label: LGBTQ+ charity
alternative label: Charity (LGBTQ)
comment: Efforts to improve the welfare of LGBTQ+ people and communities, especially by the donation of money or resources to charitable causes.
related: LGBTQ+ movement
related: LGBTQ+ activism
related: LGBTQ+ philanthropists
issued: 2024-10-23
modified: 2025-02-23
type: Concept
in scheme: v3
change note: Version 4.1.0

LGBTQ+ philanthropists
alternative label: Philanthropists (LGBTQ)
comment: LGBTQ+ people who seek to improve the welfare of others, especially by the donation of money or resources to charitable causes.
broader: LGBTQ+ people
related: LGBTQ+ philanthropy
has top concept: LGBTQ+ people
issued: 2024-10-23
modified: 2025-02-23
type: Concept
in scheme: v3
change note: Version 4.1.0

LGBTQ+ punks
alternative label: Punks (LGBTQ)
comment: LGBTQ+ people involved in the punk community, which originated in the 1970s with punk rock music and is now associated with various music subgenres, fashions, and ideologies.
broader: LGBTQ+ people
related: LGBTQ+ punk community
has top concept: LGBTQ+ people
issued: 2024-10-23
modified: 2025-02-23
type: Concept
in scheme: v3
change note: Version 4.1.0

LGBTQ+ punk community
alternative label: Punk community (LGBTQ)
alternative label: Punk scene (LGBTQ)
alternative label: Punk culture (LGBTQ)
alternative label: LGBTQ+ punk scene
alternative label: LGBTQ+ punk culture
comment: A subset of the punk community to which LGBTQ+ punks and allies belong. The punk community originated in the 1970s with punk rock music and is now associated with various music subgrenes, fashions, and ideologies.
broader: LGBTQ+ communities
related: LGBTQ+ culture
related: LGBTQ+ punks
has top concept: LGBTQ+ communities
issued: 2024-10-23
modified: 2025-02-23
type: Concept
in scheme: v3
change note: Version 4.1.0

LGBTQ+ spaces
alternative label: Spaces (LGBTQ)
comment: Spaces maintained and intended for use by LGBTQ+ people. Includes physical spaces as well as online spaces.
broader: LGBTQ+ meeting places
narrower: LGBTQ+ safe spaces
related: LGBTQ+ communities
has top concept: LGBTQ+ meeting places
issued: 2024-10-23
modified: 2025-02-23
type: Concept
in scheme: v3
change note: Version 4.1.0

LGBTQ+ film criticism
alternative label: Film criticism (LGBTQ)
alternative label: LGBTQ+ film critique
alternative label: Film critique (LGBTQ)
alternative label: LGBTQ+ film analysis
alternative label: Film analysis (LGBTQ)
comment: The analysis and evaluation of LGBTQ+ films and film history, or film criticism from an LGBTQ+ perspective.
broader: LGBTQ+ cinema
narrower: Lesbian film criticism
narrower: Gay film criticism
narrower: Bisexual film criticism
narrower: Transgender film criticism
narrower: Queer film criticism
related: LGBTQ+ literary criticism
related: Feminist film criticism
has top concept: Subcultures
issued: 2024-10-23
modified: 2025-02-23
type: Concept
in scheme: v3
change note: Version 4.1.0

Lesbian film criticism
alternative label: Lesbian film critique
alternative label: Lesbian film analysis
comment: The analysis and evaluation of lesbian films and film history, or film criticism from a lesbian perspective.
broader: LGBTQ+ film criticism
has top concept: Subcultures
issued: 2024-10-23
modified: 2025-02-23
type: Concept
in scheme: v3
change note: Version 4.1.0

Gay film criticism
alternative label: Gay film critique
alternative label: Gay film analysis
comment: The analysis and evaluation of gay films and film history, or film criticism from a gay perspective.
broader: LGBTQ+ film criticism
has top concept: Subcultures
issued: 2024-10-23
modified: 2025-02-23
type: Concept
in scheme: v3
change note: Version 4.1.0

Bisexual film criticism
alternative label: Bisexual film critique
alternative label: Bisexual film analysis
comment: The analysis and evaluation of bisexual films and film history, or film criticism from a bisexual perspective.
broader: LGBTQ+ film criticism
has top concept: Subcultures
issued: 2024-10-23
modified: 2025-02-23
type: Concept
in scheme: v3
change note: Version 4.1.0

Transgender film criticism
alternative label: Transgender film critique
alternative label: Transgender film analysis
alternative label: Trans film criticism
alternative label: Trans film critique
alternative label: Trans film analysis
comment: The analysis and evaluation of trans films and film history, or film criticism from a trans perspective.
broader: LGBTQ+ film criticism
has top concept: Subcultures
issued: 2024-10-23
modified: 2025-02-23
type: Concept
in scheme: v3
change note: Version 4.1.0

Queer film criticism
alternative label: Queer film critique
alternative label: Queer film analysis
comment: The analysis and evaluation of queer films and film history, or film criticism from a queer perspective.
broader: LGBTQ+ film criticism
has top concept: Subcultures
issued: 2024-10-23
modified: 2025-02-23
type: Concept
in scheme: v3
change note: Version 4.1.0

Feminist film criticism
alternative label: Feminist film critique
alternative label: Feminist film analysis
comment: The analysis and evaluation of feminist films and film history, or film criticism from a feminist perspective.
broader: Gender studies
broader: Feminist theory
related: LGBTQ+ film criticism
related: LGBTQ+ literary criticism
has top concept: Gender studies
issued: 2024-10-23
modified: 2025-02-23
type: Concept
in scheme: v3
change note: Version 4.1.0

Decolonial queer theory
alternative label: Queer decoloniality
alternative label: Postcolonial queer theory
alternative label: Queer decolonial theory
alternative label: Queer postcolonial theory
comment: The intersection of decolonial and queer theory, which critiques Eurocentric conceptions of gender and sexuality as a tool of colonization.
broader: Queer theory
has top concept: Theories
issued: 2024-10-23
modified: 2025-02-23
type: Concept
in scheme: v3
change note: Version 4.1.0

Trans joy
alternative label: Transgender joy
comment: A positive feeling connected to trans identity, being, community, activism, and/or culture that counters the impact of living in a discriminatory society.
related: Queer joy
related: Gender euphoria
related: Transgender community
issued: 2024-10-23
modified: 2025-02-23
type: Concept
in scheme: v3
change note: Version 4.1.0

Sensation play
alternative label: Sensual play
alternative label: Sensory play
comment: The act of engaging one's or one's partner(s) senses in various ways to heighten erotic pleasure.
broader: BDSM
broader: Sexual practices
has top concept: Eroticism
issued: 2024-10-23
modified: 2025-02-23
type: Concept
in scheme: v3
change note: Version 4.1.0

Lesbian film festivals
comment: Organized presentations of films in a single location, often with prizes awarded in various categories. Use in reference to film festivals focusing on films created by lesbians or featuring lesbian characters and themes.
broader: LGBTQ+ film festivals
has top concept: LGBTQ+ film festivals
issued: 2024-10-23
modified: 2025-02-23
type: Concept
in scheme: v3
change note: Version 4.1.0

Gay film festivals
comment: Organized presentations of films in a single location, often with prizes awarded in various categories. Use in reference to film festivals focusing on films created by gay men or featuring gay characters and themes.
broader: LGBTQ+ film festivals
has top concept: LGBTQ+ film festivals
issued: 2024-10-23
modified: 2025-02-23
type: Concept
in scheme: v3
change note: Version 4.1.0

Bisexual film festivals
comment: Organized presentations of films in a single location, often with prizes awarded in various categories. Use in reference to film festivals focusing on films created by bisexual people or featuring bisexual characters and themes.
broader: LGBTQ+ film festivals
has top concept: LGBTQ+ film festivals
issued: 2024-10-23
modified: 2025-02-23
type: Concept
in scheme: v3
change note: Version 4.1.0

Transgender film festivals
alternative label: Trans film festivals
comment: Organized presentations of films in a single location, often with prizes awarded in various categories. Use in reference to film festivals focusing on films created by trans people or featuring trans characters and themes.
broader: LGBTQ+ film festivals
has top concept: LGBTQ+ film festivals
issued: 2024-10-23
modified: 2025-02-23
type: Concept
in scheme: v3
change note: Version 4.1.0

Queer film festivals
comment: Organized presentations of films in a single location, often with prizes awarded in various categories. Use in reference to film festivals focusing on films created by queer people or featuring queer characters and themes.
broader: LGBTQ+ film festivals
has top concept: LGBTQ+ film festivals
issued: 2024-10-23
modified: 2025-02-23
type: Concept
in scheme: v3
change note: Version 4.1.0

Non-binary film festivals
alternative label: Nonbinary film festivals
comment: Organized presentations of films in a single location, often with prizes awarded in various categories. Use in reference to film festivals focusing on films created by non-binary people or featuring non-binary characters and themes.
broader: LGBTQ+ film festivals
has top concept: LGBTQ+ film festivals
issued: 2024-10-23
modified: 2025-02-23
type: Concept
in scheme: v3
change note: Version 4.1.0

Intersex film festivals
comment: Organized presentations of films in a single location, often with prizes awarded in various categories. Use in reference to film festivals focusing on films created by intersex people or featuring intersex characters and themes.
broader: LGBTQ+ film festivals
has top concept: LGBTQ+ film festivals
issued: 2024-10-23
modified: 2025-02-23
type: Concept
in scheme: v3
change note: Version 4.1.0

Two-Spirit film festivals
alternative label: Two Spirit film festivals
alternative label: Two-Spirited film festivals
alternative label: Two Spirited film festivals
alternative label: 2S film festivals
comment: Organized presentations of films in a single location, often with prizes awarded in various categories. Use in reference to film festivals focusing on films created by Two-Spirit people or featuring Two-Spirit characters and themes.
broader: Two-Spirit events
related: LGBTQ+ film festivals
has top concept: Two-Spirit events
issued: 2024-10-23
modified: 2025-02-23
type: Concept
in scheme: v3
change note: Version 4.1.0

Bear bars
comment: Drinking establishments that primarily cater to gay men who identify as bears, or hairy and large or muscular.
broader: Gay bars
related: Bears (Gay culture)
has top concept: LGBTQ+ meeting places
issued: 2024-10-23
modified: 2025-02-23
type: Concept
in scheme: v3
change note: Version 4.1.0

Dyke bars
comment: Drinking establishments that primarily cater to dykes. For establishments that cater to lesbians more broadly, use "Lesbian bars."
broader: Lesbian bars
related: Dykes
has top concept: LGBTQ+ meeting places
issued: 2024-10-23
modified: 2025-02-23
type: Concept
in scheme: v3
change note: Version 4.1.0

LGBTQ+ documentaries
alternative label: Documentaries (LGBTQ)
alternative label: LGBTQ+ documentary films
alternative label: Documentary films (LGBTQ)
comment: Non-fictional films that center LGBTQ+ people or topics, created for the purposes of education, advocacy, or personal expression.
broader: LGBTQ+ films
narrower: Lesbian documentaries
narrower: Gay documentaries
narrower: Bisexual documentaries
narrower: Transgender documentaries
narrower: Queer documentaries
narrower: Non-binary documentaries
narrower: Intersex documentaries
narrower: Asexual documentaries
narrower: Aromantic documentaries
narrower: Demisexual documentaries
narrower: Greyromantic documentaries
narrower: Megasexual documentaries
related: Two-Spirit documentaries
has top concept: Subcultures
issued: 2024-10-23
modified: 2025-02-23
type: Concept
in scheme: v3
change note: Version 4.1.0

Lesbian documentaries
alternative label: Lesbian documentary films
comment: Non-fictional films that center lesbians or lesbian topics, created for the purposes of education, advocacy, or personal expression.
broader: LGBTQ+ documentaries
has top concept: Subcultures
issued: 2024-10-23
modified: 2025-02-23
type: Concept
in scheme: v3
change note: Version 4.1.0

Gay documentaries
alternative label: Gay documentary films
comment: Non-fictional films that center LGBTQ+ gay men or topics, created for the purposes of education, advocacy, or personal expression.
broader: LGBTQ+ documentaries
has top concept: Subcultures
issued: 2024-10-23
modified: 2025-02-23
type: Concept
in scheme: v3
change note: Version 4.1.0

Bisexual documentaries
alternative label: Bisexual documentary films
comment: Non-fictional films that center bisexual people or topics, created for the purposes of education, advocacy, or personal expression.
broader: LGBTQ+ documentaries
has top concept: Subcultures
issued: 2024-10-23
modified: 2025-02-23
type: Concept
in scheme: v3
change note: Version 4.1.0

Transgender documentaries
alternative label: Transgender documentary films
alternative label: Trans documentaries
alternative label: Trans documentary films
comment: Non-fictional films that center trans people or topics, created for the purposes of education, advocacy, or personal expression.
broader: LGBTQ+ documentaries
has top concept: Subcultures
issued: 2024-10-23
modified: 2025-02-23
type: Concept
in scheme: v3
change note: Version 4.1.0

Queer documentaries
alternative label: Queer documentary films
comment: Non-fictional films that center queer people or topics, created for the purposes of education, advocacy, or personal expression.
broader: LGBTQ+ documentaries
has top concept: Subcultures
issued: 2024-10-23
modified: 2025-02-23
type: Concept
in scheme: v3
change note: Version 4.1.0

Non-binary documentaries
alternative label: Non-binary documentary films
alternative label: Nonbinary documentaries
alternative label: Nonbinary documentary films
comment: Non-fictional films that center non-binary people or topics, created for the purposes of education, advocacy, or personal expression.
broader: LGBTQ+ documentaries
has top concept: Subcultures
issued: 2024-10-23
modified: 2025-02-23
type: Concept
in scheme: v3
change note: Version 4.1.0

Intersex documentaries
alternative label: Intersex documentary films
comment: Non-fictional films that center intersex people or topics, created for the purposes of education, advocacy, or personal expression.
broader: LGBTQ+ documentaries
has top concept: Subcultures
issued: 2024-10-23
modified: 2025-02-23
type: Concept
in scheme: v3
change note: Version 4.1.0

Two-Spirit documentaries
alternative label: Two Spirit documentaries
alternative label: Two-Spirited documentaries
alternative label: Two Spirited documentaries
alternative label: 2S documentaries
alternative label: Two-Spirit documentary films
comment: Non-fictional films that center Two-Spirit people or topics, created for the purposes of education, advocacy, or personal expression.
broader: Two-Spirit films
related: LGBTQ+ documentaries
has top concept: Two-Spirit films
issued: 2024-10-23
modified: 2025-02-23
type: Concept
in scheme: v3
change note: Version 4.1.0

Asexual documentaries
alternative label: Asexual documentary films
comment: Non-fictional films that center asexual people or topics, created for the purposes of education, advocacy, or personal expression.
broader: LGBTQ+ documentaries
has top concept: Subcultures
issued: 2024-10-23
modified: 2025-02-23
type: Concept
in scheme: v3
change note: Version 4.1.0

Aromantic documentaries
alternative label: Aromantic documentary films
comment: Non-fictional films that center aromantic people or topics, created for the purposes of education, advocacy, or personal expression.
broader: LGBTQ+ documentaries
has top concept: Subcultures
issued: 2024-10-23
modified: 2025-02-23
type: Concept
in scheme: v3
change note: Version 4.1.0

Demisexual documentaries
alternative label: Demisexual documentary films
comment: Non-fictional films that center demisexual people or topics, created for the purposes of education, advocacy, or personal expression.
broader: LGBTQ+ documentaries
has top concept: Subcultures
issued: 2024-10-23
modified: 2025-02-23
type: Concept
in scheme: v3
change note: Version 4.1.0

Greyromantic documentaries
alternative label: Greyromantic documentary films
comment: Non-fictional films that center greyromantic people or topics, created for the purposes of education, advocacy, or personal expression.
broader: LGBTQ+ documentaries
has top concept: Subcultures
issued: 2024-10-23
modified: 2025-02-23
type: Concept
in scheme: v3
change note: Version 4.1.0

Megasexual documentaries
alternative label: Megasexual documentary films
comment: Non-fictional films that center megasexual people or topics, created for the purposes of education, advocacy, or personal expression.
broader: LGBTQ+ documentaries
has top concept: Subcultures
issued: 2024-10-23
modified: 2025-02-23
type: Concept
in scheme: v3
change note: Version 4.1.0

LGBTQ+ street fairs
alternative label: Street fairs (LGBTQ)
alternative label: LGBTQ+ street festivals
alternative label: Street festivals (LGBTQ)
alternative label: LGBTQ+ block parties
alternative label: Block parties (LGBTQ)
comment: Festivals held on public streets that celebrate the character of the surrounding neighborhood or community. Use to refer to street fairs specifically celebrating the local LGBTQ+ community.
broader: Europride
has top concept: Europride
issued: 2024-10-23
modified: 2025-02-23
type: Concept
in scheme: v3
change note: Version 4.1.0

LGBTQ+ conferences
alternative label: Conferences (LGBTQ)
alternative label: LGBTQ+ conventions
alternative label: Conventions (LGBTQ)
comment: Large formal meetings or assemblies of LGBTQ+ people.
broader: Europride
has top concept: Europride
issued: 2024-10-23
modified: 2025-02-23
type: Concept
in scheme: v3
change note: Version 4.1.0

Clit twisting
alternative label: Clitoris twisting
comment: Twisting or squeezing the clitoris to induce sexual pleasure.
broader: Clitoral sex
related: Clitoris
has top concept: Sex (Act)
issued: 2024-10-23
modified: 2025-02-23
type: Concept
in scheme: v3
change note: Version 4.1.0

Anti-gender movement
alternative label: Gender critical movement
comment: A movement that opposes what is referred to as "gender ideology," or the belief that gender is a social construct that exists on a spectrum. Members of the anti-gender movement oppose the visibility, acceptance, and civil and reproductive rights of trans, non-binary, intersex, Two-Spirit, gender diverse, and gender non-conforming people.
broader: Social movements
related: Trans-exclusionary radical feminism
related: Trans exclusivity
related: Transphobia
related: Anti-transgender discrimination
related: Anti-intersex discrimination
related: Anti-Two-Spirit discrimination
has top concept: Social movements
issued: 2024-10-23
modified: 2025-02-23
type: Concept
in scheme: v3
change note: Version 4.1.0

Sexual fluidity
comment: The idea that a person's sexual orientation can change over time or in different situations.
related: Sexuality
related: Sexual preference
related: Situational sexual behavior
issued: 2024-10-23
modified: 2025-02-23
type: Concept
in scheme: v3
change note: Version 4.1.0

Uranic people
alternative label: Androsexual people
comment: People who are attracted to all genders except women, femmes, and feminine-aligned non-binary people, regardless of what gender they were assigned at birth.
broader: LGBTQ+ people
has top concept: LGBTQ+ people
issued: 2024-10-23
modified: 2025-02-23
type: Concept
in scheme: v3
change note: Version 4.1.0

Neptunic people
alternative label: Gynesexual people
alternative label: Gynosexual people
comment: People who are attracted to all genders except men, mascs, and masculine-aligned non-binary people, regardless of what gender they were assigned at birth.
broader: LGBTQ+ people
has top concept: LGBTQ+ people
issued: 2024-10-23
modified: 2025-02-23
type: Concept
in scheme: v3
change note: Version 4.1.0

Saturnic people
alternative label: Skoliosexual people
comment: People who are solely attracted to androgynous non-binary people, rather than monogender-aligned people, regardless of what gender they were assigned at birth.
broader: LGBTQ+ people
has top concept: LGBTQ+ people
issued: 2024-10-23
modified: 2025-02-23
type: Concept
in scheme: v3
change note: Version 4.1.0

Human trafficking
alternative label: People trafficking
comment: The trade and exploitation of human beings through force, fraud, and/or coercion, often with the intention of compelling the individual to provide sexual services or other forms of labor against their will.
narrower: Sex trafficking
narrower: Labor trafficking
issued: 2024-10-30
modified: 2025-02-23
type: Concept
in scheme: v3
change note: Version 4.1.0

Sex trafficking
alternative label: Coerced sex work
alternative label: Forced sex work
alternative label: Non-consensual sex work
alternative label: Coerced prostitution
alternative label: Forced prostitution
alternative label: Non-consensual prostitution
comment: Human trafficking for the purpose of sexual exploitation, including recruiting, holding, moving, defrauding, and/or coercing people into engaging in sexual services and performances they cannot or have not meaningfully consented to.
broader: Human trafficking
related: Sex work
has top concept: Human trafficking
issued: 2024-10-30
modified: 2025-02-23
type: Concept
in scheme: v3
change note: Version 4.1.0

Labor trafficking
preferred label: Labour trafficking
alternative label: Forced labor
alternative label: Coerced labor
comment: Human trafficking for the purpose of labor exploitation, including recruiting, holding, moving, defrauding, and/or coercing people into labor, such as through debt bondage or involuntary servitude, against their will.
broader: Human trafficking
has top concept: Human trafficking
issued: 2024-10-30
modified: 2025-02-23
type: Concept
in scheme: v3
change note: Version 4.1.0

LGBTQ+ victims of human trafficking
alternative label: Victims of human trafficking (LGBTQ)
alternative label: LGBTQ+ trafficking victims
alternative label: Trafficking victims (LGBTQ)
comment: LGBTQ+ people who have experienced and may or may not have survived human trafficking. Follow the individual's preference for "victims" or "survivors" whenever possible.
broader: LGBTQ+ victims of crime
narrower: LGBTQ+ survivors of human trafficking
narrower: LGBTQ+ victims of sex trafficking
narrower: LGBTQ+ victims of labor trafficking
related: Two-Spirit victims of human trafficking
has top concept: LGBTQ+ people
issued: 2024-10-30
modified: 2025-02-23
type: Concept
in scheme: v3
change note: Version 4.1.0

LGBTQ+ survivors of human trafficking
alternative label: Survivors of human trafficking (LGBTQ)
alternative label: LGBTQ+ trafficking survivors
alternative label: Trafficking survivors (LGBTQ)
comment: LGBTQ+ people who have experienced and survived human trafficking. Follow the individual's preference for "victims" or "survivors" whenever possible.
broader: LGBTQ+ victims of human trafficking
related: Two-Spirit survivors of human trafficking
has top concept: LGBTQ+ people
issued: 2024-10-30
modified: 2025-02-23
type: Concept
in scheme: v3
change note: Version 4.1.0

Two-Spirit victims of human trafficking
alternative label: Two Spirit victims of human trafficking
alternative label: Two-Spirited victims of human trafficking
alternative label: Two Spirited victims of human trafficking
alternative label: 2S victims of human trafficking
alternative label: Two-Spirit human trafficking victims
comment: Two-Spirit people who have experienced and may or may not have survived human trafficking. Follow the individual's preference for "victims" or "survivors" whenever possible.
broader: Two-Spirit victims of crime
narrower: Two-Spirit survivors of human trafficking
narrower: Two-Spirit victims of sex trafficking
narrower: Two-Spirit victims of labor trafficking
related: LGBTQ+ victims of human trafficking
has top concept: Gender
issued: 2024-10-30
modified: 2025-02-23
type: Concept
in scheme: v3
change note: Version 4.1.0

Two-Spirit victims of crime
alternative label: Two Spirit victims of crime
alternative label: Two-Spirited victims of crime
alternative label: Two Spirited victims of crime
alternative label: 2S victims of crime
alternative label: Two-Spirit crime victims
comment: Two-Spirit people who have experienced crimes and may or may not have survived. Use more specific terms and follow the individual's preference for "victims" or "survivors" whenever possible.
broader: Two-Spirit people
narrower: Two-Spirit victims of hate crimes
narrower: Two-Spirit victims of rape
narrower: Two-Spirit victims of sexual abuse
narrower: Two-Spirit victims of war
narrower: Two-Spirit victims of human trafficking
related: Two-Spirit victims of bullying
has top concept: Gender
issued: 2024-10-30
modified: 2025-02-23
type: Concept
in scheme: v3
change note: Version 4.1.0

Two-Spirit survivors of human trafficking
alternative label: Two Spirit survivors of human trafficking
alternative label: Two-Spirited survivors of human trafficking
alternative label: Two Spirited survivors of human trafficking
alternative label: 2S survivors of human trafficking
alternative label: Two-Spirit human trafficking survivors
comment: Two-Spirit people who have experienced and survived human trafficking. Follow the individual's preference for "victims" or "survivors" whenever possible.
broader: Two-Spirit victims of human trafficking
related: LGBTQ+ survivors of human trafficking
has top concept: Gender
issued: 2024-10-30
modified: 2025-02-23
type: Concept
in scheme: v3
change note: Version 4.1.0

LGBTQ+ victims of sex trafficking
alternative label: Victims of sex trafficking (LGBTQ)
alternative label: LGBTQ+ sex trafficking victims
alternative label: Sex trafficking victims (LGBTQ)
comment: LGBTQ+ people who have experienced and may or may not have survived sex trafficking. Follow the individual's preference for "victims" or "survivors" whenever possible.
broader: LGBTQ+ victims of human trafficking
narrower: LGBTQ+ survivors of sex trafficking
related: Two-Spirit victims of sex trafficking
has top concept: LGBTQ+ people
issued: 2024-10-30
modified: 2025-02-23
type: Concept
in scheme: v3
change note: Version 4.1.0

LGBTQ+ survivors of sex trafficking
alternative label: Survivors of sex trafficking (LGBTQ)
alternative label: LGBTQ+ sex trafficking survivors
alternative label: Sex trafficking survivors (LGBTQ)
comment: LGBTQ+ people who have experienced and survived sex trafficking. Follow the individual's preference for "victims" or "survivors" whenever possible.
broader: LGBTQ+ victims of sex trafficking
related: Two-Spirit survivors of sex trafficking
has top concept: LGBTQ+ people
issued: 2024-10-30
modified: 2025-02-23
type: Concept
in scheme: v3
change note: Version 4.1.0

Two-Spirit victims of sex trafficking
alternative label: Two Spirit victims of sex trafficking
alternative label: Two-Spirited victims of sex trafficking
alternative label: Two Spirited victims of sex trafficking
alternative label: 2S victims of sex trafficking
alternative label: Two-Spirit sex trafficking victims
comment: Two-Spirit people who have experienced and may or may not have survived sex trafficking. Follow the individual's preference for "victims" or "survivors" whenever possible.
broader: Two-Spirit victims of human trafficking
narrower: Two-Spirit survivors of sex trafficking
related: LGBTQ+ victims of sex trafficking
has top concept: Gender
issued: 2024-10-30
modified: 2025-02-23
type: Concept
in scheme: v3
change note: Version 4.1.0

Two-Spirit survivors of sex trafficking
alternative label: Two Spirit survivors of sex trafficking
alternative label: Two-Spirited survivors of sex trafficking
alternative label: Two Spirited survivors of sex trafficking
alternative label: 2S survivors of sex trafficking
alternative label: Two-Spirit sex trafficking survivors
comment: Two-Spirit people who have experienced and survived sex trafficking. Follow the individual's preference for "victims" or "survivors" whenever possible.
broader: Two-Spirit victims of sex trafficking
related: LGBTQ+ survivors of sex trafficking
has top concept: Gender
issued: 2024-10-30
modified: 2025-02-23
type: Concept
in scheme: v3
change note: Version 4.1.0

LGBTQ+ victims of labor trafficking
preferred label: LGBTQ+ victims of labour trafficking
alternative label: Victims of labor trafficking (LGBTQ)
alternative label: LGBTQ+ labor trafficking victims
alternative label: Labor trafficking victims (LGBTQ)
comment: LGBTQ+ people who have experienced and may or may not have survived labor trafficking. Follow the individual's preference for "victims" or "survivors" whenever possible.
broader: LGBTQ+ victims of human trafficking
narrower: LGBTQ+ survivors of labor trafficking
related: Two-Spirit victims of labor trafficking
has top concept: LGBTQ+ people
issued: 2024-10-30
modified: 2025-02-23
type: Concept
in scheme: v3
change note: Version 4.1.0

LGBTQ+ survivors of labor trafficking
preferred label: LGBTQ+ survivors of labour trafficking
alternative label: Survivors of labor trafficking (LGBTQ)
alternative label: LGBTQ+ labor trafficking survivors
alternative label: Labor trafficking survivors (LGBTQ)
comment: LGBTQ+ people who have experienced and survived labor trafficking. Follow the individual's preference for "victims" or "survivors" whenever possible.
broader: LGBTQ+ victims of labor trafficking
related: Two-Spirit survivors of labor trafficking
has top concept: LGBTQ+ people
issued: 2024-10-30
modified: 2025-02-23
type: Concept
in scheme: v3
change note: Version 4.1.0

Two-Spirit victims of labor trafficking
preferred label: Two-Spirit victims of labour trafficking
alternative label: Two Spirit victims of labor trafficking
alternative label: Two-Spirited victims of labor trafficking
alternative label: Two Spirited victims of labor trafficking
alternative label: 2S victims of labor trafficking
alternative label: Two-Spirit labor trafficking victims
comment: Two-Spirit people who have experienced and may or may not have survived labor trafficking. Follow the individual's preference for "victims" or "survivors" whenever possible.
broader: Two-Spirit victims of human trafficking
narrower: Two-Spirit survivors of labor trafficking
related: LGBTQ+ victims of labor trafficking
has top concept: Gender
issued: 2024-10-30
modified: 2025-02-23
type: Concept
in scheme: v3
change note: Version 4.1.0

Two-Spirit survivors of labor trafficking
preferred label: Two-Spirit survivors of labour trafficking
alternative label: Two Spirit survivors of labor trafficking
alternative label: Two-Spirited survivors of labor trafficking
alternative label: Two Spirited survivors of labor trafficking
alternative label: 2S survivors of labor trafficking
alternative label: Two-Spirit labor trafficking survivors
comment: Two-Spirit people who have experienced and survived labor trafficking. Follow the individual's preference for "victims" or "survivors" whenever possible.
broader: Two-Spirit victims of labor trafficking
related: LGBTQ+ survivors of labor trafficking
has top concept: Gender
issued: 2024-10-30
modified: 2025-02-23
type: Concept
in scheme: v3
change note: Version 4.1.0

Sex workers
alternative label: Prostitutes
alternative label: Hookers
alternative label: Hustlers
alternative label: Pros
comment: People who receive money or goods in exchange for sexual services, performances, or companionship. Use to describe people working across the broad spectrum of sex work, and use more specific terms if possible
narrower: LGBTQ+ sex workers
narrower: Phone sex workers
narrower: Strippers
narrower: Women sex workers
narrower: Men sex workers
narrower: Escorts
narrower: Two-Spirit sex workers
narrower: Māhū sex workers
narrower: Cam models
narrower: Sugar babies
narrower: Sex workers of color
narrower: Porn stars
related: Gay for pay
related: Sex work
issued: 2024-10-30
modified: 2025-02-23
type: Concept
in scheme: v3
change note: Version 4.1.0

Intersex sex workers
alternative label: Intersex prostitutes
alternative label: Intersex prostitution
comment: Intersex people who receive money or goods in exchange for sexual services, performances, or companionship. Use to describe intersex people working across the broad spectrum of sex work.
broader: LGBTQ+ sex workers
has top concept: Sex workers
issued: 2024-10-30
modified: 2025-02-23
type: Concept
in scheme: v3
change note: Version 4.1.0

Non-binary sex workers
alternative label: Nonbinary sex workers
alternative label: Non-binary prostitutes
alternative label: Nonbinary prostitutes
alternative label: Non-binary prostitution
alternative label: Nonbinary prostitution
comment: Non-binary people who receive money or goods in exchange for sexual services, performances, or companionship. Use to describe non-binary people working across the broad spectrum of sex work.
broader: LGBTQ+ sex workers
has top concept: Sex workers
issued: 2024-10-30
modified: 2025-02-23
type: Concept
in scheme: v3
change note: Version 4.1.0

Two-Spirit sex workers
alternative label: Two Spirit sex workers
alternative label: Two-Spirited sex workers
alternative label: Two Spirited sex workers
alternative label: 2S sex workers
alternative label: Two-Spirit prostitutes
alternative label: Two Spirit prostitutes
alternative label: Two-Spirited prostitutes
alternative label: Two Spirited prostitutes
alternative label: 2S prostitutes
alternative label: Two-Spirit prostitution
comment: Two-Spirit people who receive money or goods in exchange for sexual services, performances, or companionship. Use to describe Two-Spirit people working across the broad spectrum of sex work.
broader: Two-Spirit people
broader: Sex workers
related: LGBTQ+ sex workers
has top concept: Gender
issued: 2024-10-30
modified: 2025-02-23
type: Concept
in scheme: v3
change note: Version 4.1.0

Māhū sex workers
alternative label: Mahu sex workers
alternative label: Māhū prostitutes
alternative label: Mahu prostitutes
alternative label: Māhū prostitution
alternative label: Mahu prostitution
alternative label: Māhū sex work
alternative label: Mahu sex work
comment: Māhū who receive money or goods in exchange for sexual services, performances, or companionship. Use to describe Māhū working across the broad spectrum of sex work.
broader: Māhū
broader: Sex workers
related: LGBTQ+ sex workers
has top concept: Gender
issued: 2024-10-30
modified: 2025-02-23
type: Concept
in scheme: v3
change note: Version 4.1.0

Phone sex work
alternative label: Telephone sex work
comment: Real-time sex work via phone calls, text messaging, or online voice calls. Use "Cam modeling" for real-time sex work via online video calls and livestreams.
broader: Sex work
related: Phone sex workers
has top concept: Sex industry
issued: 2024-10-30
modified: 2025-02-23
type: Concept
in scheme: v3
change note: Version 4.1.0

Stripping
alternative label: Pole dancing
alternative label: Pole-dancing
alternative label: Peeling
alternative label: Stripteasing
alternative label: Exotic dancing
comment: A form of sex work that involves undressing to music while using a pole to perform dance moves, whether in a venue like a strip club or by hire at private parties. Stripping may also be performed by amateurs in private settings.
broader: Sex work
related: Strippers
has top concept: Sex industry
issued: 2024-10-30
modified: 2025-02-23
type: Concept
in scheme: v3
change note: Version 4.1.0

Anti-sex work feminism
alternative label: Anti sex work feminism
alternative label: Anti-sex-work feminism
comment: A form of feminism that alleges that sex work is inherently coercive and exploitative. Although not all sex workers are women and not all clients are men, anti-sex work feminism largely centers this gender dynamic, viewing sex work as a result and reinforcement of the patriarchy.
broader: Feminism
related: SWERFs
related: Sex work abolition
has top concept: Feminism
issued: 2024-10-30
modified: 2025-02-23
type: Concept
in scheme: v3
change note: Version 4.1.0

SWERFs
alternative label: Sex work exclusionary radical feminists
alternative label: Sex worker exclusionary radical feminists
comment: An acronym for "sex work-exclusionary radical feminists," this term refers to people who subscribe to a subset of radical feminism that rejects sex worker rights and solidarity with sex workers under the belief that sex work is antithetical to their ideology and inherently perpetuates oppression against women.
broader: Radical feminists
related: Anti-sex work feminism
has top concept: Feminists
issued: 2024-10-30
modified: 2025-02-23
type: Concept
in scheme: v3
change note: Version 4.1.0

Anti-pornography feminism
alternative label: Anti-porn feminism
alternative label: Anti pornography feminism
alternative label: Anti porn feminism
comment: A form of feminism that alleges that pornography is a result and reinforcement of the patriarchy and is thus inherently violent and exploitative.
broader: Feminism
has top concept: Feminism
issued: 2024-10-30
modified: 2025-02-23
type: Concept
in scheme: v3
change note: Version 4.1.0

Cam modeling
alternative label: Camming
alternative label: Webcam modeling
comment: Short for "webcam modeling," this term refers to real-time sex work via online video calls and livestreams.
broader: Sex work
related: Cam models
has top concept: Sex industry
issued: 2024-10-30
modified: 2025-02-23
type: Concept
in scheme: v3
change note: Version 4.1.0

Cam models
alternative label: Webcam models
alternative label: Cammodels
comment: Short for "webcam models," this term refers to sex workers who exchange sexual services, performances, or companionship via online video calls and livestreams.
broader: Sex workers
narrower: Camboys
narrower: Camgirls
related: Cam modeling
has top concept: Sex workers
issued: 2024-10-30
modified: 2025-02-23
type: Concept
in scheme: v3
change note: Version 4.1.0

Camboys
alternative label: Cam boys
alternative label: Webcam boys
comment: Short for "webcam boys," this term refers to men sex workers who exchange sexual services, performances, or companionship via online video calls and livestreams. Use only for individuals who self-identify as camboys; otherwise, use "Cam models."
broader: Cam models
has top concept: Sex workers
issued: 2024-10-30
modified: 2025-02-23
type: Concept
in scheme: v3
change note: Version 4.1.0

Camgirls
alternative label: Cam girls
alternative label: Webcam girls
comment: Short for "webcam girls," this term refers to women sex workers who exchange sexual services, performances, or companionship via online video calls and livestreams. Use only for individuals who self-identify as camgirls; otherwise, use "Cam models."
broader: Cam models
has top concept: Sex workers
issued: 2024-10-30
modified: 2025-02-23
type: Concept
in scheme: v3
change note: Version 4.1.0

Sex work legislation
alternative label: Sex work laws
alternative label: Prostitution legislation
alternative label: Prostitution laws
comment: Laws and regulations addressing the practice, solitiation, and/or facilitation of sex work, including its legality. Legislation may variously address the actions of sex workers, their clients, third parties, and/or other individuals who work in proximity to or seek to aid sex workers.
broader: Law
narrower: Legalization of sex work
narrower: Nordic model (Sex work)
related: Criminalization of sex work
related: Decriminalization of sex work
has top concept: Law
issued: 2024-10-30
modified: 2025-02-23
type: Concept
in scheme: v3
change note: Version 4.1.0

Criminalization of sex work
preferred label: Criminalisation of sex work
alternative label: Sex work criminalization
alternative label: Criminalization of prostitution
alternative label: Prostitution criminalization
comment: The process by which the practice and solicitation of sex work is made criminal, typically by introducing laws, regulations, and criminal penalties. Efforts to criminalize sex work often target street sex work and other forms of "direct," visible sex work.
broader: Criminalization
related: Sex work legislation
related: Decriminalization of sex work
related: Legalization of sex work
related: Nordic model (Sex work)
related: Sex work abolition
has top concept: Law
issued: 2024-10-30
modified: 2025-02-23
type: Concept
in scheme: v3
change note: Version 4.1.0

Decriminalization of sex work
preferred label: Decriminalisation of sex work
alternative label: Sex work decriminalization
alternative label: Decriminalization of prostitution
alternative label: Prostitution decriminalization
comment: The process of lessening or removing laws, regulations, and/or criminal penalties targeting the practice, solicitation, and/or facilitation of sex work. Decriminalization efforts may variously address the actions of sex workers, their clients, third parties, and/or other individuals who work in proximity to or seek to aid sex workers.
broader: Decriminalization
related: Sex work legislation
related: Criminalization of sex work
related: Legalization of sex work
related: Nordic model (Sex work)
related: Sex work abolition
has top concept: Law
issued: 2024-10-30
modified: 2025-02-23
type: Concept
in scheme: v3
change note: Version 4.1.0

Legalization of sex work
preferred label: Legalisation of sex work
alternative label: Sex work legalization
alternative label: Legalization of prostitution
alternative label: Prostitution legalization
comment: The creation of a set of laws and regulations intended to legalize the practice and solicitation of sex work, particularly street sex work and other forms of "direct," visible sex work, within certain parameters. This may variously include legalizing the actions of sex workers, their clients, third parties, and/or other individuals who work in proximity to or seek to aid sex workers. Individuals operating outside of these laws and regulations remain subject to penalties.
broader: Sex work legislation
related: Decriminalization of sex work
related: Criminalization of sex work
related: Sex work abolition
has top concept: Law
issued: 2024-10-30
modified: 2025-02-23
type: Concept
in scheme: v3
change note: Version 4.1.0

Nordic model (Sex work)
alternative label: End demand (Sex work)
alternative label: Equality model (Sex work)
alternative label: Neo-abolition movement (Sex work)
alternative label: Nordic and Swedish model (Sex work)
alternative label: Swedish model (Sex work)
comment: A legislative approach to sex work first instituted in Sweden in 1999 and then in Norway in 2009 that centers on the criminalization of clients, third parties, and many of the ways sex workers operate. The Nordic model is a form of sex work abolition predicated on the idea that no person can consent to engage in commercial sexual services and that sex workers must therefore be educated and reformed. Sex workers and activists have heavily criticized and opposed the Nordic model.
broader: Sex work legislation
broader: Sex work abolition
related: Criminalization of sex work
related: Decriminalization of sex work
has top concept: Law
issued: 2024-10-30
modified: 2025-02-23
type: Concept
in scheme: v3
change note: Version 4.1.0

Sex work abolition
alternative label: Abolition movement (Sex work)
alternative label: Sex work abolitionism
alternative label: Sex work abolition movement
comment: A movement to abolish sex work through a variety of different means, including supporting "end demand" laws, the Nordic model, or the broader criminalization of sex work; organizing and speaking vocally against sex work as inherently exploitative; and rejecting efforts to recognize sex work as labor.
narrower: Nordic model (Sex work)
related: Criminalization of sex work
related: Decriminalization of sex work
related: Anti-sex work feminism
related: Legalization of sex work
issued: 2024-10-30
modified: 2025-02-23
type: Concept
in scheme: v3
change note: Version 4.1.0

Curb crawling
preferred label: Kerb crawling
comment: The practice of driving or idling in one's car around areas known for street sex work in order to solicit sex workers.
broader: Solicitation of sex work
related: Sex workers' clients
has top concept: Solicitation of sex work
issued: 2024-10-30
modified: 2025-02-23
type: Concept
in scheme: v3
change note: Version 4.1.0

Solicitation of sex work
alternative label: Soliciting
comment: The act of offering or attempting to exchange money or goods for sexual services or performances.
narrower: Curb crawling
related: Sex workers' clients
issued: 2024-10-30
modified: 2025-02-23
type: Concept
in scheme: v3
change note: Version 4.1.0

Street sex work
alternative label: Street prostitution
comment: Sex work that is generally solicited in a public place such as a street, street corner, or park.
broader: Sex work
has top concept: Sex industry
issued: 2024-10-30
modified: 2025-02-23
type: Concept
in scheme: v3
change note: Version 4.1.0

Survival sex work
alternative label: Survival prostitution
comment: A form of sex work performed in lieu of other employment or in order to meet immediate needs, such as shelter, food, clothing, familial care, etc. Use only for sex work that is self-described as survival.
broader: Sex work
has top concept: Sex industry
issued: 2024-10-30
modified: 2025-02-23
type: Concept
in scheme: v3
change note: Version 4.1.0

Third parties (Sex work)
comment: A legal term for individuals who supervise, coordinate, assist, or facilitate sex work, either on behalf of sex workers or their clients. Third parties include managers, brothel-keepers, concierges, drivers etc.
narrower: Madams (Sex work)
narrower: Pimps
narrower: Sex work concierges
issued: 2024-10-30
modified: 2025-02-23
type: Concept
in scheme: v3
change note: Version 4.1.0

Madams (Sex work)
alternative label: Procuresses
comment: People who mediate between sex workers and clients. This term has historically been used to describe women but can be used for individuals of any gender based on their preference. Follow the individual's preference for "Madams," "Pimps," or "Sex work concierges" whenever possible.
broader: Third parties (Sex work)
has top concept: Third parties (Sex work)
issued: 2024-10-30
modified: 2025-02-23
type: Concept
in scheme: v3
change note: Version 4.1.0

Pimps
alternative label: Procurers
comment: People who mediate between sex workers and clients. Since the 20th century, this term has been used as a derogatory way of describing urban, working-class Black American men, regardless of their involvement in the facilitation of sex work. While some Black Americans--including women--have embraced an evolved version of the word "pimp," often stripped of its association with sex work facilitation, it still carries racist and classist connotations and should be used with caution. Follow the individual's preference for "Pimps," "Madams," or "Sex work concierges" whenever possible.
broader: Third parties (Sex work)
has top concept: Third parties (Sex work)
issued: 2024-10-30
modified: 2025-02-23
type: Concept
in scheme: v3
change note: Version 4.1.0

Sex work concierges
comment: People who mediate between sex workers and clients. Follow the individual's preference for "Sex work concierges," "Pimps," or "Madams" whenever possible.
broader: Third parties (Sex work)
has top concept: Third parties (Sex work)
issued: 2024-10-30
modified: 2025-02-23
type: Concept
in scheme: v3
change note: Version 4.1.0

Anti-sex worker discrimination
alternative label: Discrimination against sex workers
alternative label: Anti sex worker discrimination
alternative label: Anti-prostitute discrimination
alternative label: Anti prostitute discrimination
alternative label: Discrimination against prostitutes
comment: The unjust or prejudicial treatment of sex workers due to their work or identity as a sex worker; may include the denial of legal rights, employment, and housing.
related: Anti-sex worker violence
related: Murder of sex workers
issued: 2024-10-30
modified: 2025-02-23
type: Concept
in scheme: v3
change note: Version 4.1.0

Anti-sex worker violence
alternative label: Violence against sex workers
alternative label: Anti sex worker violence
alternative label: Anti-prostitute violence
alternative label: Anti prostitute violence
alternative label: Violence against prostitutes
comment: Behavior involving physical force intended to harm or kill sex workers on the basis of their work or identity as a sex worker.
narrower: Murder of sex workers
related: Hate crimes
related: Anti-sex worker discrimination
issued: 2024-10-30
modified: 2025-02-23
type: Concept
in scheme: v3
change note: Version 4.1.0

Murder of sex workers
alternative label: Murder of prostitutes
comment: Intentional killing of sex workers on the basis of their work or identity as a sex worker.
broader: Anti-sex worker violence
related: Hate crimes
related: Anti-sex worker discrimination
has top concept: Anti-sex worker violence
issued: 2024-10-30
modified: 2025-02-23
type: Concept
in scheme: v3
change note: Version 4.1.0

Harm reduction (Sex work)
comment: A set of practical strategies and ideas aimed at reducing the negative impacts of sex work on sex workers, as well as a social justice movement advocating for the rights of sex workers.
related: Sex worker rights
related: Sex work activism
issued: 2024-10-30
modified: 2025-02-23
type: Concept
in scheme: v3
change note: Version 4.1.0

Sex worker rights
alternative label: Sex workers' rights
alternative label: Rights of sex workers
alternative label: Prostitute rights
alternative label: Prostitutes' rights
alternative label: Rights of prostitutes
comment: Legal, social, or ethical principles of freedom or entitlement held by or pursued by sex workers. This includes, but is not limited to, human rights, health rights, freedom from discrimination and prejudice, and labor rights.
related: Harm reduction (Sex work)
related: Sex work activism
issued: 2024-10-30
modified: 2025-02-23
type: Concept
in scheme: v3
change note: Version 4.1.0

Sex work activism
alternative label: Prostitution activism
comment: Direct action and organizing to achieve political or social change and acceptance for sex workers.
related: Sex worker rights
related: Harm reduction (Sex work)
issued: 2024-10-30
modified: 2025-02-23
type: Concept
in scheme: v3
change note: Version 4.1.0

Sugaring
alternative label: Sugar dating
comment: A form of sex work in which companionship and sexual services are exchanged for money, gifts, and other material benefits. Generally but not always sugaring describes a relationship between an older client and a younger sex worker.
broader: Sex work
related: Sugar babies
related: Sugar daddies
related: Sugar mamas
has top concept: Sex industry
issued: 2024-10-30
modified: 2025-02-23
type: Concept
in scheme: v3
change note: Version 4.1.0

Sugar babies
comment: People who provide companionship and sexual services to sugar mamas or daddies in exchange for money, gifts, and other material benefits.
broader: Sex workers
related: Sugaring
related: Sugar daddies
related: Sugar mamas
has top concept: Sex workers
issued: 2024-10-30
modified: 2025-02-23
type: Concept
in scheme: v3
change note: Version 4.1.0

Sugar daddies
comment: People who provide money, gifts, and other material benefits to sugar babies in exchange for companionship and sexual services. Follow the individual's preference for "Sugar daddies" or "Sugar mamas" whenever possible.
broader: Sex workers' clients
related: Sugar babies
related: Sugaring
has top concept: Sex workers' clients
issued: 2024-10-30
modified: 2025-02-23
type: Concept
in scheme: v3
change note: Version 4.1.0

Sugar mamas
alternative label: Sugar mommas
alternative label: Sugar mommies
comment: People who provide money, gifts, and other material benefits to sugar babies in exchange for companionship and sexual services. Follow the individual's preference for "Sugar mamas" or "Sugar daddies" whenever possible.
broader: Sex workers' clients
related: Sugar babies
related: Sugaring
has top concept: Sex workers' clients
issued: 2024-10-30
modified: 2025-02-23
type: Concept
in scheme: v3
change note: Version 4.1.0

Erotic massage businesses
alternative label: Sexual massage parlors
alternative label: Rub and tug massage parlors
alternative label: Full service massage parlors
alternative label: Erotic massage parlors
comment: Massage businesses that provide sexual services, either legally or under the table.
broader: Sex industry
related: Erotic massage
has top concept: Sex industry
issued: 2024-10-30
modified: 2025-02-23
type: Concept
in scheme: v3
change note: Version 4.1.0

LGBTQ+ strippers
alternative label: Strippers (LGBTQ)
alternative label: LGBTQ+ stripteasers
alternative label: Stripteasers (LGBTQ)
alternative label: LGBTQ+ pole dancers
alternative label: Pole dancers (LGBTQ)
alternative label: LGBTQ+ peelers
alternative label: Peelers (LGBTQ)
alternative label: LGBTQ+ exotic dancers
alternative label: Exotic dancers (LGBTQ)
comment: LGBTQ+ sex workers who undress to music while using a pole to perform dance moves, whether in a venue like a strip club or by hire at private parties. For stripping performed by amateurs in private settings, use "Stripping."
broader: LGBTQ+ sex workers
has top concept: Sex workers
issued: 2024-10-30
modified: 2025-02-23
type: Concept
in scheme: v3
change note: Version 4.1.0

LGBTQ+ porn stars
alternative label: LGBTQ+ pornstars
alternative label: LGBTQ+ porn actors
alternative label: LGBTQ+ porn actresses
alternative label: Porn stars (LGBTQ)
alternative label: Pornstars (LGBTQ)
alternative label: Porn actors (LGBTQ)
alternative label: Porn actresses (LGBTQ)
alternative label: LGBTQ+ adult entertainers
alternative label: Adult entertainers (LGBTQ)
comment: LGBTQ+ actors in erotic or sexually explicit films.
broader: Porn stars
broader: LGBTQ+ actors
broader: LGBTQ+ sex workers
related: LGBTQ+ porn films
has top concept: Sex workers
issued: 2024-10-30
modified: 2025-02-23
type: Concept
in scheme: v3
change note: Version 4.1.0

Red light districts
alternative label: Red-light districts
alternative label: Pleasure districts
comment: Areas designated (often but not always legally) for the practice and solicitation of sex work.
broader: Sex industry
narrower: Sex drive-ins
has top concept: Sex industry
issued: 2024-10-30
modified: 2025-05-28
type: Concept
in scheme: v3
change note: Version 4.1.0

Sex drive-ins
alternative label: Sex boxes
comment: Partitioned car garages found in a few countries in Europe that are designed to allow and facilitate sex work in cars. Sex drive-ins are often created by local authorities to help regulate where sex work occurs.
broader: Red light districts
has top concept: Sex industry
issued: 2024-10-30
modified: 2025-02-23
type: Concept
in scheme: v3
change note: Version 4.1.0

Sex workers of color
preferred label: Sex workers of colour
alternative label: People of color sex workers
alternative label: Racialized sex workers
alternative label: Non-white sex workers
comment: Sex workers who are not white and self-identify as people of color.
broader: Sex workers
related: LGBTQ+ people of color
has top concept: Sex workers
issued: 2024-10-30
modified: 2025-02-23
type: Concept
in scheme: v3
change note: Version 4.1.0

LGBTQ+ pornography
alternative label: Pornography (LGBTQ)
alternative label: Porn (LGBTQ)
comment: Printed or visual materials that explicitly depict sexual acts. Use in reference to pornography featuring LGBTQ+ performers and/or made for LGBTQ+ people.
broader: Pornography
narrower: LGBTQ+ porn films
narrower: LGBTQ+ porn magazines
narrower: Lesbian pornography
narrower: Gay pornography
narrower: Bisexual pornography
narrower: Transgender pornography
narrower: Queer pornography
narrower: Intersex pornography
narrower: Non-binary pornography
related: Two-Spirit pornography
has top concept: Sex industry
issued: 2024-10-30
modified: 2025-02-23
type: Concept
in scheme: v3
change note: Version 4.1.0

Lesbian pornography
comment: Printed or visual materials that explicitly depict sexual acts. Use in reference to pornography featuring lesbian performers and/or made for lesbians.
broader: LGBTQ+ pornography
has top concept: Sex industry
issued: 2024-10-30
modified: 2025-02-23
type: Concept
in scheme: v3
change note: Version 4.1.0

Gay pornography
comment: Printed or visual materials that explicitly depict sexual acts. Use in reference to pornography featuring gay performers and/or made for gay men.
broader: LGBTQ+ pornography
has top concept: Sex industry
issued: 2024-10-30
modified: 2025-02-23
type: Concept
in scheme: v3
change note: Version 4.1.0

Bisexual pornography
comment: Printed or visual materials that explicitly depict sexual acts. Use in reference to pornography featuring bisexual performers and/or made for bisexual people.
broader: LGBTQ+ pornography
has top concept: Sex industry
issued: 2024-10-30
modified: 2025-02-23
type: Concept
in scheme: v3
change note: Version 4.1.0

Transgender pornography
alternative label: Trans pornography
comment: Printed or visual materials that explicitly depict sexual acts. Use in reference to pornography featuring transgender performers and/or made for transgender people.
broader: LGBTQ+ pornography
has top concept: Sex industry
issued: 2024-10-30
modified: 2025-02-23
type: Concept
in scheme: v3
change note: Version 4.1.0

Queer pornography
comment: Printed or visual materials that explicitly depict sexual acts. Use in reference to pornography featuring queer performers and/or made for queer people.
broader: LGBTQ+ pornography
has top concept: Sex industry
issued: 2024-10-30
modified: 2025-02-23
type: Concept
in scheme: v3
change note: Version 4.1.0

Intersex pornography
comment: Printed or visual materials that explicitly depict sexual acts. Use in reference to pornography featuring intersex performers and/or made for intersex people.
broader: LGBTQ+ pornography
has top concept: Sex industry
issued: 2024-10-30
modified: 2025-02-23
type: Concept
in scheme: v3
change note: Version 4.1.0

Non-binary pornography
alternative label: Nonbinary pornography
comment: Printed or visual materials that explicitly depict sexual acts. Use in reference to pornography featuring non-binary performers and/or made for non-binary people.
broader: LGBTQ+ pornography
has top concept: Sex industry
issued: 2024-10-30
modified: 2025-02-23
type: Concept
in scheme: v3
change note: Version 4.1.0

Two-Spirit pornography
alternative label: 2S pornography
alternative label: Two-Spirited pornography
alternative label: Two Spirited pornography
alternative label: Two Spirit pornography
comment: Printed or visual materials that explicitly depict sexual acts. Use in reference to pornography featuring Two-Spirit performers and/or made for Two-Spirit people.
related: LGBTQ+ pornography
issued: 2024-10-30
modified: 2025-02-23
type: Concept
in scheme: v3
change note: Version 4.1.0

Binders (Chest)
alternative label: Chest binders
comment: Tight-fitting shirts, straps, or similar materials worn to flatten or conceal the chest area, often by transgender men and transmasculine people.
broader: Clothing
related: Binding (Chest)
has top concept: Gender
issued: 2024-11-27
modified: 2025-02-23
type: Concept
in scheme: v3
change note: Version 4.1.0

Female impersonation shows
alternative label: Female impersonator shows
alternative label: Female impersonators' shows
comment: Theater or stage shows featuring female impersonators, a historical term used to describe performers, often male-identified people, who enact female personas for the purpose of entertainment, typically for straight audiences. Only use in historical contexts.
broader: LGBTQ+ historical terms
related: Female impersonators
related: Drag shows
has top concept: LGBTQ+ historical terms
issued: 2024-11-27
modified: 2025-02-23
type: Concept
in scheme: v3
change note: Version 4.1.0

Male impersonation shows
alternative label: Male impersonator shows
alternative label: Male impersonators' shows
comment: Theater or stage shows featuring male impersonators, a historical term used to describe performers, often female-identified people, who enact male personas for the purpose of entertainment, typically for straight audiences. Only use in historical contexts.
broader: LGBTQ+ historical terms
related: Male impersonators
related: Drag shows
has top concept: LGBTQ+ historical terms
issued: 2024-11-27
modified: 2025-02-23
type: Concept
in scheme: v3
change note: Version 4.1.0

Hispanic non-binary people
alternative label: Hispanic nonbinary people
alternative label: Non-binary Hispanic people
alternative label: Nonbinary Hispanic people
alternative label: Non-binary Hispanics
alternative label: Nonbinary Hispanics
comment: Non-binary people who are from or descended from Spain or other regions formerly colonized by Spain that are primarily Spanish-speaking. Only use for individuals who self-identify as Hispanic; do not conflate with Latino/a/x or Chicano/a/x.
broader: Hispanic LGBTQ+ people
has top concept: LGBTQ+ people
issued: 2024-11-27
modified: 2025-02-23
type: Concept
in scheme: v3
change note: Version 4.1.0

Hispanic asexual people
alternative label: Asexual Hispanic people
alternative label: Asexual Hispanics
comment: Asexual people who are from or descended from Spain or other regions formerly colonized by Spain that are primarily Spanish-speaking. Only use for individuals who self-identify as Hispanic; do not conflate with Latino/a/x or Chicano/a/x.
broader: Hispanic LGBTQ+ people
has top concept: LGBTQ+ people
issued: 2024-11-27
modified: 2025-02-23
type: Concept
in scheme: v3
change note: Version 4.1.0

Chicano/a/x asexual people
alternative label: Asexual Chicanas
alternative label: Asexual Chicanos
alternative label: Asexual Chicanx people
alternative label: Asexual Chicanxs
alternative label: Chicana asexual people
alternative label: Chicano asexual people
alternative label: Chicanx asexual people
comment: Asexual people of Mexican descent born in the United States; only use to describe people who self-identify as Chicano, Chicana, or Chicanx. Do not conflate with Latino/a/x or Hispanic people.
broader: Chicano/a/x LGBTQ+ people
has top concept: LGBTQ+ people
issued: 2024-12-12
modified: 2025-02-23
type: Concept
in scheme: v3
change note: Version 4.1.0

LGBTQ+ dating
alternative label: Dating (LGBTQ)
comment: Term used to describe people spending regular time together due to mutual romantic interest. Use to refer to dating between and/or as experienced by LGBTQ+ people.
broader: Relationship satisfaction
narrower: LGBTQ+ online dating
related: Dating applications
related: LGBTQ+ dating websites
has top concept: Relationship satisfaction
issued: 2024-12-12
modified: 2025-04-01
type: Concept
in scheme: v3
change note: Version 4.1.0

LGBTQ+ essays
alternative label: Essays (LGBTQ)
alternative label: LGBTQ+ papers
alternative label: Papers (LGBTQ)
comment: Short pieces of prose writing, typically analytical or interpretive, from an LGBTQ+ perspective or addressing LGBTQ+ issues.
broader: LGBTQ+ literature
has top concept: Subcultures
issued: 2024-12-12
modified: 2025-02-23
type: Concept
in scheme: v3
change note: Version 4.1.0

Queer bodies
alternative label: Queered bodies
comment: Bodies that resist definition by defying social norms such as heteronormativity, cisnormativity, and other forms of essentialism, regardless of the individual's identity.
broader: Queer theory
related: Queer people
has top concept: Theories
issued: 2024-12-12
modified: 2025-02-23
type: Concept
in scheme: v3
change note: Version 4.1.0

Neurogender
comment: Term used to describe the identity of neurodivergent people whose neurodivergence(s) greatly affect and cannot be unlinked from their gender. Only use to describe neurodivergent people who describe themselves as neurogender.
broader: Gender
narrower: Autigender
related: LGBTQ+ neurodivergent people
has top concept: Gender
issued: 2024-12-12
modified: 2026-02-23
type: Concept
in scheme: v3
change note: Version 4.1.0

Autigender
comment: Term used to describe the identity of autistic people whose autism greatly affects and cannot be unlinked from their gender. Only use to describe autistic people who describe themselves as autigender.
broader: Neurogender
related: LGBTQ+ autistic people
has top concept: Gender
issued: 2024-12-12
modified: 2026-02-23
type: Concept
in scheme: v3
change note: Version 4.1.0

Queer desire
comment: Desire that resists definition by defying social norms such as heteronormativity, cisnormativity, and other forms of essentialism, regardless of the individual's identity.
broader: Queer theory
related: Queer relationships
related: Being in love
has top concept: Theories
issued: 2024-12-12
modified: 2025-02-23
type: Concept
in scheme: v3
change note: Version 4.1.0

Hispanic American LGBTQ+ people
alternative label: Hispanic Americans (LGBTQ)
alternative label: Hispanic American people (LGBTQ)
alternative label: LGBTQ+ Hispanic Americans
alternative label: LGBTQ+ Hispanic American people
comment: LGBTQ+ people who were born in or currently reside in the United States and are descended from Spain or other regions formerly colonized by Spain that are primarily Spanish-speaking. Only use for individuals who self-identify as Hispanic American; do not conflate with Latino/a/x or Chicano/a/x.
broader: Hispanic LGBTQ+ people
narrower: Hispanic American lesbians
narrower: Hispanic American gay men
narrower: Hispanic American bisexual people
narrower: Hispanic American transgender people
narrower: Hispanic American queer people
narrower: Hispanic American non-binary people
narrower: Hispanic American intersex people
narrower: Hispanic American asexual people
has top concept: LGBTQ+ people
issued: 2024-12-12
modified: 2025-02-23
type: Concept
in scheme: v3
change note: Version 4.1.0

Hispanic American lesbians
alternative label: Lesbian Hispanic Americans
comment: Lesbians who were born in or currently reside in the United States and are descended from Spain or other regions formerly colonized by Spain that are primarily Spanish-speaking. Only use for individuals who self-identify as Hispanic American; do not conflate with Latino/a/x or Chicano/a/x.
broader: Hispanic American LGBTQ+ people
has top concept: LGBTQ+ people
issued: 2024-12-12
modified: 2025-02-23
type: Concept
in scheme: v3
change note: Version 4.1.0

Hispanic American gay men
alternative label: Gay Hispanic Americans
alternative label: Gay Hispanic American men
comment: Gay men who were born in or currently reside in the United States and are descended from Spain or other regions formerly colonized by Spain that are primarily Spanish-speaking. Only use for individuals who self-identify as Hispanic American; do not conflate with Latino/a/x or Chicano/a/x.
broader: Hispanic American LGBTQ+ people
has top concept: LGBTQ+ people
issued: 2024-12-12
modified: 2025-02-23
type: Concept
in scheme: v3
change note: Version 4.1.0

Hispanic American bisexual people
alternative label: Bisexual Hispanic Americans
alternative label: Bisexual Hispanic American people
comment: Bisexual people who were born in or currently reside in the United States and are descended from Spain or other regions formerly colonized by Spain that are primarily Spanish-speaking. Only use for individuals who self-identify as Hispanic American; do not conflate with Latino/a/x or Chicano/a/x.
broader: Hispanic American LGBTQ+ people
has top concept: LGBTQ+ people
issued: 2024-12-12
modified: 2025-02-23
type: Concept
in scheme: v3
change note: Version 4.1.0

Hispanic American transgender people
alternative label: Transgender Hispanic Americans
alternative label: Transgender Hispanic American people
alternative label: Hispanic American trans people
alternative label: Trans Hispanic Americans
alternative label: Trans Hispanic American people
comment: Trans people who were born in or currently reside in the United States and are descended from Spain or other regions formerly colonized by Spain that are primarily Spanish-speaking. Only use for individuals who self-identify as Hispanic American; do not conflate with Latino/a/x or Chicano/a/x.
broader: Hispanic American LGBTQ+ people
has top concept: LGBTQ+ people
issued: 2024-12-12
modified: 2025-02-23
type: Concept
in scheme: v3
change note: Version 4.1.0

Hispanic American queer people
alternative label: Queer Hispanic Americans
alternative label: Queer Hispanic American people
comment: Queer people who were born in or currently reside in the United States and are descended from Spain or other regions formerly colonized by Spain that are primarily Spanish-speaking. Only use for individuals who self-identify as Hispanic American; do not conflate with Latino/a/x or Chicano/a/x.
broader: Hispanic American LGBTQ+ people
has top concept: LGBTQ+ people
issued: 2024-12-12
modified: 2025-02-23
type: Concept
in scheme: v3
change note: Version 4.1.0

Hispanic American non-binary people
alternative label: Non-binary Hispanic Americans
alternative label: Non-binary Hispanic American people
alternative label: Hispanic American Nonbinary people
alternative label: Nonbinary Hispanic Americans
alternative label: Nonbinary Hispanic American people
comment: Non-binary people who were born in or currently reside in the United States and are descended from Spain or other regions formerly colonized by Spain that are primarily Spanish-speaking. Only use for individuals who self-identify as Hispanic American; do not conflate with Latino/a/x or Chicano/a/x.
broader: Hispanic American LGBTQ+ people
has top concept: LGBTQ+ people
issued: 2024-12-12
modified: 2025-02-23
type: Concept
in scheme: v3
change note: Version 4.1.0

Hispanic American intersex people
alternative label: Intersex Hispanic Americans
alternative label: Intersex Hispanic American people
comment: Intersex people who were born in or currently reside in the United States and are descended from Spain or other regions formerly colonized by Spain that are primarily Spanish-speaking. Only use for individuals who self-identify as Hispanic American; do not conflate with Latino/a/x or Chicano/a/x.
broader: Hispanic American LGBTQ+ people
has top concept: LGBTQ+ people
issued: 2024-12-12
modified: 2025-02-23
type: Concept
in scheme: v3
change note: Version 4.1.0

Hispanic American asexual people
alternative label: Asexual Hispanic Americans
alternative label: Asexual Hispanic American people
comment: Asexual people who were born in or currently reside in the United States and are descended from Spain or other regions formerly colonized by Spain that are primarily Spanish-speaking. Only use for individuals who self-identify as Hispanic American; do not conflate with Latino/a/x or Chicano/a/x.
broader: Hispanic American LGBTQ+ people
has top concept: LGBTQ+ people
issued: 2024-12-12
modified: 2025-02-23
type: Concept
in scheme: v3
change note: Version 4.1.0

Lesbian organizations
preferred label: Lesbian organisations
alternative label: Lesbian groups
comment: Groups or clubs of lesbians dedicated to a particular interest or activity.
broader: LGBTQ+ clubs and organizations
has top concept: LGBTQ+ clubs and organizations
issued: 2024-12-12
modified: 2025-02-23
type: Concept
in scheme: v3
change note: Version 4.1.0

Gay organizations
preferred label: Gay organisations
alternative label: Gay groups
comment: Groups or clubs of gay men dedicated to a particular interest or activity.
broader: LGBTQ+ clubs and organizations
has top concept: LGBTQ+ clubs and organizations
issued: 2024-12-12
modified: 2025-02-23
type: Concept
in scheme: v3
change note: Version 4.1.0

Bisexual organizations
preferred label: Bisexual organisations
alternative label: Bisexual groups
comment: Groups or clubs of bisexual people dedicated to a particular interest or activity.
broader: LGBTQ+ clubs and organizations
has top concept: LGBTQ+ clubs and organizations
issued: 2024-12-12
modified: 2025-02-23
type: Concept
in scheme: v3
change note: Version 4.1.0

Transgender organizations
preferred label: Transgender organisations
alternative label: Trans organizations
alternative label: Transgender groups
alternative label: Trans groups
comment: Groups or clubs of trans people dedicated to a particular interest or activity.
broader: LGBTQ+ clubs and organizations
has top concept: LGBTQ+ clubs and organizations
issued: 2024-12-12
modified: 2025-02-23
type: Concept
in scheme: v3
change note: Version 4.1.0

Queer organizations
preferred label: Queer organisations
alternative label: Queer groups
comment: Groups or clubs of queer people dedicated to a particular interest or activity.
broader: LGBTQ+ clubs and organizations
has top concept: LGBTQ+ clubs and organizations
issued: 2024-12-12
modified: 2025-02-23
type: Concept
in scheme: v3
change note: Version 4.1.0

Intersex organizations
preferred label: Intersex organisations
alternative label: Intersex groups
comment: Groups or clubs of intersex people dedicated to a particular interest or activity.
broader: LGBTQ+ clubs and organizations
has top concept: LGBTQ+ clubs and organizations
issued: 2024-12-12
modified: 2025-02-23
type: Concept
in scheme: v3
change note: Version 4.1.0

Non-binary organizations
preferred label: Non-binary organisations
alternative label: Non-binary groups
alternative label: Nonbinary organizations
alternative label: Nonbinary groups
comment: Groups or clubs of non-binary people dedicated to a particular interest or activity.
broader: LGBTQ+ clubs and organizations
has top concept: LGBTQ+ clubs and organizations
issued: 2024-12-12
modified: 2025-02-23
type: Concept
in scheme: v3
change note: Version 4.1.0

Two-Spirit organizations
preferred label: Two-Spirit organisations
alternative label: Two-Spirit groups
alternative label: Two-Spirited organizations
alternative label: Two-Spirited groups
alternative label: Two Spirit groups
alternative label: Two Spirit organizations
alternative label: Two Spirited groups
alternative label: Two Spirited organizations
alternative label: 2S groups
alternative label: 2S organizations
comment: Groups or clubs of Two-Spirit people dedicated to a particular interest or activity.
related: LGBTQ+ clubs and organizations
issued: 2024-12-12
modified: 2025-02-23
type: Concept
in scheme: v3
change note: Version 4.1.0

Reproductive health care for intersex people
alternative label: Reproductive healthcare for intersex people
comment: Access to and experiences with reproductive health care for intersex people. Reproductive health care includes contraception, abortion, STD testing and treatment, and fertility care.
broader: Reproductive health care for LGBTQ+ people
has top concept: Health care for LGBTQ+ people
issued: 2024-12-12
modified: 2025-02-23
type: Concept
in scheme: v3
change note: Version 4.1.0

Greyromantic artists
comment: Greyromantic people who practice any of various creative arts.
broader: LGBTQ+ artists
has top concept: LGBTQ+ people
issued: 2024-12-12
modified: 2025-02-23
type: Concept
in scheme: v3
change note: Version 4.1.0

Demisexual artists
comment: Demisexual people who practice any of various creative arts.
broader: LGBTQ+ artists
has top concept: LGBTQ+ people
issued: 2024-12-12
modified: 2025-02-23
type: Concept
in scheme: v3
change note: Version 4.1.0

Megasexual artists
comment: Megasexual people who practice any of various creative arts.
broader: LGBTQ+ artists
has top concept: LGBTQ+ people
issued: 2024-12-12
modified: 2025-02-23
type: Concept
in scheme: v3
change note: Version 4.1.0

Aromantic artists
comment: Aromantic people who practice any of various creative arts.
broader: LGBTQ+ artists
has top concept: LGBTQ+ people
issued: 2024-12-12
modified: 2025-02-23
type: Concept
in scheme: v3
change note: Version 4.1.0

PVC (Erotic)
alternative label: Polyvinal chloride (Erotic)
comment: Short for polyvinal chloride, PVC is a material commonly used in fetish fashion and for inflatables.
broader: BDSM
broader: LGBTQ+ fashion
has top concept: Eroticism
issued: 2025-01-09
modified: 2025-02-23
type: Concept
in scheme: v3
change note: Version 4.1.0

Sensory deprivation (Erotic)
alternative label: Sensory isolation (Erotic)
alternative label: Stimulus deprivation (Erotic)
comment: Stifling of one or more physical senses with the use of blindfolds, ear plugs, hoods, or bondage for erotic or sensual pleasure.
broader: BDSM
related: Body bags (Erotic)
related: Blindfolds
related: Hoods (Erotic)
related: Mummification (Erotic)
has top concept: Eroticism
issued: 2025-01-09
modified: 2025-02-23
type: Concept
in scheme: v3
change note: Version 4.1.0

Dehumanization (Erotic)
comment: Acts or practices in which one person behaves or is treated as an object (e.g., a table) for erotic enjoyment, sometimes as a form of humiliation.
broader: BDSM
related: Power exchange
related: Animal roleplay
related: Dollification
related: Erotic hypnosis
has top concept: Eroticism
issued: 2025-01-09
modified: 2025-03-20
type: Concept
in scheme: v3
change note: Version 4.1.0

Interviews with LGBTQ+ people
alternative label: LGBTQ+ interviews
alternative label: Interviews (LGBTQ)
comment: Structured conversations in which one participant asks questions and the other(s) provide answers. Use to refer to interviews with LGBTQ+ subjects recorded in print, radio, television, etc.
narrower: Interviews with gay men
narrower: Interviews with bisexual people
narrower: Interviews with transgender people
narrower: Interviews with intersex people
narrower: Interviews with demisexual people
narrower: Interviews with queer people
narrower: LGBTQ+ street interviews
narrower: Interviews with lesbians
related: Interviews with Two-Spirit people
issued: 2025-02-25
modified: 2026-02-24
type: Concept
in scheme: v4
change note: Version 4.1.0

Interviews with lesbians
alternative label: Lesbian interviews
comment: Structured conversations in which one participant asks questions and the other(s) provide answers. Use to refer to interviews with lesbian subjects recorded in print, radio, television, etc.
broader: Interviews with LGBTQ+ people
has top concept: Interviews with LGBTQ+ people
issued: 2025-02-26
modified: 2025-04-29
type: Concept
in scheme: v4
change note: Version 4.1.0

Interviews with gay men
alternative label: Gay interviews
comment: Structured conversations in which one participant asks questions and the other(s) provide answers. Use to refer to interviews with gay men recorded in print, radio, television, etc.
broader: Interviews with LGBTQ+ people
has top concept: Interviews with LGBTQ+ people
issued: 2025-02-27
modified: 2025-04-29
type: Concept
in scheme: v4
change note: Version 4.1.0

Interviews with bisexual people
alternative label: Bisexual interviews
comment: Structured conversations in which one participant asks questions and the other(s) provide answers. Use to refer to interviews with bisexual subjects recorded in print, radio, television, etc.
broader: Interviews with LGBTQ+ people
has top concept: Interviews with LGBTQ+ people
issued: 2025-02-27
modified: 2025-04-29
type: Concept
in scheme: v4
change note: Version 4.1.0

Interviews with transgender people
alternative label: Transgender interviews
alternative label: Interviews with trans people
alternative label: Trans interviews
comment: Structured conversations in which one participant asks questions and the other(s) provide answers. Use to refer to interviews with trans subjects recorded in print, radio, television, etc.
broader: Interviews with LGBTQ+ people
has top concept: Interviews with LGBTQ+ people
issued: 2025-02-27
modified: 2025-04-29
type: Concept
in scheme: v4
change note: Version 4.1.0

Interviews with Two-Spirit people
alternative label: Two-Spirit interviews
alternative label: Interviews with Two Spirit people
alternative label: Interviews with Two-Spirited people
alternative label: Interviews with Two Spirited people
alternative label: Interviews with 2S people
comment: Structured conversations in which one participant asks questions and the other(s) provide answers. Use to refer to interviews with Two-Spirit subjects recorded in print, radio, television, etc.
related: Interviews with LGBTQ+ people
issued: 2025-02-27
modified: 2025-04-29
type: Concept
in scheme: v4
change note: Version 4.1.0

Interviews with intersex people
alternative label: Intersex interviews
comment: Structured conversations in which one participant asks questions and the other(s) provide answers. Use to refer to interviews with intersex subjects recorded in print, radio, television, etc.
broader: Interviews with LGBTQ+ people
has top concept: Interviews with LGBTQ+ people
issued: 2025-02-27
modified: 2025-04-29
type: Concept
in scheme: v4
change note: Version 4.1.0

Interviews with demisexual people
alternative label: Demisexual interviews
comment: Structured conversations in which one participant asks questions and the other(s) provide answers. Use to refer to interviews with demisexual subjects recorded in print, radio, television, etc.
broader: Interviews with LGBTQ+ people
has top concept: Interviews with LGBTQ+ people
issued: 2025-02-27
modified: 2025-04-29
type: Concept
in scheme: v4
change note: Version 4.1.0

Interviews with queer people
alternative label: Queer interviews
comment: Structured conversations in which one participant asks questions and the other(s) provide answers. Use to refer to interviews with queer subjects recorded in print, radio, television, etc.
broader: Interviews with LGBTQ+ people
has top concept: Interviews with LGBTQ+ people
issued: 2025-02-27
modified: 2025-04-29
type: Concept
in scheme: v4
change note: Version 4.1.0

LGBTQ+ street interviews
alternative label: LGBTQ+ roaming reporting
alternative label: Street interviews (LGBTQ)
alternative label: Roaming reporting (LGBTQ)
comment: Interviews in which reporters stop LGBTQ+ people on the street, asking them questions and receiving answers in real time.
broader: Interviews with LGBTQ+ people
has top concept: Interviews with LGBTQ+ people
issued: 2025-02-27
modified: 2025-04-29
type: Concept
in scheme: v4
change note: Version 4.1.0

LGBTQ+ journalists
alternative label: Journalists (LGBTQ)
comment: LGBTQ+ people who gather information in the form of text, audio, or pictures, process it into a newsworthy form, and disseminate it to the public.
broader: LGBTQ+ people
narrower: Gay journalists
narrower: Lesbian journalists
narrower: Bisexual journalists
narrower: Intersex journalists
narrower: Queer journalists
narrower: Transgender journalists
narrower: Non-binary journalists
narrower: Asexual journalists
related: LGBTQ+ journalism
related: Two-Spirit journalists
has top concept: LGBTQ+ people
issued: 2025-02-27
modified: 2025-04-29
type: Concept
in scheme: v4
change note: Version 4.1.0

Non-binary authors
alternative label: Nonbinary authors
alternative label: Non-binary writers
alternative label: Nonbinary writers
comment: Non-binary creators of written works.
broader: LGBTQ+ authors
related: Non-binary people's writings
has top concept: LGBTQ+ people
issued: 2025-03-13
modified: 2025-03-13
type: Concept
in scheme: v4
change note: Version 4.1.0

LGBTQ+ people's writings
alternative label: Writings of LGBTQ+ people
comment: Written works created by LGBTQ+ people.
broader: LGBTQ+ literature
narrower: Lesbians' writings
narrower: Gay men's writings
narrower: Bisexual people's writings
narrower: Transgender people's writings
narrower: Queer people's writings
narrower: Intersex people's writings
narrower: Non-binary people's writings
narrower: Asexual people's writings
narrower: Aromantic people's writings
narrower: Demisexual people's writings
narrower: Greyromantic people's writings
narrower: Megasexual people's writings
related: LGBTQ+ authors
related: Two-Spirit people's writings
has top concept: Subcultures
issued: 2025-03-13
modified: 2025-03-13
type: Concept
in scheme: v4
change note: Version 4.1.0

Lesbians' writings
alternative label: Writings of lesbians
comment: Written works created by lesbians.
broader: LGBTQ+ people's writings
related: Lesbian authors
has top concept: Subcultures
issued: 2025-03-13
modified: 2025-03-13
type: Concept
in scheme: v4
change note: Version 4.1.0

Gay men's writings
alternative label: Writings of gay men
comment: Written works created by gay men.
broader: LGBTQ+ people's writings
related: Gay authors
has top concept: Subcultures
issued: 2025-03-13
modified: 2025-03-13
type: Concept
in scheme: v4
change note: Version 4.1.0

Bisexual people's writings
alternative label: Writings of bisexual people
comment: Written works created by bisexual people.
broader: LGBTQ+ people's writings
related: Bisexual authors
has top concept: Subcultures
issued: 2025-03-13
modified: 2025-03-13
type: Concept
in scheme: v4
change note: Version 4.1.0

Transgender people's writings
alternative label: Trans people's writings
alternative label: Writings of transgender people
alternative label: Writings of trans people
comment: Written works created by trans people.
broader: LGBTQ+ people's writings
related: Transgender authors
has top concept: Subcultures
issued: 2025-03-13
modified: 2025-03-13
type: Concept
in scheme: v4
change note: Version 4.1.0

Queer people's writings
alternative label: Writings of queer people
comment: Written works created by queer people.
broader: LGBTQ+ people's writings
related: Queer authors
has top concept: Subcultures
issued: 2025-03-13
modified: 2025-03-13
type: Concept
in scheme: v4
change note: Version 4.1.0

Intersex people's writings
alternative label: Writings of intersex people
comment: Written works created by intersex people.
broader: LGBTQ+ people's writings
related: Intersex authors
has top concept: Subcultures
issued: 2025-03-13
modified: 2025-03-13
type: Concept
in scheme: v4
change note: Version 4.1.0

Non-binary people's writings
alternative label: Nonbinary people's writings
alternative label: Writings of non-binary people
alternative label: Writings of nonbinary people
comment: Written works created by non-binary people.
broader: LGBTQ+ people's writings
related: Non-binary authors
has top concept: Subcultures
issued: 2025-03-13
modified: 2025-03-13
type: Concept
in scheme: v4
change note: Version 4.1.0

Asexual people's writings
alternative label: Writings of asexual people
comment: Written works created by asexual people.
broader: LGBTQ+ people's writings
related: Asexual authors
has top concept: Subcultures
issued: 2025-03-13
modified: 2025-03-13
type: Concept
in scheme: v4
change note: Version 4.1.0

Aromantic people's writings
alternative label: Writings of aromantic people
comment: Written works created by aromantic people.
broader: LGBTQ+ people's writings
related: Aromantic authors
has top concept: Subcultures
issued: 2025-03-13
modified: 2025-03-13
type: Concept
in scheme: v4
change note: Version 4.1.0

Two-Spirit people's writings
alternative label: Two Spirit people's writings
alternative label: Two-Spirited people's writings
alternative label: Two Spirited people's writings
alternative label: 2S people's writings
alternative label: Writings of Two-Spirit people
alternative label: Writings of Two Spirit people
alternative label: Writings of Two-Spirited people
alternative label: Writings of Two Spirited people
alternative label: Writings of 2S people
comment: Written works created by Two-Spirit people.
broader: Two-Spirit literature
related: Two-Spirit authors
related: LGBTQ+ people's writings
has top concept: Two-Spirit literature
issued: 2025-03-13
modified: 2025-03-13
type: Concept
in scheme: v4
change note: Version 4.1.0

Demisexual people's writings
alternative label: Writings of demisexual people
comment: Written works created by demisexual people.
broader: LGBTQ+ people's writings
related: Demisexual authors
has top concept: Subcultures
issued: 2025-03-13
modified: 2025-03-13
type: Concept
in scheme: v4
change note: Version 4.1.0

Greyromantic people's writings
alternative label: Writings of greyromantic people
comment: Written works created by greyromantic people.
broader: LGBTQ+ people's writings
related: Greyromantic authors
has top concept: Subcultures
issued: 2025-03-13
modified: 2025-03-13
type: Concept
in scheme: v4
change note: Version 4.1.0

Megasexual people's writings
alternative label: Writings of megasexual people
comment: Written works created by megasexual people.
broader: LGBTQ+ people's writings
related: Megasexual authors
has top concept: Subcultures
issued: 2025-03-13
modified: 2025-03-13
type: Concept
in scheme: v4
change note: Version 4.1.0

LGBTQ+ survivors of cyberbullying
alternative label: Survivors of cyberbullying (LGBTQ)
alternative label: LGBTQ+ cyberbullying survivors
alternative label: Cyberbullying survivors (LGBTQ)
comment: LGBTQ+ people who have experienced and survived cyberbullying, a form of bullying or harassment that takes place online. Follow the individual's preference for "victims" or "survivors" whenever possible.
broader: LGBTQ+ victims of cyberbullying
has top concept: LGBTQ+ people
issued: 2025-03-13
modified: 2025-04-01
type: Concept
in scheme: v4
change note: Version 4.1.0

LGBTQ+ cartoonists
alternative label: Cartoonists (LGBTQ)
alternative label: LGBTQ+ comics creators
alternative label: Comics creators (LGBTQ)
alternative label: LGBTQ+ cartoon artists
alternative label: Cartoon artists (LGBTQ)
comment: LGBTQ+ people who draw cartoons, comics, or graphic novels.
broader: LGBTQ+ artists
narrower: Lesbian cartoonists
narrower: Gay cartoonists
narrower: Bisexual cartoonists
narrower: Transgender cartoonists
narrower: Queer cartoonists
narrower: Non-binary cartoonists
narrower: Intersex cartoonists
narrower: Asexual cartoonists
narrower: Aromantic cartoonists
narrower: Demisexual cartoonists
narrower: Greyromantic cartoonists
narrower: Megasexual cartoonists
related: LGBTQ+ cartoons
related: LGBTQ+ comics
related: LGBTQ+ graphic novels
related: Two-Spirit cartoonists
has top concept: LGBTQ+ people
issued: 2025-03-13
modified: 2025-03-13
type: Concept
in scheme: v4
change note: Version 4.1.0

Lesbian cartoonists
alternative label: Lesbian comics creators
alternative label: Lesbian cartoon artists
comment: Lesbians who draw cartoons, comics, or graphic novels.
broader: LGBTQ+ cartoonists
has top concept: LGBTQ+ people
issued: 2025-03-13
modified: 2025-03-13
type: Concept
in scheme: v4
change note: Version 4.1.0

Gay cartoonists
alternative label: Gay comics creators
alternative label: Gay cartoon artists
comment: Gay men who draw cartoons, comics, or graphic novels.
broader: LGBTQ+ cartoonists
has top concept: LGBTQ+ people
issued: 2025-03-13
modified: 2025-03-13
type: Concept
in scheme: v4
change note: Version 4.1.0

Bisexual cartoonists
alternative label: Bisexual comics creators
alternative label: Bisexual cartoon artists
comment: Bisexual people who draw cartoons, comics, or graphic novels.
broader: LGBTQ+ cartoonists
has top concept: LGBTQ+ people
issued: 2025-03-13
modified: 2025-03-13
type: Concept
in scheme: v4
change note: Version 4.1.0

Transgender cartoonists
alternative label: Transgender comics creators
alternative label: Transgender cartoon artists
alternative label: Trans cartoonists
alternative label: Trans comics creators
alternative label: Trans cartoon artists
comment: Trans people who draw cartoons, comics, or graphic novels.
broader: LGBTQ+ cartoonists
has top concept: LGBTQ+ people
issued: 2025-03-13
modified: 2025-03-13
type: Concept
in scheme: v4
change note: Version 4.1.0

Queer cartoonists
alternative label: Queer comics creators
alternative label: Queer cartoon artists
comment: Queer people who draw cartoons, comics, or graphic novels.
broader: LGBTQ+ cartoonists
has top concept: LGBTQ+ people
issued: 2025-03-13
modified: 2025-03-13
type: Concept
in scheme: v4
change note: Version 4.1.0

Non-binary cartoonists
alternative label: Non-binary comics creators
alternative label: Non-binary cartoon artists
alternative label: Nonbinary cartoonists
comment: Non-binary people who draw cartoons, comics, or graphic novels.
broader: LGBTQ+ cartoonists
has top concept: LGBTQ+ people
issued: 2025-03-13
modified: 2025-03-13
type: Concept
in scheme: v4
change note: Version 4.1.0

Intersex cartoonists
alternative label: Intersex comics creators
alternative label: Intersex cartoon artists
comment: Intersex people who draw cartoons, comics, or graphic novels.
broader: LGBTQ+ cartoonists
has top concept: LGBTQ+ people
issued: 2025-03-13
modified: 2025-03-13
type: Concept
in scheme: v4
change note: Version 4.1.0

Asexual cartoonists
alternative label: Asexual comics creators
alternative label: Asexual cartoon artists
comment: Asexual people who draw cartoons, comics, or graphic novels.
broader: LGBTQ+ cartoonists
has top concept: LGBTQ+ people
issued: 2025-03-13
modified: 2025-03-13
type: Concept
in scheme: v4
change note: Version 4.1.0

Aromantic cartoonists
alternative label: Aromantic comics creators
alternative label: Aromantic cartoon artists
comment: Aromantic people who draw cartoons, comics, or graphic novels.
broader: LGBTQ+ cartoonists
has top concept: LGBTQ+ people
issued: 2025-03-13
modified: 2025-03-13
type: Concept
in scheme: v4
change note: Version 4.1.0

Demisexual cartoonists
alternative label: Demisexual comics creators
alternative label: Demisexual cartoon artists
comment: Demisexual people who draw cartoons, comics, or graphic novels.
broader: LGBTQ+ cartoonists
has top concept: LGBTQ+ people
issued: 2025-03-13
modified: 2025-03-13
type: Concept
in scheme: v4
change note: Version 4.1.0

Greyromantic cartoonists
alternative label: Greyromantic comics creators
alternative label: Greyromantic cartoon artists
comment: Greyromantic people who draw cartoons, comics, or graphic novels.
broader: LGBTQ+ cartoonists
has top concept: LGBTQ+ people
issued: 2025-03-13
modified: 2025-03-13
type: Concept
in scheme: v4
change note: Version 4.1.0

Megasexual cartoonists
alternative label: Megasexual comics creators
alternative label: Megasexual cartoon artists
comment: Megasexual people who draw cartoons, comics, or graphic novels.
broader: LGBTQ+ cartoonists
has top concept: LGBTQ+ people
issued: 2025-03-13
modified: 2025-03-13
type: Concept
in scheme: v4
change note: Version 4.1.0

Two-Spirit cartoonists
alternative label: Two-Spirit comics creators
alternative label: Two-Spirit cartoon artists
alternative label: Two-Spirited cartoonists
alternative label: Two Spirit cartoonists
alternative label: Two Spirited cartoonists
alternative label: 2S cartoonists
comment: Two-Spirit people who draw cartoons, comics, or graphic novels.
broader: Two-Spirit artists
related: LGBTQ+ cartoonists
has top concept: Gender
issued: 2025-03-13
modified: 2025-03-13
type: Concept
in scheme: v4
change note: Version 4.1.0

LGBTQ+ celebrities
alternative label: Celebrities (LGBTQ)
alternative label: LGBTQ+ celebs
alternative label: Celebs (LGBTQ)
alternative label: LGBTQ+ famous people
alternative label: Famous LGBTQ+ people
alternative label: Famous people (LGBTQ)
comment: LGBTQ+ people who have achieved fame and broad public recognition due to the attention given to them by mass media.
broader: LGBTQ+ people
narrower: LGBTQ+ television personalities
narrower: Lesbian celebrities
narrower: Gay celebrities
narrower: Bisexual celebrities
narrower: Transgender celebrities
narrower: Queer celebrities
narrower: Non-binary celebrities
narrower: Intersex celebrities
narrower: Asexual celebrities
narrower: Aromantic celebrities
narrower: Demisexual celebrities
narrower: Greyromantic celebrities
narrower: Megasexual celebrities
related: Two-Spirit celebrities
related: LGBTQ+ people in mass media
has top concept: LGBTQ+ people
issued: 2025-03-20
modified: 2025-04-23
type: Concept
in scheme: v4
change note: Version 4.1.0

Lesbian celebrities
alternative label: Lesbian celebs
alternative label: Famous lesbians
alternative label: Lesbian famous people
comment: Lesbians who have achieved fame and broad public recognition due to the attention given to them by mass media.
broader: LGBTQ+ celebrities
related: Lesbians in mass media
has top concept: LGBTQ+ people
issued: 2025-03-20
modified: 2025-04-23
type: Concept
in scheme: v4
change note: Version 4.1.0

Gay celebrities
alternative label: Gay celebs
alternative label: Famous gay men
alternative label: Gay famous men
comment: Gay men who have achieved fame and broad public recognition due to the attention given to them by mass media.
broader: LGBTQ+ celebrities
related: Gay men in mass media
has top concept: LGBTQ+ people
issued: 2025-03-20
modified: 2025-04-23
type: Concept
in scheme: v4
change note: Version 4.1.0

Bisexual celebrities
alternative label: Bisexual celebs
alternative label: Famous bisexual people
alternative label: Bisexual famous people
comment: Bisexual people who have achieved fame and broad public recognition due to the attention given to them by mass media.
broader: LGBTQ+ celebrities
related: Bisexual people in mass media
has top concept: LGBTQ+ people
issued: 2025-03-20
modified: 2025-04-23
type: Concept
in scheme: v4
change note: Version 4.1.0

Transgender celebrities
alternative label: Transgender celebs
alternative label: Famous transgender people
alternative label: Transgender famous people
alternative label: Trans celebrities
alternative label: Trans celebs
alternative label: Famous trans people
alternative label: Trans famous people
comment: Trans people who have achieved fame and broad public recognition due to the attention given to them by mass media.
broader: LGBTQ+ celebrities
related: Transgender people in mass media
has top concept: LGBTQ+ people
issued: 2025-03-20
modified: 2025-04-23
type: Concept
in scheme: v4
change note: Version 4.1.0

Queer celebrities
alternative label: Queer celebs
alternative label: Famous queer people
alternative label: Queer famous people
comment: Queer people who have achieved fame and broad public recognition due to the attention given to them by mass media.
broader: LGBTQ+ celebrities
related: Queer people in mass media
has top concept: LGBTQ+ people
issued: 2025-03-20
modified: 2025-04-23
type: Concept
in scheme: v4
change note: Version 4.1.0

Non-binary celebrities
alternative label: Non-binary celebs
alternative label: Famous non-binary people
alternative label: Non-binary famous people
alternative label: Nonbinary celebrities
alternative label: Nonbinary celebs
alternative label: Famous nonbinary people
alternative label: Nonbinary famous people
comment: Non-binary people who have achieved fame and broad public recognition due to the attention given to them by mass media.
broader: LGBTQ+ celebrities
related: Non-binary people in mass media
has top concept: LGBTQ+ people
issued: 2025-03-20
modified: 2025-04-23
type: Concept
in scheme: v4
change note: Version 4.1.0

Intersex celebrities
alternative label: Intersex celebs
alternative label: Famous intersex people
alternative label: Intersex famous people
comment: Intersex people who have achieved fame and broad public recognition due to the attention given to them by mass media.
broader: LGBTQ+ celebrities
related: Intersex people in mass media
has top concept: LGBTQ+ people
issued: 2025-03-20
modified: 2025-04-23
type: Concept
in scheme: v4
change note: Version 4.1.0

Two-Spirit celebrities
alternative label: Two Spirit celebrities
alternative label: Two-Spirited celebrities
alternative label: Two Spirited celebrities
alternative label: 2S celebrities
alternative label: Two-Spirit celebs
alternative label: Famous Two-Spirit people
alternative label: Two-Spirit famous people
comment: Two-Spirit people who have achieved fame and broad public recognition due to the attention given to them by mass media.
broader: Two-Spirit people
narrower: Two-Spirit television personalities
related: LGBTQ+ celebrities
related: Two-Spirit people in mass media
has top concept: Gender
issued: 2025-03-20
modified: 2025-04-23
type: Concept
in scheme: v4
change note: Version 4.1.0

Asexual celebrities
alternative label: Asexual celebs
alternative label: Famous asexual people
alternative label: Asexual famous people
comment: Asexual people who have achieved fame and broad public recognition due to the attention given to them by mass media.
broader: LGBTQ+ celebrities
has top concept: LGBTQ+ people
issued: 2025-03-20
modified: 2025-03-20
type: Concept
in scheme: v4
change note: Version 4.1.0

Aromantic celebrities
alternative label: Aromantic celebs
alternative label: Famous aromantic people
alternative label: Aromantic famous people
comment: Aromantic people who have achieved fame and broad public recognition due to the attention given to them by mass media.
broader: LGBTQ+ celebrities
has top concept: LGBTQ+ people
issued: 2025-03-20
modified: 2025-03-20
type: Concept
in scheme: v4
change note: Version 4.1.0

Demisexual celebrities
alternative label: Demisexual celebs
alternative label: Famous demisexual people
alternative label: Demisexual famous people
comment: Demisexual people who have achieved fame and broad public recognition due to the attention given to them by mass media.
broader: LGBTQ+ celebrities
has top concept: LGBTQ+ people
issued: 2025-03-20
modified: 2025-03-20
type: Concept
in scheme: v4
change note: Version 4.1.0

Greyromantic celebrities
alternative label: Greyromantic celebs
alternative label: Famous greyromantic people
alternative label: Greyromantic famous people
comment: Greyromantic people who have achieved fame and broad public recognition due to the attention given to them by mass media.
broader: LGBTQ+ celebrities
has top concept: LGBTQ+ people
issued: 2025-03-20
modified: 2025-03-20
type: Concept
in scheme: v4
change note: Version 4.1.0

Megasexual celebrities
alternative label: Megasexual celebs
alternative label: Famous megasexual people
alternative label: Megasexual famous people
comment: Megasexual people who have achieved fame and broad public recognition due to the attention given to them by mass media.
broader: LGBTQ+ celebrities
has top concept: LGBTQ+ people
issued: 2025-03-20
modified: 2025-03-20
type: Concept
in scheme: v4
change note: Version 4.1.0

PEP (HIV)
alternative label: Post-exposure prophylaxis (HIV)
alternative label: HIV PEP
alternative label: HIV post-exposure prophylaxis
comment: Medication taken after a possible exposure to HIV to prevent infection.
broader: Medication
related: HIV/AIDS
has top concept: Medical care
issued: 2025-03-20
modified: 2025-03-20
type: Concept
in scheme: v4
change note: Version 4.1.0

Transmedicalism
alternative label: Transmedicalization
comment: The belief that being transgender is primarily a medical issue and that gender dysphoria and the desire to medically transition are both necessary to be considered "truly" transgender.
broader: Medicalization
related: Gender dysphoria
related: Transmedicalists
has top concept: Medical care
issued: 2025-03-20
modified: 2025-04-23
type: Concept
in scheme: v4
change note: Version 4.1.0

LGBTQ+ survival guides
alternative label: Survival guides (LGBTQ)
comment: Written publications designed to support LGBTQ+ people by sharing common advice and community knowledge.
broader: LGBTQ+ literature
narrower: Lesbian survival guides
narrower: Gay survival guides
narrower: Bisexual survival guides
narrower: Transgender survival guides
narrower: Queer survival guides
narrower: Non-binary survival guides
narrower: Intersex survival guides
related: LGBTQ+ travel guides
related: LGBTQ+ communities
related: Two-Spirit survival guides
has top concept: Subcultures
issued: 2025-03-20
modified: 2025-03-20
type: Concept
in scheme: v4
change note: Version 4.1.0

Lesbian survival guides
comment: Written publications designed to support lesbians by sharing common advice and community knowledge.
broader: LGBTQ+ survival guides
has top concept: Subcultures
issued: 2025-03-20
modified: 2025-03-20
type: Concept
in scheme: v4
change note: Version 4.1.0

Gay survival guides
comment: Written publications designed to support gay men by sharing common advice and community knowledge.
broader: LGBTQ+ survival guides
has top concept: Subcultures
issued: 2025-03-20
modified: 2025-03-20
type: Concept
in scheme: v4
change note: Version 4.1.0

Bisexual survival guides
comment: Written publications designed to support bisexual people by sharing common advice and community knowledge.
broader: LGBTQ+ survival guides
has top concept: Subcultures
issued: 2025-03-20
modified: 2025-03-20
type: Concept
in scheme: v4
change note: Version 4.1.0

Transgender survival guides
alternative label: Trans survival guides
comment: Written publications designed to support trans people by sharing common advice and community knowledge.
broader: LGBTQ+ survival guides
has top concept: Subcultures
issued: 2025-03-20
modified: 2025-03-20
type: Concept
in scheme: v4
change note: Version 4.1.0

Queer survival guides
comment: Written publications designed to support queer people by sharing common advice and community knowledge.
broader: LGBTQ+ survival guides
has top concept: Subcultures
issued: 2025-03-20
modified: 2025-03-20
type: Concept
in scheme: v4
change note: Version 4.1.0

Non-binary survival guides
alternative label: Nonbinary survival guides
comment: Written publications designed to support non-binary people by sharing common advice and community knowledge.
broader: LGBTQ+ survival guides
has top concept: Subcultures
issued: 2025-03-20
modified: 2025-03-20
type: Concept
in scheme: v4
change note: Version 4.1.0

Intersex survival guides
comment: Written publications designed to support intersex people by sharing common advice and community knowledge.
broader: LGBTQ+ survival guides
has top concept: Subcultures
issued: 2025-03-20
modified: 2025-03-20
type: Concept
in scheme: v4
change note: Version 4.1.0

Two-Spirit survival guides
alternative label: Two Spirit survival guides
alternative label: Two-Spirited survival guides
alternative label: Two Spirited survival guides
alternative label: 2S survival guides
comment: Written publications designed to support Two-Spirit people by sharing common advice and community knowledge.
broader: Two-Spirit literature
related: LGBTQ+ survival guides
has top concept: Two-Spirit literature
issued: 2025-03-20
modified: 2025-03-20
type: Concept
in scheme: v4
change note: Version 4.1.0

Polyamorous families
alternative label: Poly families
comment: Families, whether biological, adoptive, or chosen, in which one or more individuals identify as polyamorous.
related: LGBTQ+ families
related: Polyamorous people
related: Polycules
issued: 2025-03-20
modified: 2025-03-20
type: Concept
in scheme: v4
change note: Version 4.1.0

Gay journalists
comment: Gay men who who gather information in the form of text, audio, or pictures, process it into a newsworthy form, and disseminate it to the public.
broader: LGBTQ+ journalists
has top concept: LGBTQ+ people
issued: 2025-03-26
modified: 2025-04-29
type: Concept
in scheme: v4
change note: Version 4.1.0

Lesbian journalists
comment: Lesbians who gather information in the form of text, audio, or pictures, process it into a newsworthy form, and disseminate it to the public.
broader: LGBTQ+ journalists
has top concept: LGBTQ+ people
issued: 2025-03-26
modified: 2025-04-29
type: Concept
in scheme: v4
change note: Version 4.1.0

Asexual journalists
alternative label: Ace journalists
comment: Asexual people who gather information in the form of text, audio, or pictures, process it into a newsworthy form, and disseminate it to the public.
broader: LGBTQ+ journalists
has top concept: LGBTQ+ people
issued: 2025-03-26
modified: 2025-04-29
type: Concept
in scheme: v4
change note: Version 4.1.0

Bisexual journalists
alternative label: Bi journalists
comment: Bisexual people who gather information in the form of text, audio, or pictures, process it into a newsworthy form, and disseminate it to the public.
broader: LGBTQ+ journalists
has top concept: LGBTQ+ people
issued: 2025-03-26
modified: 2025-04-29
type: Concept
in scheme: v4
change note: Version 4.1.0

Intersex journalists
comment: Intersex people who gather information in the form of text, audio, or pictures, process it into a newsworthy form, and disseminate it to the public.
broader: LGBTQ+ journalists
has top concept: LGBTQ+ people
issued: 2025-03-26
modified: 2025-04-29
type: Concept
in scheme: v4
change note: Version 4.1.0

Two-Spirit journalists
alternative label: Two Spirit journalists
alternative label: Two-Spirited journalists
alternative label: Two Spirited journalists
alternative label: 2S journalists
comment: Two-Spirit people who gather information in the form of text, audio, or pictures, process it into a newsworthy form, and disseminate it to the public.
broader: Two-Spirit people
related: LGBTQ+ journalists
has top concept: Gender
issued: 2025-03-26
modified: 2025-04-29
type: Concept
in scheme: v4
change note: Version 4.1.0

Queer journalists
comment: Queer people who gather information in the form of text, audio, or pictures, process it into a newsworthy form, and disseminate it to the public.
broader: LGBTQ+ journalists
has top concept: LGBTQ+ people
issued: 2025-03-26
modified: 2025-04-29
type: Concept
in scheme: v4
change note: Version 4.1.0

Transgender journalists
comment: Transgender people who gather information in the form of text, audio, or pictures, process it into a newsworthy form, and disseminate it to the public.
broader: LGBTQ+ journalists
has top concept: LGBTQ+ people
issued: 2025-03-26
modified: 2025-04-29
type: Concept
in scheme: v4
change note: Version 4.1.0

Non-binary journalists
alternative label: Nonbinary journalists
comment: Non-binary people who gather information in the form of text, audio, or pictures, process it into a newsworthy form, and disseminate it to the public.
broader: LGBTQ+ journalists
has top concept: LGBTQ+ people
issued: 2025-03-26
modified: 2025-04-29
type: Concept
in scheme: v4
change note: Version 4.1.0

Lesbians with breast cancer
alternative label: Lesbian breast cancer patients
comment: Lesbians who have been diagnosed with breast cancer, whether or not they are currently undergoing treatment. This term can also be used to refer to the particular challenges lesbians and/or their partners face in obtaining cancer treatment due to discrimination.
broader: Lesbians
related: Health care for LGBTQ+ people
has top concept: LGBTQ+ people
issued: 2025-03-26
modified: 2025-04-29
type: Concept
in scheme: v4
change note: Version 4.1.0

LGBTQ+ journalism
alternative label: Journalism (LGBTQ)
comment: The collection and editing of news for presentation through mass media, including interviewing subjects, writing and publishing articles, recording and broadcasting news, etc. Use to refer to journalism created by or focusing on LGBTQ+ communities.
broader: LGBTQ+ press
related: LGBTQ+ journalists
has top concept: LGBTQ+ press
issued: 2025-03-26
modified: 2025-04-29
type: Concept
in scheme: v4
change note: Version 4.1.0

Lesbian demonstrations
alternative label: Lesbian marches
alternative label: Lesbian rallies
alternative label: Lesbian protests
comment: Marches, rallies, and other large, public gatherings organized to protest discrimination against lesbians and advocate for lesbian visibility, rights, and issues.
broader: LGBTQ+ demonstrations
narrower: Dyke demonstrations
related: Lesbian movement
has top concept: LGBTQ+ activism
issued: 2025-04-17
modified: 2025-04-23
type: Concept
in scheme: v4
change note: Version 4.1.0

Gay demonstrations
alternative label: Gay marches
alternative label: Gay rallies
alternative label: Gay protests
comment: Marches, rallies, and other large, public gatherings organized to protest discrimination against gay men and advocate for gay visibility, rights, and issues.
broader: LGBTQ+ demonstrations
related: Gay movement
has top concept: LGBTQ+ activism
issued: 2025-04-17
modified: 2025-04-17
type: Concept
in scheme: v4
change note: Version 4.1.0

Bisexual demonstrations
alternative label: Bisexual marches
alternative label: Bisexual rallies
alternative label: Bisexual protests
comment: Marches, rallies, and other large, public gatherings organized to protest discrimination against bisexual people and advocate for bisexual visibility, rights, and issues.
broader: LGBTQ+ demonstrations
related: Bisexual movement
has top concept: LGBTQ+ activism
issued: 2025-04-17
modified: 2025-04-17
type: Concept
in scheme: v4
change note: Version 4.1.0

Queer demonstrations
alternative label: Queer marches
alternative label: Queer rallies
alternative label: Queer protests
comment: Marches, rallies, and other large, public gatherings organized to protest discrimination against queer people and advocate for queer visibility, rights, and issues.
broader: LGBTQ+ demonstrations
related: Queer movement
has top concept: LGBTQ+ activism
issued: 2025-04-23
modified: 2025-04-23
type: Concept
in scheme: v4
change note: Version 4.1.0

Intersex demonstrations
alternative label: Intersex marches
alternative label: Intersex rallies
alternative label: Intersex protests
comment: Marches, rallies, and other large, public gatherings organized to protest discrimination against intersex people and advocate for intersex visibility, rights, and issues.
broader: LGBTQ+ demonstrations
related: Intersex movement
has top concept: LGBTQ+ activism
issued: 2025-04-23
modified: 2025-04-23
type: Concept
in scheme: v4
change note: Version 4.1.0

Two-Spirit demonstrations
alternative label: Two-Spirit marches
alternative label: Two-Spirit rallies
alternative label: Two-Spirit protests
alternative label: Two-Spirited demonstrations
alternative label: Two Spirit demonstrations
alternative label: Two Spirited demonstrations
alternative label: 2S demonstrations
comment: Marches, rallies, and other large, public gatherings organized to protest discrimination against Two-Spirit people and advocate for Two-Spirit visibility, rights, and issues.
broader: Two-Spirit activism
related: Two-Spirit movement
related: LGBTQ+ demonstrations
has top concept: Two-Spirit activism
issued: 2025-04-23
modified: 2025-04-23
type: Concept
in scheme: v4
change note: Version 4.1.0

Bisexual pride
alternative label: Bi pride
comment: The recognition and celebration of bisexual people and culture, thereby affirming the visibility, dignity, and diversity of bisexual communities.
broader: LGBTQ+ pride
has top concept: LGBTQ+ pride
issued: 2025-04-23
modified: 2025-04-23
type: Concept
in scheme: v4
change note: Version 4.1.0

Queer pride
comment: The recognition and celebration of queer people and culture, thereby affirming the visibility, dignity, and diversity of queer communities.
broader: LGBTQ+ pride
has top concept: LGBTQ+ pride
issued: 2025-04-23
modified: 2025-04-23
type: Concept
in scheme: v4
change note: Version 4.1.0

Intersex pride
comment: The recognition and celebration of intersex people and culture, thereby affirming the visibility, dignity, and diversity of intersex communities.
broader: LGBTQ+ pride
has top concept: LGBTQ+ pride
issued: 2025-04-23
modified: 2025-04-23
type: Concept
in scheme: v4
change note: Version 4.1.0

Non-binary pride
alternative label: Nonbinary pride
comment: The recognition and celebration of non-binary people and culture, thereby affirming the visibility, dignity, and diversity of non-binary communities.
broader: LGBTQ+ pride
has top concept: LGBTQ+ pride
issued: 2025-04-23
modified: 2025-04-23
type: Concept
in scheme: v4
change note: Version 4.1.0

Asexual pride
alternative label: Ace pride
comment: The recognition and celebration of asexual people and culture, thereby affirming the visibility, dignity, and diversity of asexual communities.
broader: LGBTQ+ pride
has top concept: LGBTQ+ pride
issued: 2025-04-23
modified: 2025-04-23
type: Concept
in scheme: v4
change note: Version 4.1.0

Two-Spirit pride
alternative label: Two Spirit pride
alternative label: Two-Spirited pride
alternative label: Two Spirited pride
alternative label: 2S pride
comment: The recognition and celebration of Two-Spirit people and culture, thereby affirming the visibility, dignity, and diversity of Two-Spirit communities.
related: LGBTQ+ pride
issued: 2025-04-23
modified: 2025-04-23
type: Concept
in scheme: v4
change note: Version 4.1.0

LGBTQ+ dancers
alternative label: Dancers (LGBTQ)
comment: LGBTQ+ people who dance, either professionally or as a hobby.
broader: LGBTQ+ people
narrower: Lesbian dancers
narrower: Gay dancers
narrower: Bisexual dancers
narrower: Transgender dancers
narrower: Queer dancers
narrower: Non-binary dancers
narrower: Intersex dancers
related: Two-Spirit dancers
has top concept: LGBTQ+ people
issued: 2025-04-23
modified: 2025-07-21
type: Concept
in scheme: v4
change note: Version 4.1.0

Lesbian dancers
comment: Lesbians who dance, either professionally or as a hobby.
broader: LGBTQ+ dancers
has top concept: LGBTQ+ people
issued: 2025-04-23
modified: 2025-04-23
type: Concept
in scheme: v4
change note: Version 4.1.0

Gay dancers
alternative label: Gay male dancers
comment: Gay men who dance, either professionally or as a hobby.
broader: LGBTQ+ dancers
has top concept: LGBTQ+ people
issued: 2025-04-23
modified: 2025-04-23
type: Concept
in scheme: v4
change note: Version 4.1.0

Bisexual dancers
alternative label: Bi dancers
comment: Bisexual people who dance, either professionally or as a hobby.
broader: LGBTQ+ dancers
has top concept: LGBTQ+ people
issued: 2025-04-23
modified: 2025-04-23
type: Concept
in scheme: v4
change note: Version 4.1.0

Transgender dancers
alternative label: Trans dancers
comment: Transgender people who dance, either professionally or as a hobby.
broader: LGBTQ+ dancers
has top concept: LGBTQ+ people
issued: 2025-04-23
modified: 2025-04-23
type: Concept
in scheme: v4
change note: Version 4.1.0

Queer dancers
comment: Queer people who dance, either professionally or as a hobby.
broader: LGBTQ+ dancers
has top concept: LGBTQ+ people
issued: 2025-04-23
modified: 2025-04-23
type: Concept
in scheme: v4
change note: Version 4.1.0

Non-binary dancers
alternative label: Nonbinary dancers
comment: Non-binary people who dance, either professionally or as a hobby.
broader: LGBTQ+ dancers
has top concept: LGBTQ+ people
issued: 2025-04-23
modified: 2025-04-23
type: Concept
in scheme: v4
change note: Version 4.1.0

Intersex dancers
comment: Intersex people who dance, either professionally or as a hobby.
broader: LGBTQ+ dancers
has top concept: LGBTQ+ people
issued: 2025-04-23
modified: 2025-04-23
type: Concept
in scheme: v4
change note: Version 4.1.0

Two-Spirit dancers
alternative label: Two Spirit dancers
alternative label: Two-Spirited dancers
alternative label: Two Spirited dancers
alternative label: 2S dancers
comment: Two-Spirit people who dance, either professionally or as a hobby.
broader: Two-Spirit people
related: LGBTQ+ dancers
has top concept: Gender
issued: 2025-04-23
modified: 2025-04-23
type: Concept
in scheme: v4
change note: Version 4.1.0

LGBTQ+ makeup artists
alternative label: Makeup artists (LGBTQ)
alternative label: LGBTQ+ MUAs
alternative label: MUAs (LGBTQ)
comment: LGBTQ+ people who apply makeup and/or prosthetics on themselves or others, either professionally or as a hobby.
broader: LGBTQ+ artists
narrower: Lesbian makeup artists
narrower: Gay makeup artists
narrower: Bisexual makeup artists
narrower: Transgender makeup artists
narrower: Queer makeup artists
narrower: Non-binary makeup artists
narrower: Intersex makeup artists
related: LGBTQ+ fashion
related: Two-Spirit makeup artists
related: Makeup and LGBTQ+ communities
has top concept: LGBTQ+ people
issued: 2025-04-23
modified: 2025-04-23
type: Concept
in scheme: v4
change note: Version 4.1.0

Lesbian makeup artists
comment: Lesbians who apply makeup and/or prosthetics on themselves or others, either professionally or as a hobby.
broader: LGBTQ+ makeup artists
has top concept: LGBTQ+ people
issued: 2025-04-23
modified: 2025-04-23
type: Concept
in scheme: v4
change note: Version 4.1.0

Gay makeup artists
alternative label: Gay male makeup artists
comment: Gay men who apply makeup and/or prosthetics on themselves or others, either professionally or as a hobby.
broader: LGBTQ+ makeup artists
has top concept: LGBTQ+ people
issued: 2025-04-23
modified: 2025-04-23
type: Concept
in scheme: v4
change note: Version 4.1.0

Bisexual makeup artists
alternative label: Bi makeup artists
comment: Bisexual people who apply makeup and/or prosthetics on themselves or others, either professionally or as a hobby.
broader: LGBTQ+ makeup artists
has top concept: LGBTQ+ people
issued: 2025-04-23
modified: 2025-04-23
type: Concept
in scheme: v4
change note: Version 4.1.0

Transgender makeup artists
alternative label: Trans makeup artists
comment: Trans people who apply makeup and/or prosthetics on themselves or others, either professionally or as a hobby.
broader: LGBTQ+ makeup artists
has top concept: LGBTQ+ people
issued: 2025-04-23
modified: 2025-04-23
type: Concept
in scheme: v4
change note: Version 4.1.0

Queer makeup artists
comment: Queer people who apply makeup and/or prosthetics on themselves or others, either professionally or as a hobby.
broader: LGBTQ+ makeup artists
has top concept: LGBTQ+ people
issued: 2025-04-23
modified: 2025-04-23
type: Concept
in scheme: v4
change note: Version 4.1.0

Non-binary makeup artists
alternative label: Nonbinary makeup artists
comment: Non-binary people who apply makeup and/or prosthetics on themselves or others, either professionally or as a hobby.
broader: LGBTQ+ makeup artists
has top concept: LGBTQ+ people
issued: 2025-04-23
modified: 2025-04-23
type: Concept
in scheme: v4
change note: Version 4.1.0

Intersex makeup artists
comment: Intersex people who apply makeup and/or prosthetics on themselves or others, either professionally or as a hobby.
broader: LGBTQ+ makeup artists
has top concept: LGBTQ+ people
issued: 2025-04-23
modified: 2025-04-23
type: Concept
in scheme: v4
change note: Version 4.1.0

Two-Spirit makeup artists
alternative label: Two Spirit makeup artists
alternative label: Two-Spirited makeup artists
alternative label: Two Spirited makeup artists
alternative label: 2S makeup artists
comment: Two-Spirit people who apply makeup and/or prosthetics on themselves or others, either professionally or as a hobby.
broader: Two-Spirit artists
related: LGBTQ+ makeup artists
has top concept: Gender
issued: 2025-04-23
modified: 2025-04-23
type: Concept
in scheme: v4
change note: Version 4.1.0

Makeup and LGBTQ+ communities
alternative label: Cosmetics and LGBTQ+ communities
alternative label: LGBTQ+ makeup
alternative label: LGBTQ+ cosmetics
alternative label: Makeup (LGBTQ)
alternative label: Cosmetics (LGBTQ)
comment: The relationship between LGBTQ+ communities and makeup artistry, brands, and industry. Includes discussions of makeup techniques that emerged in LGBTQ+ subcultures, the role of makeup in gender and sexual expression, and the inclusion and representation of LGBTQ+ people in the cosmetics industry.
related: LGBTQ+ makeup artists
related: LGBTQ+ fashion
issued: 2025-04-23
modified: 2025-04-23
type: Concept
in scheme: v4
change note: Version 4.1.0

LGBTQ+ fashion designers
alternative label: Fashion designers (LGBTQ)
alternative label: LGBTQ+ clothes designers
alternative label: LGBTQ+ clothing designers
comment: LGBTQ+ people who design and create original clothing, accessories, and footwear.
broader: LGBTQ+ people
narrower: Lesbian fashion designers
narrower: Gay fashion designers
narrower: Bisexual fashion designers
narrower: Transgender fashion designers
narrower: Queer fashion designers
narrower: Non-binary fashion designers
narrower: Intersex fashion designers
narrower: Two-Spirit fashion designers
related: LGBTQ+ fashion
has top concept: LGBTQ+ people
issued: 2025-04-23
modified: 2025-04-23
type: Concept
in scheme: v4
change note: Version 4.1.0

Lesbian fashion designers
alternative label: Lesbian clothes designers
alternative label: Lesbian clothing designers
comment: Lesbians who design and create original clothing, accessories, and footwear.
broader: LGBTQ+ fashion designers
has top concept: LGBTQ+ people
issued: 2025-04-23
modified: 2025-04-23
type: Concept
in scheme: v4
change note: Version 4.1.0

Gay fashion designers
alternative label: Gay male fashion designers
alternative label: Gay clothes designers
alternative label: Gay clothing designers
comment: Gay men who design and create original clothing, accessories, and footwear.
broader: LGBTQ+ fashion designers
has top concept: LGBTQ+ people
issued: 2025-04-23
modified: 2025-04-23
type: Concept
in scheme: v4
change note: Version 4.1.0

Bisexual fashion designers
alternative label: Bi fashion designers
alternative label: Bisexual clothes designers
alternative label: Bisexual clothing designers
comment: Bisexual people who design and create original clothing, accessories, and footwear.
broader: LGBTQ+ fashion designers
has top concept: LGBTQ+ people
issued: 2025-04-23
modified: 2025-04-23
type: Concept
in scheme: v4
change note: Version 4.1.0

Transgender fashion designers
alternative label: Trans fashion designers
alternative label: Transgender clothes designers
alternative label: Transgender clothing designers
comment: Trans people who design and create original clothing, accessories, and footwear.
broader: LGBTQ+ fashion designers
has top concept: LGBTQ+ people
issued: 2025-04-23
modified: 2025-04-23
type: Concept
in scheme: v4
change note: Version 4.1.0

Queer fashion designers
alternative label: Queer clothes designers
alternative label: Queer clothing designers
comment: Queer people who design and create original clothing, accessories, and footwear.
broader: LGBTQ+ fashion designers
has top concept: LGBTQ+ people
issued: 2025-04-23
modified: 2025-04-23
type: Concept
in scheme: v4
change note: Version 4.1.0

Non-binary fashion designers
alternative label: Nonbinary fashion designers
alternative label: Non-binary clothes designers
alternative label: Non-binary clothing designers
comment: Non-binary people who design and create original clothing, accessories, and footwear.
broader: LGBTQ+ fashion designers
has top concept: LGBTQ+ people
issued: 2025-04-23
modified: 2025-04-23
type: Concept
in scheme: v4
change note: Version 4.1.0

Intersex fashion designers
alternative label: Intersex clothes designers
alternative label: Intersex clothing designers
comment: Intersex people who design and create original clothing, accessories, and footwear.
broader: LGBTQ+ fashion designers
has top concept: LGBTQ+ people
issued: 2025-04-23
modified: 2025-04-23
type: Concept
in scheme: v4
change note: Version 4.1.0

Two-Spirit fashion designers
alternative label: Two Spirit fashion designers
alternative label: Two-Spirited fashion designers
alternative label: Two Spirited fashion designers
alternative label: 2S fashion designers
alternative label: Two-Spirit clothes designers
alternative label: Two-Spirit clothing designers
comment: Two-Spirit people who design and create original clothing, accessories, and footwear.
broader: LGBTQ+ fashion designers
has top concept: LGBTQ+ people
issued: 2025-04-23
modified: 2025-04-23
type: Concept
in scheme: v4
change note: Version 4.1.0

Warmipangui
comment: Amongst the Canelos-Quichua, one of the indigenous Kichwa peoples of the Ecuadorian Amazon, this term is used to refer to people who were assigned male at birth but have the ability to transition between feminine and masculine.
broader: Non-Euro-American gender and sexual identities
related: South American Indigenous LGBTQ+ people
has top concept: Gender
issued: 2025-04-23
modified: 2025-04-23
type: Concept
in scheme: v4
change note: Version 4.1.0

Transmedicalists
alternative label: Truscum
comment: Individuals who believe that being transgender is primarily a medical issue and that gender dysphoria and the desire to medically transition are both necessary to be considered "truly" transgender.
related: Transmedicalism
related: Gender dysphoria
issued: 2025-04-23
modified: 2025-04-23
type: Concept
in scheme: v4
change note: Version 4.1.0

Chrononormativity
alternative label: Normative time
comment: Term used to describe the ways in which human lives and experiences are expected to follow specific, linear patterns over time in conformity with normative frameworks. This includes expectations regarding how long and what hours people work, with the aim of achieving maximum productivity, as well as expectations for people to reach life milestones, such as graduating high school, getting married, and having children, at specific ages and in a particular order.
broader: Social norms
narrower: White time
related: Crip time
related: Queer time
has top concept: Social norms
issued: 2025-04-23
modified: 2025-04-23
type: Concept
in scheme: v4
change note: Version 4.1.0

Crip time
alternative label: Crip temporality
comment: Term used to describe the ways in which disabled and chronically ill people experience and relate to time differently than is socially expected. According to Alison Kafer, quoted in a paper published by Ellen Samuels, "rather than bend disabled bodies and minds to meet the clock, crip time bends the clock to meet disabled bodies and minds."
broader: Crip
related: Chrononormativity
has top concept: LGBTQ+ slang
issued: 2025-04-23
modified: 2025-04-23
type: Concept
in scheme: v4
change note: Version 4.1.0

Queer time
alternative label: Queer temporality
comment: Term used to describe the ways in which queer people experience and relate to time differently than is socially expected. This may include delayed or non-linear development before coming out, disrupted life trajectories, and a sense of impending mortality, particularly during the AIDS epidemic.
broader: Queer theory
related: Chrononormativity
has top concept: Theories
issued: 2025-04-23
modified: 2025-04-23
type: Concept
in scheme: v4
change note: Version 4.1.0

White time
alternative label: White temporality
alternative label: White temporal imaginary
alternative label: Racialization of time
alternative label: Racial time
comment: Term used to describe the racialization of time in a white supremacist society, which results in unequal temporal access to institutions, resources, power, etc. This term also references the ways in which non-white people are expected to conform to specific, linear patterns over time, as well as the calculation of time and history through white, Western expectations for progress and productivity.
broader: Chrononormativity
related: Critical race theory
has top concept: Social norms
issued: 2025-04-23
modified: 2025-04-23
type: Concept
in scheme: v4
change note: Version 4.1.0

Compulsory heterosexuality
alternative label: Comphet
comment: Term coined by Adrienne Rich in 1980 to describe the idea that heterosexuality is assumed of and enforced upon people in patriarchal societies to ensure the continued subjugation of women. Thus, heterosexuality and, particularly, women's sexual interest in men, is not always natural but instead is ingrained as a social requirement from an early age.
broader: Social norms
broader: Theories
related: Heterosexism
related: Heteronormativity
has top concept: Social norms
issued: 2025-04-23
modified: 2025-04-23
type: Concept
in scheme: v4
change note: Version 4.1.0

LGBTQ+ psychology
alternative label: Psychology (LGBTQ)
comment: A subfield of psychology that focuses on the study of and care for the experiences, well-being, and mental health of LGBTQ+ people.
related: Mental health care for LGBTQ+ people
related: Therapies
issued: 2025-04-23
modified: 2025-04-23
type: Concept
in scheme: v4
change note: Version 4.1.0

LGBTQ+ people in arts and media
comment: Umbrella term for the depiction of LGBTQ+ people and communities in different forms of creative activity and cultural production, including literature, visual art, and popular media. Use more specific terms if possible.
broader: LGBTQ+ people
narrower: Lesbians in arts and media
narrower: Gay men in arts and media
narrower: Bisexual people in arts and media
narrower: Transgender people in arts and media
narrower: Queer people in arts and media
narrower: Intersex people in arts and media
narrower: Non-binary people in arts and media
narrower: LGBTQ+ people in visual art
narrower: LGBTQ+ people in mass media
narrower: LGBTQ+ people in literature
related: LGBTQ+ arts
related: Two-Spirit people in arts and media
has top concept: LGBTQ+ people
issued: 2025-04-23
modified: 2025-04-23
type: Concept
in scheme: v4
change note: Version 4.1.0

Lesbians in arts and media
comment: Umbrella term for the depiction of lesbians and lesbian communities in different forms of creative activity and cultural production, including literature, visual art, and popular media. Use more specific terms if possible.
broader: LGBTQ+ people in arts and media
has top concept: LGBTQ+ people
issued: 2025-04-23
modified: 2025-04-23
type: Concept
in scheme: v4
change note: Version 4.1.0

Gay men in arts and media
comment: Umbrella term for the depiction of gay men and communities in different forms of creative activity and cultural production, including literature, visual art, and popular media. Use more specific terms if possible.
broader: LGBTQ+ people in arts and media
has top concept: LGBTQ+ people
issued: 2025-04-23
modified: 2025-04-23
type: Concept
in scheme: v4
change note: Version 4.1.0

Bisexual people in arts and media
alternative label: Bi people in arts and media
comment: Umbrella term for the depiction of bisexual people and communities in different forms of creative activity and cultural production, including literature, visual art, and popular media. Use more specific terms if possible.
broader: LGBTQ+ people in arts and media
has top concept: LGBTQ+ people
issued: 2025-04-23
modified: 2025-04-23
type: Concept
in scheme: v4
change note: Version 4.1.0

Transgender people in arts and media
alternative label: Trans people in arts and media
comment: Umbrella term for the depiction of trans people and communities in different forms of creative activity and cultural production, including literature, visual art, and popular media. Use more specific terms if possible.
broader: LGBTQ+ people in arts and media
has top concept: LGBTQ+ people
issued: 2025-04-23
modified: 2025-04-23
type: Concept
in scheme: v4
change note: Version 4.1.0

Queer people in arts and media
comment: Umbrella term for the depiction of queer people and communities in different forms of creative activity and cultural production, including literature, visual art, and popular media. Use more specific terms if possible.
broader: LGBTQ+ people in arts and media
has top concept: LGBTQ+ people
issued: 2025-04-23
modified: 2025-04-23
type: Concept
in scheme: v4
change note: Version 4.1.0

Intersex people in arts and media
comment: Umbrella term for the depiction of intersex people and communities in different forms of creative activity and cultural production, including literature, visual art, and popular media. Use more specific terms if possible.
broader: LGBTQ+ people in arts and media
has top concept: LGBTQ+ people
issued: 2025-04-23
modified: 2025-04-23
type: Concept
in scheme: v4
change note: Version 4.1.0

Non-binary people in arts and media
alternative label: Nonbinary people in arts and media
comment: Umbrella term for the depiction of non-binary people and communities in different forms of creative activity and cultural production, including literature, visual art, and popular media. Use more specific terms if possible.
broader: LGBTQ+ people in arts and media
has top concept: LGBTQ+ people
issued: 2025-04-23
modified: 2025-04-23
type: Concept
in scheme: v4
change note: Version 4.1.0

Two-Spirit people in arts and media
alternative label: Two Spirit people in arts and media
alternative label: Two-Spirited people in arts and media
alternative label: Two Spirited people in arts and media
alternative label: 2S people in arts and media
comment: Umbrella term for the depiction of Two-Spirit people and communities in different forms of creative activity and cultural production, including literature, visual art, and popular media. Use more specific terms if possible.
broader: Two-Spirit people
narrower: Two-Spirit people in visual art
narrower: Two-Spirit people in literature
related: LGBTQ+ people in arts and media
has top concept: Gender
issued: 2025-04-23
modified: 2025-04-23
type: Concept
in scheme: v4
change note: Version 4.1.0

LGBTQ+ people in visual art
alternative label: LGBTQ+ people in art
comment: The depiction of LGBTQ+ people and communities in visual art, including painting, performance art, sculpture, photography, cinema, etc.
broader: LGBTQ+ people in arts and media
narrower: Lesbians in visual art
narrower: Gay men in visual art
narrower: Bisexual people in visual art
narrower: Transgender people in visual art
narrower: Queer people in visual art
narrower: Intersex people in visual art
narrower: Non-binary people in visual art
related: Two-Spirit people in visual art
has top concept: LGBTQ+ people
issued: 2025-04-23
modified: 2025-04-23
type: Concept
in scheme: v4
change note: Version 4.1.0

Lesbians in visual art
alternative label: Lesbians in art
comment: The depiction of lesbians and lesbian communities in visual art, including painting, performance art, sculpture, photography, cinema, etc.
broader: LGBTQ+ people in visual art
related: Lesbian art
has top concept: LGBTQ+ people
issued: 2025-04-23
modified: 2025-04-23
type: Concept
in scheme: v4
change note: Version 4.1.0

Gay men in visual art
alternative label: Gay men in art
comment: The depiction of gay men and gay communities in visual art, including painting, performance art, sculpture, photography, cinema, etc.
broader: LGBTQ+ people in visual art
related: Gay art
has top concept: LGBTQ+ people
issued: 2025-04-23
modified: 2025-04-23
type: Concept
in scheme: v4
change note: Version 4.1.0

Bisexual people in visual art
alternative label: Bi people in visual art
alternative label: Bisexual people in art
alternative label: Bi people in art
comment: The depiction of bisexual people and communities in visual art, including painting, performance art, sculpture, photography, cinema, etc.
broader: LGBTQ+ people in visual art
related: Bisexual art
has top concept: LGBTQ+ people
issued: 2025-04-23
modified: 2025-04-23
type: Concept
in scheme: v4
change note: Version 4.1.0

Transgender people in visual art
alternative label: Trans people in visual art
alternative label: Transgender people in art
alternative label: Trans people in art
comment: The depiction of trans people and communities in visual art, including painting, performance art, sculpture, photography, cinema, etc.
broader: LGBTQ+ people in visual art
related: Transgender art
has top concept: LGBTQ+ people
issued: 2025-04-23
modified: 2025-04-23
type: Concept
in scheme: v4
change note: Version 4.1.0

Queer people in visual art
alternative label: Queer people in art
comment: The depiction of queer people and communities in visual art, including painting, performance art, sculpture, photography, cinema, etc.
broader: LGBTQ+ people in visual art
related: Queer art
has top concept: LGBTQ+ people
issued: 2025-04-23
modified: 2025-04-23
type: Concept
in scheme: v4
change note: Version 4.1.0

Intersex people in visual art
alternative label: Intersex people in art
comment: The depiction of intersex people and communities in visual art, including painting, performance art, sculpture, photography, cinema, etc.
broader: LGBTQ+ people in visual art
related: Intersex art
has top concept: LGBTQ+ people
issued: 2025-04-23
modified: 2025-04-23
type: Concept
in scheme: v4
change note: Version 4.1.0

Non-binary people in visual art
alternative label: Nonbinary people in visual art
alternative label: Non-binary people in art
alternative label: Nonbinary people in art
comment: The depiction of non-binary people and communities in visual art, including painting, performance art, sculpture, photography, cinema, etc.
broader: LGBTQ+ people in visual art
has top concept: LGBTQ+ people
issued: 2025-04-23
modified: 2025-04-23
type: Concept
in scheme: v4
change note: Version 4.1.0

Two-Spirit people in visual art
alternative label: Two Spirit people in visual art
alternative label: Two-Spirited people in visual art
alternative label: Two Spirited people in visual art
alternative label: 2S people in visual art
alternative label: Two-Spirit people in art
comment: The depiction of Two-Spirit people and communities in visual art, including painting, performance art, sculpture, photography, cinema, etc.
broader: Two-Spirit people in arts and media
related: Two-Spirit art
related: LGBTQ+ people in visual art
has top concept: Gender
issued: 2025-04-23
modified: 2025-04-23
type: Concept
in scheme: v4
change note: Version 4.1.0

LGBTQ+ people in mass media
alternative label: LGBTQ+ people in media
comment: The depiction of LGBTQ+ people in various means of communication that reach large audiences simultaneously, including newspapers, television, radio, advertisements, and the internet.
broader: LGBTQ+ people in arts and media
narrower: Lesbians in mass media
narrower: Gay men in mass media
narrower: Bisexual people in mass media
narrower: Transgender people in mass media
narrower: Queer people in mass media
narrower: Intersex people in mass media
narrower: Non-binary people in mass media
related: LGBTQ+ celebrities
related: Two-Spirit people in mass media
has top concept: LGBTQ+ people
issued: 2025-04-23
modified: 2025-04-23
type: Concept
in scheme: v4
change note: Version 4.1.0

Lesbians in mass media
alternative label: Lesbians in media
comment: The depiction of lesbians in various means of communication that reach large audiences simultaneously, including newspapers, television, radio, advertisements, and the internet.
broader: LGBTQ+ people in mass media
related: Lesbian celebrities
has top concept: LGBTQ+ people
issued: 2025-04-23
modified: 2025-04-23
type: Concept
in scheme: v4
change note: Version 4.1.0

Gay men in mass media
alternative label: Gay men in media
comment: The depiction of gay men in various means of communication that reach large audiences simultaneously, including newspapers, television, radio, advertisements, and the internet.
broader: LGBTQ+ people in mass media
related: Gay celebrities
has top concept: LGBTQ+ people
issued: 2025-04-23
modified: 2025-04-23
type: Concept
in scheme: v4
change note: Version 4.1.0

Bisexual people in mass media
alternative label: Bi people in mass media
alternative label: Bisexual people in media
alternative label: Bi people in media
comment: The depiction of bisexual people in various means of communication that reach large audiences simultaneously, including newspapers, television, radio, advertisements, and the internet.
broader: LGBTQ+ people in mass media
related: Bisexual celebrities
has top concept: LGBTQ+ people
issued: 2025-04-23
modified: 2025-04-23
type: Concept
in scheme: v4
change note: Version 4.1.0

Transgender people in mass media
alternative label: Trans people in mass media
alternative label: Transgender people in media
alternative label: Trans people in media
comment: The depiction of trans people in various means of communication that reach large audiences simultaneously, including newspapers, television, radio, advertisements, and the internet.
broader: LGBTQ+ people in mass media
related: Transgender celebrities
has top concept: LGBTQ+ people
issued: 2025-04-23
modified: 2025-04-23
type: Concept
in scheme: v4
change note: Version 4.1.0

Queer people in mass media
alternative label: Queer people in media
comment: The depiction of queer people in various means of communication that reach large audiences simultaneously, including newspapers, television, radio, advertisements, and the internet.
broader: LGBTQ+ people in mass media
related: Queer celebrities
has top concept: LGBTQ+ people
issued: 2025-04-23
modified: 2025-04-23
type: Concept
in scheme: v4
change note: Version 4.1.0

Intersex people in mass media
alternative label: Intersex people in media
comment: The depiction of intersex people in various means of communication that reach large audiences simultaneously, including newspapers, television, radio, advertisements, and the internet.
broader: LGBTQ+ people in mass media
related: Intersex celebrities
has top concept: LGBTQ+ people
issued: 2025-04-23
modified: 2025-04-23
type: Concept
in scheme: v4
change note: Version 4.1.0

Non-binary people in mass media
alternative label: Nonbinary people in mass media
alternative label: Non-binary people in media
alternative label: Nobinary people in media
comment: The depiction of non-binary people in various means of communication that reach large audiences simultaneously, including newspapers, television, radio, advertisements, and the internet.
broader: LGBTQ+ people in mass media
related: Non-binary celebrities
has top concept: LGBTQ+ people
issued: 2025-04-23
modified: 2025-04-23
type: Concept
in scheme: v4
change note: Version 4.1.0

Two-Spirit people in mass media
alternative label: Two Spirit people in mass media
alternative label: Two-Spirited people in mass media
alternative label: Two Spirited people in mass media
alternative label: 2S people in mass media
alternative label: Two-Spirit people in media
comment: The depiction of Two-Spirit people in various means of communication that reach large audiences simultaneously, including newspapers, television, radio, advertisements, and the internet.
related: Two-Spirit celebrities
related: LGBTQ+ people in mass media
issued: 2025-04-23
modified: 2025-04-23
type: Concept
in scheme: v4
change note: Version 4.1.0

LGBTQ+ people in literature
comment: The depiction of LGBTQ+ people in literature.
broader: LGBTQ+ people in arts and media
narrower: Lesbians in literature
narrower: Gay men in literature
narrower: Bisexual people in literature
narrower: Transgender people in literature
narrower: Queer people in literature
narrower: Intersex people in literature
narrower: Non-binary people in literature
related: LGBTQ+ literature
related: Two-Spirit people in literature
has top concept: LGBTQ+ people
issued: 2025-04-23
modified: 2025-04-23
type: Concept
in scheme: v4
change note: Version 4.1.0

Lesbians in literature
comment: The depiction of lesbians in literature.
broader: LGBTQ+ people in literature
related: Lesbian literature
has top concept: LGBTQ+ people
issued: 2025-04-23
modified: 2025-04-23
type: Concept
in scheme: v4
change note: Version 4.1.0

Gay men in literature
comment: The depiction of gay men in literature.
broader: LGBTQ+ people in literature
related: Gay literature
has top concept: LGBTQ+ people
issued: 2025-04-23
modified: 2025-04-23
type: Concept
in scheme: v4
change note: Version 4.1.0

Bisexual people in literature
alternative label: Bi people in literature
comment: The depiction of bisexual people in literature.
broader: LGBTQ+ people in literature
related: Bisexual literature
has top concept: LGBTQ+ people
issued: 2025-04-23
modified: 2025-04-23
type: Concept
in scheme: v4
change note: Version 4.1.0

Transgender people in literature
alternative label: Trans people in literature
comment: The depiction of trans people in literature.
broader: LGBTQ+ people in literature
related: Transgender literature
has top concept: LGBTQ+ people
issued: 2025-04-23
modified: 2025-04-23
type: Concept
in scheme: v4
change note: Version 4.1.0

Queer people in literature
comment: The depiction of queer people in literature.
broader: LGBTQ+ people in literature
related: Queer literature
has top concept: LGBTQ+ people
issued: 2025-04-23
modified: 2025-04-23
type: Concept
in scheme: v4
change note: Version 4.1.0

Intersex people in literature
comment: The depiction of intersex people in literature.
broader: LGBTQ+ people in literature
related: Intersex literature
has top concept: LGBTQ+ people
issued: 2025-04-23
modified: 2025-04-23
type: Concept
in scheme: v4
change note: Version 4.1.0

Non-binary people in literature
alternative label: Nonbinary people in literature
comment: The depiction of non-binary people in literature.
broader: LGBTQ+ people in literature
has top concept: LGBTQ+ people
issued: 2025-04-23
modified: 2025-04-23
type: Concept
in scheme: v4
change note: Version 4.1.0

Two-Spirit people in literature
alternative label: Two Spirit people in literature
alternative label: Two-Spirited people in literature
alternative label: Two Spirited people in literature
alternative label: 2S people in literature
comment: The depiction of Two-Spirit people in literature.
broader: Two-Spirit people in arts and media
related: LGBTQ+ people in literature
related: Two-Spirit literature
has top concept: Gender
issued: 2025-04-23
modified: 2025-04-23
type: Concept
in scheme: v4
change note: Version 4.1.0

Ainu LGBTQ+ people
alternative label: LGBTQ+ Ainu people
alternative label: Ainu people (LGBTQ)
comment: LGBTQ+ people who belong to the Ainu, an Indigenous ethnic group that has historically resided in Ainu Mosir, or the land of the Ainu, in what is now known as Japan. Only use to refer to people who self-identify as Ainu.
broader: Indigenous LGBTQ+ people
narrower: Ainu lesbians
narrower: Ainu gay men
narrower: Ainu bisexual people
narrower: Ainu transgender people
narrower: Ainu queer people
narrower: Ainu intersex people
narrower: Ainu non-binary people
narrower: Ainu asexual people
has top concept: LGBTQ+ people
issued: 2025-04-24
modified: 2025-04-24
type: Concept
in scheme: v4
change note: Version 4.1.0

Ainu lesbians
alternative label: Lesbian Ainu people
comment: Lesbians who belong to the Ainu, an Indigenous ethnic group that has historically resided in Ainu Mosir, or the land of the Ainu, in what is now known as Japan. Only use to refer to people who self-identify as Ainu.
broader: Ainu LGBTQ+ people
has top concept: LGBTQ+ people
issued: 2025-04-24
modified: 2025-04-24
type: Concept
in scheme: v4
change note: Version 4.1.0

Ainu gay men
alternative label: Gay Ainu men
comment: Gay men who belong to the Ainu, an Indigenous ethnic group that has historically resided in Ainu Mosir, or the land of the Ainu, in what is now known as Japan. Only use to refer to people who self-identify as Ainu.
broader: Ainu LGBTQ+ people
has top concept: LGBTQ+ people
issued: 2025-04-24
modified: 2025-04-24
type: Concept
in scheme: v4
change note: Version 4.1.0

Ainu bisexual people
alternative label: Bisexual Ainu people
comment: Bisexual people who belong to the Ainu, an Indigenous ethnic group that has historically resided in Ainu Mosir, or the land of the Ainu, in what is now known as Japan. Only use to refer to people who self-identify as Ainu.
broader: Ainu LGBTQ+ people
has top concept: LGBTQ+ people
issued: 2025-04-24
modified: 2025-04-24
type: Concept
in scheme: v4
change note: Version 4.1.0

Ainu transgender people
alternative label: Transgender Ainu people
alternative label: Ainu trans people
alternative label: Trans Ainu people
comment: Trans people who belong to the Ainu, an Indigenous ethnic group that has historically resided in Ainu Mosir, or the land of the Ainu, in what is now known as Japan. Only use to refer to people who self-identify as Ainu.
broader: Ainu LGBTQ+ people
has top concept: LGBTQ+ people
issued: 2025-04-24
modified: 2025-04-24
type: Concept
in scheme: v4
change note: Version 4.1.0

Ainu queer people
alternative label: Queer Ainu people
comment: Queer people who belong to the Ainu, an Indigenous ethnic group that has historically resided in Ainu Mosir, or the land of the Ainu, in what is now known as Japan. Only use to refer to people who self-identify as Ainu.
broader: Ainu LGBTQ+ people
has top concept: LGBTQ+ people
issued: 2025-04-24
modified: 2025-04-24
type: Concept
in scheme: v4
change note: Version 4.1.0

Ainu intersex people
alternative label: Intersex Ainu people
comment: Intersex people who belong to the Ainu, an Indigenous ethnic group that has historically resided in Ainu Mosir, or the land of the Ainu, in what is now known as Japan. Only use to refer to people who self-identify as Ainu.
broader: Ainu LGBTQ+ people
has top concept: LGBTQ+ people
issued: 2025-04-24
modified: 2025-04-24
type: Concept
in scheme: v4
change note: Version 4.1.0

Ainu non-binary people
alternative label: Non-binary Ainu people
alternative label: Ainu nonbinary people
alternative label: Nonbinary Ainu people
comment: Non-binary people who belong to the Ainu, an Indigenous ethnic group that has historically resided in Ainu Mosir, or the land of the Ainu, in what is now known as Japan. Only use to refer to people who self-identify as Ainu.
broader: Ainu LGBTQ+ people
has top concept: LGBTQ+ people
issued: 2025-04-24
modified: 2025-04-24
type: Concept
in scheme: v4
change note: Version 4.1.0

Ainu asexual people
alternative label: Asexual Ainu people
comment: Asexual people who belong to the Ainu, an Indigenous ethnic group that has historically resided in Ainu Mosir, or the land of the Ainu, in what is now known as Japan. Only use to refer to people who self-identify as Ainu.
broader: Ainu LGBTQ+ people
has top concept: LGBTQ+ people
issued: 2025-04-24
modified: 2025-04-24
type: Concept
in scheme: v4
change note: Version 4.1.0

Ryukyuan LGBTQ+ people
alternative label: LGBTQ+ Ryukyuan people
alternative label: LGBTQ+ Ryukyuans
alternative label: Ryukyuan people (LGBTQ)
alternative label: Ryukyuans (LGBTQ)
alternative label: Ryūkyūan LGBTQ+ people
alternative label: LGBTQ+ Ryūkyūan people
alternative label: LGBTQ+ Ryūkyūans
alternative label: Ryūkyūan people (LGBTQ)
alternative label: Ryūkyūans (LGBTQ)
comment: LGBTQ+ people who belong to the Ryukyuan, an ethnic group indigenous to the Ryukyu archipelago in what is now known as Japan. Only use to refer to people who self-identify as Ryukyuan.
broader: Asian LGBTQ+ people
broader: Indigenous LGBTQ+ people
narrower: Ryukyuan lesbians
narrower: Ryukyuan gay men
narrower: Ryukyuan bisexual people
narrower: Ryukyuan transgender people
narrower: Ryukyuan queer people
narrower: Ryukyuan intersex people
narrower: Ryukyuan non-binary people
narrower: Ryukyuan asexual people
has top concept: LGBTQ+ people
issued: 2025-04-24
modified: 2025-04-24
type: Concept
in scheme: v4
change note: Version 4.1.0

Ryukyuan lesbians
alternative label: Lesbian Ryukyuan people
alternative label: Lesbian Ryukyuans
alternative label: Ryūkyūan lesbians
alternative label: Lesbian Ryūkyūan people
alternative label: Lesbian Ryūkyūans
comment: Lesbians who belong to the Ryukyuan, an ethnic group indigenous to the Ryukyu archipelago in what is now known as Japan. Only use to refer to people who self-identify as Ryukyuan.
broader: Ryukyuan LGBTQ+ people
has top concept: LGBTQ+ people
issued: 2025-04-24
modified: 2025-04-24
type: Concept
in scheme: v4
change note: Version 4.1.0

Ryukyuan gay men
alternative label: Gay Ryukyuan men
alternative label: Gay Ryukyuans
alternative label: Ryūkyūan gay men
alternative label: Gay Ryūkyūan men
alternative label: Gay Ryūkyūans
comment: Gay men who belong to the Ryukyuan, an ethnic group indigenous to the Ryukyu archipelago in what is now known as Japan. Only use to refer to people who self-identify as Ryukyuan.
broader: Ryukyuan LGBTQ+ people
has top concept: LGBTQ+ people
issued: 2025-04-24
modified: 2025-04-24
type: Concept
in scheme: v4
change note: Version 4.1.0

Ryukyuan bisexual people
alternative label: Bisexual Ryukyuan people
alternative label: Bisexual Ryukyuans
alternative label: Ryūkyūan bisexual people
alternative label: Bisexual Ryūkyūan people
alternative label: Bisexual Ryūkyūans
comment: Bisexual people who belong to the Ryukyuan, an ethnic group indigenous to the Ryukyu archipelago in what is now known as Japan. Only use to refer to people who self-identify as Ryukyuan.
broader: Ryukyuan LGBTQ+ people
has top concept: LGBTQ+ people
issued: 2025-04-24
modified: 2025-04-24
type: Concept
in scheme: v4
change note: Version 4.1.0

Ryukyuan transgender people
alternative label: Transgender Ryukyuan people
alternative label: Transgender Ryukyuans
alternative label: Ryūkyūan transgender people
alternative label: Transgender Ryūkyūan people
alternative label: Transgender Ryūkyūans
alternative label: Ryukyuan trans people
alternative label: Trans Ryukyuan people
alternative label: Trans Ryukyans
alternative label: Ryūkyūan trans people
alternative label: Trans Ryūkyūan people
alternative label: Trans Ryūkyūans
comment: Trans people who belong to the Ryukyuan, an ethnic group indigenous to the Ryukyu archipelago in what is now known as Japan. Only use to refer to people who self-identify as Ryukyuan.
broader: Ryukyuan LGBTQ+ people
has top concept: LGBTQ+ people
issued: 2025-04-24
modified: 2025-04-24
type: Concept
in scheme: v4
change note: Version 4.1.0

Ryukyuan queer people
alternative label: Queer Ryukyuan people
alternative label: Queer Ryukyuans
alternative label: Ryūkyūan queer people
alternative label: Queer Ryūkyūan people
alternative label: Queer Ryūkyūans
comment: Queer people who belong to the Ryukyuan, an ethnic group indigenous to the Ryukyu archipelago in what is now known as Japan. Only use to refer to people who self-identify as Ryukyuan.
broader: Ryukyuan LGBTQ+ people
has top concept: LGBTQ+ people
issued: 2025-04-24
modified: 2025-04-24
type: Concept
in scheme: v4
change note: Version 4.1.0

Ryukyuan intersex people
alternative label: Intersex Ryukyuan people
alternative label: Intersex Ryukyuans
alternative label: Ryūkyūan intersex people
alternative label: Intersex Ryūkyūan people
alternative label: Intersex Ryūkyūans
comment: Intersex people who belong to the Ryukyuan, an ethnic group indigenous to the Ryukyu archipelago in what is now known as Japan. Only use to refer to people who self-identify as Ryukyuan.
broader: Ryukyuan LGBTQ+ people
has top concept: LGBTQ+ people
issued: 2025-04-24
modified: 2025-04-24
type: Concept
in scheme: v4
change note: Version 4.1.0

Ryukyuan non-binary people
alternative label: Non-binary Ryukyuan people
alternative label: Non-binary Ryukyuans
alternative label: Ryūkyūan non-binary people
alternative label: Non-binary Ryūkyūan people
alternative label: Non-binary Ryūkyūans
alternative label: Ryukyuan nonbinary people
alternative label: Nonbinary Ryukyuan people
alternative label: Nonbinary Ryukyans
alternative label: Ryūkyūan nonbinary people
alternative label: Nonbinary Ryūkyūan people
alternative label: Nonbinary Ryūkyūans
comment: Non-binary people who belong to the Ryukyuan, an ethnic group indigenous to the Ryukyu archipelago in what is now known as Japan. Only use to refer to people who self-identify as Ryukyuan.
broader: Ryukyuan LGBTQ+ people
has top concept: LGBTQ+ people
issued: 2025-04-24
modified: 2025-04-24
type: Concept
in scheme: v4
change note: Version 4.1.0

Ryukyuan asexual people
alternative label: Asexual Ryukyuan people
alternative label: Asexual Ryukyuans
alternative label: Ryūkyūan asexual people
alternative label: Asexual Ryūkyūan people
alternative label: Asexual Ryūkyūans
comment: Asexual people who belong to the Ryukyuan, an ethnic group indigenous to the Ryukyu archipelago in what is now known as Japan. Only use to refer to people who self-identify as Ryukyuan.
broader: Ryukyuan LGBTQ+ people
has top concept: LGBTQ+ people
issued: 2025-04-24
modified: 2025-04-24
type: Concept
in scheme: v4
change note: Version 4.1.0

Sámi LGBTQ+ people
alternative label: LGBTQ+ Sámi people
alternative label: LGBTQ+ Sámis
alternative label: Sámi people (LGBTQ)
comment: LGBTQ+ people who belong to the traditionally Sámi-speaking Indigenous people of the Sápmi, which encompasses large parts of the regions now known as Norway, Sweden, Finland, and of the Kola Peninsula in Russia. Only use to refer to people who self-identify as Sámi.
broader: LGBTQ+ people of shared ethnic or national identities
broader: Indigenous LGBTQ+ people
narrower: Sámi asexual people
narrower: Sámi bisexual people
narrower: Sámi gay men
narrower: Sámi lesbians
narrower: Sámi intersex people
narrower: Sámi non-binary people
narrower: Sámi queer people
narrower: Sámi transgender people
has top concept: LGBTQ+ people
issued: 2025-04-24
modified: 2025-04-24
type: Concept
in scheme: v4
change note: Version 4.1.0

Sámi asexual people
alternative label: Asexual Sámi people
alternative label: Asexual Sámis
comment: Asexual people who belong to the traditionally Sámi-speaking Indigenous people of the Sápmi, which encompasses large parts of the regions now known as Norway, Sweden, Finland, and of the Kola Peninsula in Russia. Only use to refer to people who self-identify as Sámi.
broader: Sámi LGBTQ+ people
has top concept: LGBTQ+ people
issued: 2025-04-24
modified: 2025-04-24
type: Concept
in scheme: v4
change note: Version 4.1.0

Sámi bisexual people
alternative label: Bisexual Sámi people
alternative label: Bisexual Sámis
comment: Bisexual people who belong to the traditionally Sámi-speaking Indigenous people of the Sápmi, which encompasses large parts of the regions now known as Norway, Sweden, Finland, and of the Kola Peninsula in Russia. Only use to refer to people who self-identify as Sámi.
broader: Sámi LGBTQ+ people
has top concept: LGBTQ+ people
issued: 2025-04-24
modified: 2025-04-24
type: Concept
in scheme: v4
change note: Version 4.1.0

Sámi gay men
alternative label: Gay Sámi men
alternative label: Gay Sámis
comment: Gay men who belong to the traditionally Sámi-speaking Indigenous people of the Sápmi, which encompasses large parts of the regions now known as Norway, Sweden, Finland, and of the Kola Peninsula in Russia. Only use to refer to people who self-identify as Sámi.
broader: Sámi LGBTQ+ people
has top concept: LGBTQ+ people
issued: 2025-04-24
modified: 2025-04-24
type: Concept
in scheme: v4
change note: Version 4.1.0

Sámi lesbians
alternative label: Lesbian Sámi people
alternative label: Lesbian Sámis
comment: Lesbians who belong to the traditionally Sámi-speaking Indigenous people of the Sápmi, which encompasses large parts of the regions now known as Norway, Sweden, Finland, and of the Kola Peninsula in Russia. Only use to refer to people who self-identify as Sámi.
broader: Sámi LGBTQ+ people
has top concept: LGBTQ+ people
issued: 2025-04-24
modified: 2025-04-24
type: Concept
in scheme: v4
change note: Version 4.1.0

Sámi intersex people
alternative label: Intersex Sámi people
alternative label: Intersex Sámis
comment: Intersex people who belong to the traditionally Sámi-speaking Indigenous people of the Sápmi, which encompasses large parts of the regions now known as Norway, Sweden, Finland, and of the Kola Peninsula in Russia. Only use to refer to people who self-identify as Sámi.
broader: Sámi LGBTQ+ people
has top concept: LGBTQ+ people
issued: 2025-04-24
modified: 2025-04-24
type: Concept
in scheme: v4
change note: Version 4.1.0

Sámi non-binary people
alternative label: Non-binary Sámi people
alternative label: Nonbinary Sámi people
alternative label: Non-binary Sámis
alternative label: Nonbinary Sámis
comment: Non-binary people who belong to the traditionally Sámi-speaking Indigenous people of the Sápmi, which encompasses large parts of the regions now known as Norway, Sweden, Finland, and of the Kola Peninsula in Russia. Only use to refer to people who self-identify as Sámi.
broader: Sámi LGBTQ+ people
has top concept: LGBTQ+ people
issued: 2025-04-24
modified: 2025-04-24
type: Concept
in scheme: v4
change note: Version 4.1.0

Sámi queer people
alternative label: Queer Sámi people
alternative label: Queer Sámis
comment: Queer people who belong to the traditionally Sámi-speaking Indigenous people of the Sápmi, which encompasses large parts of the regions now known as Norway, Sweden, Finland, and of the Kola Peninsula in Russia. Only use to refer to people who self-identify as Sámi.
broader: Sámi LGBTQ+ people
has top concept: LGBTQ+ people
issued: 2025-04-24
modified: 2025-04-24
type: Concept
in scheme: v4
change note: Version 4.1.0

Sámi transgender people
alternative label: Transgender Sámi people
alternative label: Transgender Sámis
alternative label: Trans Sámi people
alternative label: Trans Sámis
alternative label: Sámi trans people
comment: Trans people who belong to the traditionally Sámi-speaking Indigenous people of the Sápmi, which encompasses large parts of the regions now known as Norway, Sweden, Finland, and of the Kola Peninsula in Russia. Only use to refer to people who self-identify as Sámi.
broader: Sámi LGBTQ+ people
has top concept: LGBTQ+ people
issued: 2025-04-24
modified: 2025-04-24
type: Concept
in scheme: v4
change note: Version 4.1.0

Two-Spirit people who use substances
alternative label: Two-Spirit substance users
alternative label: Two-Spirit drug users
alternative label: Two-Spirit drinkers
alternative label: Two Spirit people who use substances
alternative label: Two-Spirited people who use substances
alternative label: Two Spirited people who use substances
alternative label: 2S people who use substances
comment: Umbrella term for Two-Spirit people who use substances (that are typically deemed harmful or are subject to legal restriction, such as drugs and alcohol) for any reason. Apply more specific terms if possible.
broader: Two-Spirit people
narrower: Two-Spirit people who use substances for medical purposes
narrower: Two-Spirit people who use substances for recreational purposes
narrower: Two-Spirit people with addictions
narrower: Two-Spirit people with alcohol use disorders
narrower: Two-Spirit people with substance use disorders
related: LGBTQ+ people who use substances
has top concept: Gender
issued: 2025-04-24
modified: 2025-04-24
type: Concept
in scheme: v4
change note: Version 4.1.0

Two-Spirit people who use substances for medical purposes
alternative label: Two Spirit people who use substances for medical purposes
alternative label: Two-Spirited people who use substances for medical purposes
alternative label: Two Spirited people who use substances for medical purposes
alternative label: 2S people who use substances for medical purposes
comment: Two-Spirit people who use substances (that are typically deemed harmful or are subject to legal restriction, such as drugs and alcohol) in order to manage pain and other symptoms related to a medical condition or disability.
broader: Two-Spirit people who use substances
related: LGBTQ+ people who use substances for medical purposes
related: Two-Spirit disabled people
related: Two-Spirit people with chronic illnesses
has top concept: Gender
issued: 2025-04-24
modified: 2025-04-24
type: Concept
in scheme: v4
change note: Version 4.1.0

Two-Spirit people who use substances for recreational purposes
alternative label: Two Spirit people who use substances for recreational purposes
alternative label: Two-Spirited people who use substances for recreational purposes
alternative label: Two Spirited people who use substances for recreational purposes
alternative label: 2S people who use substances for recreational purposes
comment: Two-Spirit people who use substances (that are typically deemed harmful or are subject to legal restriction, such as drugs and alcohol) for recreational or social purposes.
broader: Two-Spirit people who use substances
related: Chemsex
related: Party drugs
has top concept: Gender
issued: 2025-04-24
modified: 2025-04-24
type: Concept
in scheme: v4
change note: Version 4.1.0

Two-Spirit people with addictions
alternative label: Two-Spirit addicts
alternative label: Two Spirit people with addictions
alternative label: Two-Spirited people with addictions
alternative label: Two Spirited people with addictions
alternative label: 2S people with addictions
comment: Umbrella term for Two-Spirit people experiencing addictions, dependencies, or use disorders of some kind. Only use to refer to individuals who describe themselves as having addictions. Apply more specific terms if possible.
broader: Two-Spirit people
broader: Two-Spirit people who use substances
narrower: Two-Spirit people with alcohol use disorders
narrower: Two-Spirit people with substance use disorders
related: LGBTQ+ people with addictions
has top concept: Gender
issued: 2025-04-24
modified: 2025-04-24
type: Concept
in scheme: v4
change note: Version 4.1.0

Two-Spirit people with alcohol use disorders
alternative label: Two-Spirit alcoholics
alternative label: Two-Spirit people with alcoholism
alternative label: Two Spirit people with alcohol use disorders
alternative label: Two-Spirited people with alcohol use disorders
alternative label: Two Spirited people with alcohol use disorders
alternative label: 2S people with alcohol use disorders
comment: Two-Spirit people who have been diagnosed with or regard themselves as having an alcohol use disorder, a medical condition that involves a pattern of alcohol use that is difficult to control, negatively impacts the individual's life, and results in withdrawal symptoms upon cessation. Only use to refer to individuals who describe themselves as having an alcohol use disorder. Follow the individual's preference for "use disorder" or "addiction" whenever possible.
broader: Two-Spirit people who use substances
broader: Two-Spirit people with addictions
related: Alcoholics
has top concept: Gender
issued: 2025-04-24
modified: 2025-04-24
type: Concept
in scheme: v4
change note: Version 4.1.0

Two-Spirit people with substance use disorders
alternative label: Two-Spirit people with substance issues
alternative label: Two Spirit people with substance use disorders
alternative label: Two-Spirited people with substance use disorders
alternative label: Two Spirited people with substance use disorders
alternative label: 2S people with alcohol substance disorders
comment: Two-Spirit people who have been diagnosed with or regard themselves as having a substance use disorder, a medical condition that involves a pattern of substance use that is difficult to control, negatively impacts the individual's life, and results in withdrawal symptoms upon cessation. Only use to refer to individuals who describe themselves as having a substance use disorder. Follow the individual's preference for "use disorder" or "addiction" whenever possible.
broader: Two-Spirit people who use substances
broader: Two-Spirit people with addictions
related: Substance abuse
has top concept: Gender
issued: 2025-04-24
modified: 2025-04-24
type: Concept
in scheme: v4
change note: Version 4.1.0

Two-Spirit people practicing sobriety
alternative label: Two-Spirit sober people
alternative label: Two Spirit people practicing sobriety
alternative label: Two-Spirited people practicing sobriety
alternative label: Two Spirited people practicing sobriety
alternative label: 2S people practicing sobriety
comment: Two-Spirit people intentionally refraining from substance use (typically drugs or alcohol). Follow the individual's preference for "sobriety" or "recovery" whenever possible.
broader: Two-Spirit people
related: Sobriety
has top concept: Gender
issued: 2025-04-24
modified: 2025-04-24
type: Concept
in scheme: v4
change note: Version 4.1.0

Two-Spirit people in recovery
alternative label: Two Spirit people in recovery
alternative label: Two-Spirited people in recovery
alternative label: Two Spirited people in recovery
alternative label: 2S people practicing in recovery
comment: Two-Spirit people currently in recovery from use disorders, conditions, or addictions. Follow the individual's preference for "recovery" or "sobriety" whenever possible.
broader: Two-Spirit people
related: LGBTQ+ people in recovery
has top concept: Gender
issued: 2025-04-24
modified: 2025-04-24
type: Concept
in scheme: v4
change note: Version 4.1.0

Two-Spirit people in recovery groups
alternative label: Two Spirit people in recovery groups
alternative label: Two-Spirited people in recovery groups
alternative label: Two Spirited people in recovery groups
alternative label: 2S people practicing in recovery groups
comment: Two-Spirit people who are members of recovery groups, or voluntary associations of people in recovery from use disorders, conditions, or addictions.
broader: Two-Spirit people
related: LGBTQ+ people in Adult Children of Alcoholics
has top concept: Gender
issued: 2025-04-24
modified: 2025-04-24
type: Concept
in scheme: v4
change note: Version 4.1.0

Sexual studies
comment: An interdisciplinary field that studies the social, cultural, and historical dimensions of sex and sexuality.
related: Sexology
related: Sexuality
issued: 2025-04-24
modified: 2026-02-24
type: Concept
in scheme: v4
change note: Version 4.1.0

Social work with LGBTQ+ youth
preferred label: eng
alternative label: LGBTQ+ youth social work
alternative label: Social work for LGBTQ+ youth
comment: Work carried out between trained professionals and LGBTQ+ youth, involving providing affirming, supportive, and culturally competent services to address their unique needs and experiences. This includes supporting their emotional, mental, and physical well-being, as well as advocating for their rights and needs within various systems, including schools, families, and communities.
related: LGBTQ+ youth
related: LGBTQ+ youth centers
related: LGBTQ+ youth survivors of bullying
related: LGBTQ+ youth victims of bullying
issued: 2025-04-29
modified: 2025-04-29
type: Concept
in scheme: v4
change note: Version 4.1.0